{"text_format":"1","workbook":"xlsx","n_sheets":18,"sheets":["Caratula Resumen","A Y  II D3","A Y II D4","B)","II B) Y 1","II C y 1_","II D) 2","II D) 4","II D) 4 A","II D) 6","II D) 7 1","II D) 7 2 ","II D) 7 3","E)","F) 1","F) 2","G)","Listas"],"not_rendered":{"charts":0,"images":16,"macros":1,"external_links":0,"defined_names":17,"comments":16,"pivot_tables":0},"unopened":[],"bounds":{"document_bytes":16777216,"sheet_cells":100000,"rows_first":2000,"rows_last":500,"rows_between":2000,"halvings":0,"cell_chars":16384,"cell_head_chars":4096},"cells_cut":0,"cells_raw":0,"read":"whole","date_system":"1900"}

{"sheet":"Caratula Resumen","index":0,"n_rows":73,"n_cols":18,"rows_kept":73,"cut":false,"hidden":false,"merged":[[36,3,36,6],[10,3,10,18],[11,3,11,18],[12,3,12,18],[34,3,34,6],[35,3,35,6],[46,3,46,6],[47,3,47,6],[48,3,48,6],[37,3,37,6],[38,3,38,6],[39,3,39,6],[40,3,40,6],[41,3,41,6],[42,3,42,6],[69,2,69,5],[71,2,71,5],[72,2,72,5],[73,2,73,5],[20,3,20,14],[21,3,21,14],[22,3,22,14],[49,3,49,6],[62,2,62,5],[63,2,63,5],[65,2,65,5],[66,2,66,5],[68,2,68,5],[43,3,43,6],[44,3,44,6],[45,3,45,6]]}
[]
[]
[]
[]
[]
[]
[]
[]
[]
[]
[]
[null,null,null,"FORMATOS ENTREGADOS PARA DAR CUMPLIMIENTO AL ARTICULO 73 DE \"LA LEY GENERAL DE CONTABILIDAD GUBERNAMENTAL\""]
[]
[]
[]
[]
[]
[]
[]
[]
[null,null,"Entidad Federativa :"," GUANAJUATO "]
[null,null,"Fondo :","Fondo de Aportaciones para la Educación Tecnológica y de Adultos/Colegio Nacional de Educación Profesional Técnica (FAETA/CONALEP)"]
[null,null,"Periodo :","1er. Trimestre"]
[]
[]
[]
[]
[]
[]
[]
[]
[null,null,null,null,null,null,null,"TOTAL REGISTROS ",null,"Num. de Paginas",null,"TOTAL PERSONAS",null,"TOTAL PLAZAS",null,"Total Pto. Federal",null,"Total Ppto. Otras Fuentes"]
[]
[]
[null,1,"A Y II D3","Personal Comisionado",null,null,null,28,null,2,null,28,null,28,null,2175076.4999999995,null,0]
[null,2,"A Y II D4","Personal con Licencia",null,null,null,30,null,1,null,30,null,30,null,430166.92999999993,null,0]
[null,3,"B)   ","Registro Federal de Contribuyentes de Trabajadores con Pagos Retroactivos con un Periodo Mayor a 45 días",null,null,null,0,null,1,null,0,null,0,null,"N/A",null,"N/A"]
[null,4,"II B) Y 1","Plaza / Función",null,null,null,903,null,18,null,903,null,"N/A",null,"N/A",null,"N/A"]
[null,5,"II C y 1_","Personal Federalizado por Registro Federal de Contribuyentes",null,null,null,903,null,21,null,903,null,903,null,30807566.879999965,null,0]
[null,6,"II D) 2","Movimientos de Plazas",null,null,null,0,null,1,null,0,0,0,null,"N/A",null,"N/A"]
[null,7,"II D) 4","Trabajadores Jubilados en el Periodo",null,null,null,6,null,1,null,6,6,6,null,"N/A",null,"N/A"]
[null,8,"II D) 4 A","Trabajadores que Tramitaron Licencia Prejubilatoria en el Periodo",null,null,null,2,null,1,null,2,null,2,null,76284.899999999994,null,0]
[null,9,"II D) 6","Trabajadores Contratados por Honorarios en el Periodo",null,null,null,0,null,1,null,0,null,"N/A",null,"N/A",null,"N/A"]
[null,10,"II D) 7 1 ","Analítico de Categorías / Plazas Autorizadas con su Tabulador",null,null,null,30,null,1,null,"N/A",null,"N/A",null,"N/A",null,"N/A"]
[null,11,"II D) 7 2 ","Catálogo de Categorías y Tabuladores",null,null,null,30,null,2,null,"N/A",null,"N/A",null,"N/A",null,"N/A"]
[null,12,"II D) 7 3 ","Catálogo de Percepciones y Deducciones",null,null,null,68,null,3,null,"N/A",null,"N/A",null,"N/A",null,"N/A"]
[null,13,"E)","Trabajadores que Cobran con RFC / CURP con Formato Incorrecto",null,null,null,0,null,1,null,0,null,"N/A",null,"N/A",null,"N/A"]
[null,14,"F) 1","Trabajadores con Doble Asignación Salarial en Municipios no Colindantes Geográficamente",null,null,null,0,null,1,null,0,null,"N/A",null,"N/A",null,"N/A"]
[null,15,"F) 2","Trabajadores Ocupando Plazas que Superan el Número de Horas de Compatibilidad Autorizadas",null,null,null,0,null,1,null,0,null,0,null,"N/A",null,"N/A"]
[null,16,"G)","Trabajadores Cuyo Salario Básico Supere los Ingresos Promedio de un Docente en la Categoría más Alta del Tabulador Salarial Correspondiente a Cada Entidad",null,null,null,0,null,1,null,0,null,"N/A",null,"N/A",null,"N/A"]
[]
[]
[]
[]
[]
[]
[]
[]
[]
[]
[]
[]
[null,null,"M. EN C. GUILLERMO ARIAS GUZMÁN"]
[null,null,"Nombre del  Responsable"]
[]
[null,null,"DIRECTOR DE ADMINISTRACIÓN"]
[null,null,"Cargo"]
[]
[]
[null,null,"Firma"]
[]
[null,null,"2015-04-20"]
[null,null,"Fecha"]

{"sheet":"A Y  II D3","index":1,"n_rows":50,"n_cols":25,"rows_kept":50,"cut":false,"hidden":false,"merged":[[46,12,46,14],[12,24,13,24],[12,13,12,14],[12,15,13,15],[12,16,13,16],[12,17,13,17],[12,18,12,19],[12,20,13,20],[44,13,44,14],[12,21,13,21],[12,22,13,22],[12,23,13,23],[9,1,9,7],[12,6,12,12],[12,1,13,1],[12,2,13,2],[12,3,13,3],[12,4,13,4],[12,5,13,5]]}
[]
[]
[]
[]
[]
[]
[]
[]
[null,"Formato: Personal Comisionado"]
[null,{"$f":"IF('Caratula Resumen'!D22=\"Elige el Periodo…\",\"\",'Caratula Resumen'!D22)","v":"Fondo de Aportaciones para la Educación Tecnológica y de Adultos/Colegio Nacional de Educación Profesional Técnica (FAETA/CONALEP)"},null,null,null,null,null,null,null,null,null,null,null,null,null,null,null,null,null,null,null,null,null,{"$f":"IF('Caratula Resumen'!D23=\"Elige el Periodo…\",\"\",'Caratula Resumen'!D23)","v":"1er. Trimestre"}]
[]
[]
[null,"Entidad Federativa","R.F.C.","CURP","Nombre","Clave integrada","Clave Presupuestal",null,null,null,null,null,null,"Fecha Comisión",null,"Percepciones pagadas en el Periodo de Comisión con Presupuesto Federal*","Percepciones pagadas en el Periodo de Comisión con Presupuesto de otra fuente*","Clave CT Origen","CT Destino dentro del sector",null,"Lugar de la comisión fuera del sector educativo","Tipo de Comisión","Función Específica","Objeto de la comision","No. Oficio"]
[null,null,null,null,null,null,"Partida Presupuestal","Código de Pago","Clave de Unidad","Clave de Sub Unidad","Clave de Categoría","Horas Semana Mes ","Número de Plaza","Inicio","Conclusión",null,null,null,"Clave","Turno"]
[]
[null,"Entidad Federativa","R.F.C.","CURP","Nombre","Clave integrada","Partida Presupuestal","Código de Pago","Clave de Unidad","Clave de Sub Unidad","Clave de Categoría","Horas Semana Mes ","Número de Plaza","Fecha Comisión\nInicio","Fecha Comisión\nConclusión","Percepciones pagadas en el Periodo de Comisión con Presupuesto Federal*","Percepciones pagadas en el Periodo de Comisión con Presupuesto de otra fuente*","Clave CT Origen","Clave","Turno","Lugar de la comisión fuera del sector educativo","Tipo de Comisión","Función Específica","Objeto de la comision","No. Oficio"]
[null,"GUANAJUATO","CAPE530526869","CAPE530526MGTRRL07  ","M ELENA CARDIEL PEREZ","1130100302030CF3320400.09174",1130,1003,"02","03","0CF33204","00.0",9174,20080801,20151231,84090.930000000008,0,"11DPT0007K","11APT0001T",100,"DIRECCIÓN GENERAL","C","COLABORAR CON LOS PROYECTOS RELACIONADOS AL AREA DE ADMINISTRACIÓN Y FINANZAS","COLABORAR CON LOS PROYECTOS RELACIONADOS AL AREA DE ADMINISTRACIÓN Y FINANZAS",7302008]
[null,"GUANAJUATO","CUAC760716LS6","CUAC760716HGTVCR00","JOSE CARMEN NOE CUAEVAS ACOSTA","11301003230CF02105 00.012840",1130,1003,2,3,"0CF02105 ","00.0",12840,20130116,20151231,81406.77,0,"11DPT0007K","11FPT0001O",120,"DIRECCION GENERAL CONALEP","C","COORDINADOR DE SERVICIOS ESCOLARES","COORDINA LOS PROCESOS ESCOLARES Y EXTRACURRICULARES DE ALUMNOS.","550/2013"]
[null,"GUANAJUATO","RAAE850827HM7","RAAE850827MGTMNL05","ELVIA RAMÍREZ ANDRADE","11301003020300S0120100.09183",1130,1003,"02","03","00S01201","00.0",9183,20120901,20151231,42154.42,0,"11DPT0007K","11DPT0014U",100,"PLANTEL SAN FELIPE","C","APOYO EN SERVICIOS ESCOLARES","APOYAR EN LOS PROCESOS RELACIONADOS AL CONTROL ESCOLAR ","1545/2012"]
[null,"GUANAJUATO","PAGA670111I35","PAGA670111HNTLRR03","ARMANDO PALOMARES GARCIA ","1130100303020CF3320600.013320",1130,1003,"03","02","0CF33206","00.0",13320,"20130301",20151231,196224.48,0,"11DPT0013V","11APT0001T",100,"DIRECCIÓN GENERAL","C","COLABORAR CON LOS PROYECTOS RELACIONADOS AL AREA DE ADMINISTRACIÓN Y FINANZAS","COLABORAR CON LOS PROYECTOS RELACIONADOS AL AREA DE ADMINISTRACIÓN Y FINANZAS","549/2013"]
[null,"GUANAJUATO","ROMR861218274","ROMR861218HGTDGC00","RICARDO RODRÍGUEZ MAGDALENO","1130100303020CF3320600.018849",1130,1003,"03","02","0CF33206","00.0",18849,"20141117",20151231,131701.56,0,"11DPT0013V","11APT0001T",100,"DIRECCIÓN GENERAL","C","COLABORAR CON LOS PROYECTOS RELACIONADOS CON EL ÁREA DE FORMACIÓN TÉCNICA DE LA DIRECCIÓN GRAL.","COLABORAR CON LOS PROYECTOS RELACIONADOS CON EL ÁREA DE FORMACIÓN TÉCNICA DE LA DIRECCIÓN GRAL.","1618/2014"]
[null,"GUANAJUATO","AAMD810413AX8","AAMD810413MGTNRN03","DIANA LORENA ANAYA MARTINEZ","1130100307050CF0420100.011092",1130,1003,"07","05","0CF04201","00.0",11092,20080901,20151231,39003.949999999997,0,"11APT0001T","11DPT0003O",100,"PLANTEL LEON I","C","ATENCION A CLIENTES AL LABORATORIO","CAMBIO DE LABORATORIO","01092008"]
[null,"GUANAJUATO","EIPA861113S53","EIPA861113HGTSRB08","JOSE ABRAHAM ESPINOZA PORRAS","1130100307050CF3420200.05581",1130,1003,"07","05","0CF34202","00.0",5581,20080601,20151231,35201.94,0,"11APT0001T","11APT0001T",100,"DIRECCION GENERAL","C","AREA DE ACADEMICOS","APOYO AL AREA POR FALTA DE PERSONAL","01062008"]
[null,"GUANAJUATO","GONM790924B46","GONM790924HGTNVG00","MIGUEL ANGEL GONZALEZ NAVARRO","1130100307050CF3320400.02578",1130,1003,"07","05","0CF33204","00.0",2578,20080417,20151231,72284.2,0,"11APT0001T","11DPT0003O",100,"PLANTEL LEON I","C","RESPONSABLE DE LABORATORIO","CAMBIO DE LABORATORIO",17042008]
[null,"GUANAJUATO","GUJE870107661","GUJE870107MGTTUL01","ELIZABETH VERONICA GUTIERREZ JUAREZ","1130100307050CF3320400.02546",1130,1003,"07","05","0CF33204","00.0",2546,20090601,20151231,65494.65,0,"11APT0001T","11APT0001T",100,"DIRECCION GENERAL","C","AREA DE PLANEACION","APOYO AL AREA POR FALTA DE PERSONAL","01062009"]
[null,"GUANAJUATO","RAMA640606AQ0","RAMA640606HGTNXL06","ALBERTO RANGEL MUÑOZ","1130100307050ED0120100.02619",1130,1003,"07","05","0ED01201","00.0",2619,20080417,20151231,41580.76,0,"11APT0001T","11DPT0003O",100,"PLANTEL LEON I","C","APOYO LAB. DE PRUEBAS FISICAS","CAMBIO DE LABORATORIO",17042008]
[null,"GUANAJUATO","MANR8209073S1","MANT820907HGTCGT04","RITO MACIAS NEGRETE","1130100307050CF0160100.011035",1130,1003,"07","05","0CF01601","00.0",11035,20090901,20151231,94111.31,0,"11APT0001T","11APT0001T",100,"DIRECCION GENERAL","C","APOYO AL AREA DE PLANEACION","APOYO AL AREA POR FALTA DE PERSONAL","01092010"]
[null,"GUANAJUATO","PESE6410262J8","PESE641026HTSRNR02","ERNESTO PEREZ SANCHEZ","1130100307050CF0160100.011098",1130,1003,"07","05","0CF01601","00.0",11098,20061001,20151231,94111.31,0,"11APT0001T","11APT0001T",100,"DIRECCION GENERAL","C","APOYO AL AREA DE PLANEACION","APOYO AL AREA POR FALTA DE PERSONAL",822013]
[null,"GUANAJUATO","VARG660927MXA","VARG660927MDFLSL01","GLORIA  GUADALUPE VALENZUELA RIOS","11301003070500CF160100.013322",1130,1003,"07","05","00CF1601","00.0",13322,20130201,20151231,94111.31,0,"11APT0001T","11APT0001T",100,"DIRECCION GENERAL","C","EN EL AREA DE PROMOCION Y VINCULACION","APOYO AL AREA POR FALTA DE PERSONAL","1565/2013"]
[null,"GUANAJUATO","MABM8602122N2","MABM860212MGTRRL21","MELISSA MARISELA MARTINEZ BARRIOS","11301003070500S0120100.02647",1130,1003,"07","05","00S01201","00.0","2647",20141001,20151231,20367.48,0,"11APT0001T","11APT0001T",120,"DIRECCION GENERAL","C","APOYO EN EL AREA DE JURIDICO","APOYO AL AREA POR FALTA DE PERSONAL","1618/2014"]
[null,"GUANAJUATO","MAZR720405LB8","MAZR720405HMNRTC01","RICARDO MARTINEZ ZETINA","1130100301630CF3320400.07693",1130,1003,"01","63","0CF33204","00.0",7693,20140216,20151231,56372.36,0,"11DPT0006L","11DPT0008J",120,"PLANTEL CORTAZAR","C","AREA DE FORMACION TECNICA","APOYO AL AREA POR FALTA DE PERSONAL",20140216]
[null,"GUANAJUATO","AALR590709UH6","AALR590709MGTNPC06","MARIA ROCIO ANAYA LOPEZ","1130100302330CF3320600.014312",1130,1003,"02","33","0CF33206","00.0",14312,20140201,20151231,130319.76,0,"11DPT0008J","11DPT0006L",100,"PLANTEL ACAMBARO","C","JEFE DE PROYECTO","RESPONSABLE DE FORMACIÓN TÉCNICA",20140201]
[null,"GUANAJUATO","GATG451128UX1","GATG451128HDFYRS05","GUSTAVO GAYTAN TORRES","1130100300290CF3320600.033206",1130,1003,"00","29","0CF33206","00.0","33206",20120716,20151231,24617,0,"11DPT0002P","11DPT0008J",120,"CORTAZAR","C","COORDINADOR EJECUTIVO","CUBRIR LA COORDINACION EJECUTIVA DEL PLANTEL CORTAZAR",16262012]
[null,"GUANAJUATO","RABR820601BH9","RABR820601HGTMND08","RAMIREZ BUENO RODOLFO OSVALDO ","1130100302040CF3320600.013543","1130","1003","02","04","0CF33206","00.0",13543,20150204,20150331,84056.03,0,"11DPT0010Y","11APT0001T",100,"DIRECCION GENERAL ",7,"JEFE DE PROYECTO DE NOMINA ","ACTIVIDADES RELATIVAS AL NOMBRAMIENTO ","520/2015"]
[null,"GUANAJUATO","MAVR700118TS6","MAVR700118HGTRRB08","RUBEN MARTINEZ VARELA ","1130100302040CF3320600.013251","1130","1003","02","04","0CF33206","00.0",13251,20131001,20150331,105195.69,0,"11DPT0010Y","11DPT0003O",100,"PLANTEL LEON 1","C","JEFE DE PROYECTO DE ESCOLARES ","ACTIVIDADES RELATIVAS AL NOMBRAMIENTO ",20131001]
[null,"GUANAJUATO","AETA880105TQ0","AETA880105HGTCNN01","ANTONIO ACEVEDO TINAJERO","1130100300300CF3320600.013322",1130,1003,"00","30","0CF33206","00.0",13322,20130301,20150331,93641.95,0,"11DPT0003O","11DPT0010Y",100,"PLANTEL SILAO","C","DESARROLLAR ACTIVIDADES EN EL PLANTEL SILAO","DESARROLLAR ACTIVIDADES EN EL PLANTEL SILAO",5512013]
[null,"GUANAJUATO","CALA611023U79","CALA611023MZSRZD15","ADRIANA CÁRDENAS LOZA","1130100300300CF3320600.014317",1130,1003,"00",30,"0CF33206","00.0",14317,20131016,20150331,117195.48000000001,0,"11DPT0003O","11APT0001T",100,"DIRECCION GENERAL","C","DESARROLLAR ACTIVIDADES EN DIRECCIÓN GENERAL","DESARROLLAR ACTIVIDADES EN DIRECCIÓN GENERAL","1860/2013"]
[null,"GUANAJUATO","NIRA700123GK9","NIRA700123MGTTVN01","ANA LAURA NIETO RIVERA","1130100300300CF3320600.014316",1130,1003,"00","30","0CF33206","00.0",14316,20090816,20150331,117195.48000000001,0,"11DPT0003O","11FPT0001O",100,"DIRECCIÓN GENERAL","C","MEJORAMIENTO DE LOS PROCESOS EN LA DIRECCION DE COMPETITIVIDAD","MEJORAMIENTO DE LOS PROCESOS EN LA DIRECCION DE COMPETITIVIDAD",16082009]
[null,"GUANAJUATO","MAJG650413GMA","MAJG650413HGTLRS08","GUSTAVO MALAGON JUÁREZ","1130100302490CF3320600.013689",1130,1003,"02",49,"0CF33206","00.0",13689,20120816,20150331,117282.95000000001,0,"11DPT0011X","11DPT0006L",100,"PLANTEL ACAMBARO","C","MEJORAR LOS PROCESOS ","MEJORAMIENTO DE LOS PROCESOS DEL PLANTEL AL QUE FUE COMISIONADO ","1388/2012"]
[null,"GUANAJUATO","OOCM7903122F9","OOCM790312MGTRRR03","MARCELA OROZCO CORNEJO","1130100303030CF3320400.018865",1130,1003,"03","03","0CF33204","00.0",18865,20130116,20150331,71175.31,0,"11DPT0014U","11DPT0003O",120,"PLANTEL LEON I","C","OCUPACION PUESTO VACANTE ","OCUPACION PUESTO DE SUBJEFE TECNICO ESPECIALISTA DEL PLANTEL LEON 1","657/2013"]
[null,"GUANAJUATO","CEVB731120C46","CEVB731120HGTDRR00","BERNARDO CEDILLO VERA","11301003030300A0180100.018872",1130,1003,"03","03","00A01801","00.0",18872,20120901,20150331,42828.49,0,"11DPT0014U","11DPT0007K",100,"PLANTEL LEON II","C","OCUPACION PUESTO VACANTE ","OCUPACION PUESTO DE ADMINISRATIVO EN PLANTEL LEON II","1546/2012"]
[null,"GUANAJUATO","POPG430527TB7","POPG430527HGTRDD09","J. GUADALUPE PORRAS PADILLA","11301003000000S0120200.02636",1130,1003,"00","00","00S01202","00.0",2636,20091201,20150331,40784.629999999997,0,"11APT0001T","11APT0001T",100,"CAST LEON","C","APOYO A LA DIRECCIÓN DE COMPETITIVIDAD","APOYO AL AREA POR FALTA DE PERSONAL","01122009"]
[null,"GUANAJUATO","MOGM581228P96","MOGM581228MGTRNR09","MORENO GONZALEZ MARTHA DEL CARMEN","11301003000000A0180100.018843",1130,1003,"00","00","00A01801","00.0",18843,20080801,20150331,46840.34,0,"11APT0001T","11DPT0007K",100,"PLANTEL LEON II","C","ADMINISTRATIVO TECNICO ESPECIALISTA","COLABORAR EN LAS ACTIVIDADES RELACIONADAS CON EL DEPARTAMENTO DE RECURSOS HUMANOS DEL PLANTEL",7292008]
[null,"GUANAJUATO","AECL710621SE4","AECL710621HGTRRS02","JOSE LUIS ARELLANO CRUZ","11301003000000A0320200.010301",1130,1003,"00","00","00A03202","00.0",10301,20141117,20150331,35725.96,0,"11APT0001T","11DPT0010Y",100,"PLANTEL SILAO","C","APOYO AL AREA DE CAPACITACION","APOYO AL AREA POR FALTA DE PERSONAL","976/2014"]
[null,"Total Personas : ",28,null,null,null,null,null,null,null,"Total Plazas : ",null,28,"Total Pto. Federal",null,{"$f":"SUBTOTAL(109,Tabla1[Percepciones pagadas en el Periodo de Comisión con Presupuesto Federal*])","v":2175076.4999999995}]
[]
[null,null,null,null,null,null,null,null,null,null,null,null,"Total Ppto. Otras Fuentes",null,null,null,{"$f":"SUM(Q17:Q46)","v":0}]
[]
[null,"*Total de Percepciones reportadas por la Entidad Federativa como pagadas al trabajador durante la comisión."]
[null,"Fuente : Información proporcionada por las Entidades Federativas."]

{"sheet":"A Y II D4","index":2,"n_rows":52,"n_cols":21,"rows_kept":52,"cut":false,"hidden":false,"merged":[[9,1,9,6],[46,13,46,14],[12,16,13,16],[12,17,13,17],[12,20,13,20],[12,1,13,1],[12,3,13,3],[12,4,13,4],[12,5,13,5],[12,6,12,12],[12,13,12,14],[12,2,13,2],[12,18,12,19],[12,15,13,15]]}
[]
[]
[]
[]
[]
[]
[]
[]
[null,"Formato: Personal con Licencia"]
[null,{"$f":"IF('Caratula Resumen'!D22=\"Elige el Periodo…\",\"\",'Caratula Resumen'!D22)","v":"Fondo de Aportaciones para la Educación Tecnológica y de Adultos/Colegio Nacional de Educación Profesional Técnica (FAETA/CONALEP)"},null,null,null,null,null,null,null,null,null,null,null,null,null,null,null,null,null,null,{"$f":"IF('Caratula Resumen'!D23=\"Elige el Periodo…\",\"\",'Caratula Resumen'!D23)","v":"1er. Trimestre"}]
[]
[]
[null,"Entidad Federativa","R.F.C.","CURP","NOMBRE","Clave integrada","Clave Presupuestal",null,null,null,null,null,null,"Periodo Licencia",null,"Percepciones pagadas en el Periodo de la Licencia con Presupuesto Federal*","Percepciones pagadas en el Periodo de la Licencia con Presupuesto de otra fuente*","Clave CT Origen","Licencia",null,"Descripción de la Licencia"]
[null,null,null,null,null,null,"Partida Presupuestal","Código de Pago","Clave de Unidad","Clave de Sub Unidad","Clave de Categoría","Horas Semana Mes ","Número de Plaza","Inicio","Conclusión",null,null,null,"Clave","Tipo"]
[]
[null,"Entidad Federativa","R.F.C.","CURP","NOMBRE","Clave integrada","Partida Presupuestal","Código de Pago","Clave de Unidad","Clave de Sub Unidad","Clave de Categoría","Horas Semana Mes ","Número de Plaza","Periodo Licencia\nInicio","Periodo Licencia\nConclusión","Percepciones pagadas en el Periodo de la Licencia con Presupuesto Federal*","Percepciones pagadas en el Periodo de la Licencia con Presupuesto de otra fuente*","Clave CT Origen","Licencia\nClave","Licencia\nTipo","Descripción de la Licencia"]
[null,"GUANAJUATO","MACE390728NC3","MACE390713HJCQLV03","EVERARDO MAQUEDA CUELLAR","113010030174S0120100.08089",1130,1003,"01",74,"S01201","00.0",8089,20150115,20150415,35178.36,0,"11DPT0009I",26,"Goce","Prepensionaria o su refrendo"]
[null,"GUANAJUATO","RAGC520726TJ0","RAGC520726MGTYNR12","MARIA CARMEN RAYA GONZALEZ","113010030174CF0420100.08079",1130,1003,"01",74,"CF04201","00.0",8079,20150115,20150415,41106.54,0,"11DPT0009I",26,"Goce","Prepensionaria o su refrendo"]
[null,"GUANAJUATO","POGA630408KE8","POGA630408MGTNRD08","PONCE GARCIA MARIA ADRIANA","113010030029CF1920100.02583",1130,1003,"00",29,"CF19201","00.0",2583,20150101,20150131,0,0,"11DPT0002P",16,"Sin Goce","Sin goce de sueldo o su refrendo"]
[null,"GUANAJUATO","GUAT581022UC2","GUAT581022HGTRLD00","GUERRERO ALFARO TEODORO","113010030029SO120200.02604",1130,1003,"00",29,"SO1202","00.0",2604,20150216,20150515,0,0,"11DPT0002P",16,"Sin Goce","Sin goce de sueldo o su refrendo"]
[null,"GUANAJUATO","RIHM610919TU2","RIHM610919MGTCRR07","MARICELA RICO HERNANDEZ","113010030233CF3320600.010188",1130,1003,"02",33,"CF33206","00.0","10188",20150101,20150203,31745.23,0,"11DPT0008J",26,"Goce","Prepensionaria o su refrendo"]
[null,"GUANAJUATO","ROGJ631018GD6","ROGJ631018HGTMRN04","JUAN JOSÉ ROMERO GARCÍA","113010030030CF1920100.02620",1130,1003,"00",30,"CF19201","00.0",2620,20140701,20140930,44693.65,0,"11DPT00030",12,"Goce","Comisión sindical o su refrendo"]
[null,"GUANAJUATO","PAPM510404DG5","PAPM510404MGTNCR08","PANIAGUA PICAZO MARIA","113010030163A0320200.081090",1130,1003,"01",63,"A03202","00.0",81090,20150315,20150331,31629.08,0,"11DPT0006L",25,"Goce","Por gravidez o su refrendo"]
[null,"GUANAJUATO","RAMD6103291R4","RAMD610329HGTMNV10","DAVID RAMIREZ MONJARAZ","113010030705CF2120200.01687",1130,1003,"07","05","CF21202","00.0","1687",20150309,20150329,12044.66,0,"11APT0001T",14,"Goce","Por incapacidad médica o su refrendo"]
[null,"GUANAJUATO","HEHC860109NN6","HEHC860109HGTRRH01","CHRISTIAN EMMANUEL HERNÁNDEZ HERRERA","113010030030AO320200.02614",1130,1003,"00",30,"AO3202","00.0",2614,20140916,20141129,0,0,"11DPT00030",16,"Sin Goce","Sin goce de sueldo o su refrendo"]
[null,"GUANAJUATO","AAMR650620AB4","AAMR650620HGTLGB03","ROBERTO ALVARADO MAGAÑA","113010030249CF1920100.010606",1130,1003,"02",49,"CF19201","00.0",10606,20131016,20190930,44915.79,0,"11DPT0011X",12,"Goce","Comisión sindical o su refrendo"]
[null,"GUANAJUATO","MEGC861127FF5","MEGC861127HGTZRR00","MEZA GARCIA CARLOS FRANCISCO ","113010010302PB06.0302056",1130,1001,"03","02","PB","06.0",302056,20140915,20150803,0,0,"11DPT0013V",16,"Sin Goce","Sin goce de sueldo o su refrendo"]
[null,"GUANAJUATO","RELS650704P63","RELS650704MGTXZL00","MARES RIVERA MARIA MONTSERRAT","113010010302PB10.0302093",1130,1001,"03","02","PB","10.0",302093,20140901,20160901,0,0,"11DPT0013V",16,"Sin Goce","Sin goce de sueldo o su refrendo"]
[null,"GUANAJUATO","SAGM870320FEO","SAGM870320MGTNNR07","MIRIAM LETICIA SANCHEZ GONZALEZ ","113010010028TA10.028079",1130,1001,"00","28","TA","10.0",28079,20150201,20150731,16291.44,0,"11DPT0001Q",16,"Sin Goce","Sin goce de sueldo o su refrendo"]
[null,"GUANAJUATO","AULJ800815441","AULJ800815HGTGPS08","JOSE AGUILAR LOPEZ","113010010163PA15.0163001",1130,1001,"01","63","PA","15.0",163001,20150201,20150731,0,0,"11DPT0006L",16,"Sin Goce","Sin goce de sueldo o su refrendo"]
[null,"GUANAJUATO","BEGR700112IU3","BEGR700112MGTRRB16","BERNAL GORDILLO MA REBECA ","113010010163PA16.0163006",1130,1001,"01",63,"PA","16.0",163006,20150201,20150731,0,0,"11DPT0006L",16,"Sin Goce","Sin goce de sueldo o su refrendo"]
[null,"GUANAJUATO","MAMA660610965","MAMA660610HGTRLR08","ARMANDO MARTINEZ MALDONADO","113010010163PC10.0163028",1130,1001,"01",63,"PC","10.0",163028,20150201,20150731,0,0,"11DPT0006L",16,"Sin Goce","Sin goce de sueldo o su refrendo"]
[null,"GUANAJUATO","VAAE770920SD7","VAAE770920MOCZGR13","ERICA MARIZA VAZQUEZ AGUILERA","113010010163PB09.0163051",1130,1001,"01",63,"PB","09.0",163051,20150201,20150731,0,0,"11DPT0006L",16,"Sin Goce","Sin goce de sueldo o su refrendo"]
[null,"GUANAJUATO","LOHE8811064TA","LOHE881106MJCPRD00","LOPEZ HERNANDEZ EDITH ","113010010163TA11.0163067",1130,1001,"01",63,"TA","11.0",163067,20150201,20150731,0,0,"11DPT0006L",16,"Sin Goce","Sin goce de sueldo o su refrendo"]
[null,"GUANAJUATO","MAGT820516KF3","MAGT820516MDFGMN07","TANIA ITZEL MAGAÑA GOMEZ","113010010174PB25.0174023",1130,1001,"01",74,"PB","25.0",174023,20150201,20150731,0,0,"11DPT0009I",16,"Sin Goce","Sin goce de sueldo o su refrendo"]
[null,"GUANAJUATO","BACA821115626","BACA821115MGTRRN05","MARIA DE LOS ANGELES BARRON CORONA","113010010174TA16.0174050",1130,1001,"01",74,"TA","16.0",174050,20150227,20150527,46780.800000000003,0,"11DPT0009I",25,"Goce","Por gravidez o su refrendo"]
[null,"GUANAJUATO","MAPA6006036V3","MAPA600603MGTCLN00","ANA AMPARO MACIAS PALACIOS","113010010203PC20.0203050",1130,1001,"02","03","PC","20.0",203050,20150216,20150331,0,0,"11DPT0007K",16,"Sin Goce","Sin goce de sueldo o su refrendo"]
[null,"GUANAJUATO","TAGL820524R17","TAGL820524MGTPMZ06","MARIA DE LA LUZ TAPIA GOMEZ","113010010203PC13.0203084",1130,1001,"02","03","PC","13.0",203084,20150101,20150310,15263.170000000002,0,"11DPT0007K",22,"Goce","Por incapacidad médica o su refrendo"]
[null,"GUANAJUATO","ZARG760122LM0","ZARG760122MGTRDR05","GRACIELA ZARAGOZA RODRIGUEZ","113010010203PC32.0203096",1130,1001,"02","03","PC","32.0",203096,20150219,20150318,33106.159999999996,0,"11DPT0007K",22,"Goce","Por incapacidad médica o su refrendo"]
[null,"GUANAJUATO","GUMR8110123U3","GUMR811012HCHZNM08","RAMIRO GUZMAN MONTES","113010010203PB10.0203153",1130,1001,"02","03","PB","10.0",203153,20150201,20150331,0,0,"11DPT0007K",16,"Sin Goce","Sin goce de sueldo o su refrendo"]
[null,"GUANAJUATO","CAVP701006911","CAVP701006MYNSLR06","PERLA MARGARITA CASANOVA VELA","113010010203PC15.0203196",1130,1001,"02","03","PC","15.0",203196,20150201,20150331,0,0,"11DPT0007K",16,"Sin Goce","Sin goce de sueldo o su refrendo"]
[null,"GUANAJUATO","GOBA8411109SA","GOBA841110MGTNNL06","ALMA CECILIA GONZALEZ BUENDIA","113010010203PB14.0203232",1130,1001,"02","03","PB","14.0",203232,20150209,20150331,0,0,"11DPT0007K",16,"Sin Goce","Sin goce de sueldo o su refrendo"]
[null,"GUANAJUATO","EIPF611001FZA","EIPF611001HGTSRR04","J. FRANCISCO ESPITIA PEREZ","113010010233PC14.0233014",1130,1001,"02",33,"PC","14.0",233014,20150101,20150331,0,0,"11DPT0008J",16,"Sin Goce","Sin goce de sueldo o su refrendo"]
[null,"GUANAJUATO","HEFJ700120711","HEFG700120HGTRSD12","J. GUADALUPE HERNANDEZ FISCAL","113010010233PC20.0233024",1130,1001,"02",33,"PC","20.0",233024,20150101,20150331,32712.05,0,"11DPT0008J",12,"Goce","Comisión sindical o su refrendo"]
[null,"GUANAJUATO","CAEL691012SG8","CAEL691012MDFRST01 ","CARMONA ESPINOSA LETICIA","113010010028PB20.0280096",1130,1001,"00","28","PB","20.0",280096,20150216,20150815,{"$f":"44700","v":44700},0,"11DPT0001Q",16,"Sin Goce","Sin goce de sueldo o su refrendo"]
[null,"GUANAJUATO","MASR660830DA3","MASR660830HGTTRG02","ROGELIO MATA SERRATO","113010010233PC20.0233037",1130,1001,"02",33,"PC","20.0",233037,20150101,20150202,0,0,"11DPT0008J",16,"Sin Goce","Sin goce de sueldo o su refrendo"]
[null,"Total Personas : ",30,null,null,null,null,null,null,null,"Total Plazas : ",null,30,"Total Pto. Federal",null,{"$f":"SUBTOTAL(109,Tabla3[Percepciones pagadas en el Periodo de la Licencia con Presupuesto Federal*])","v":430166.92999999993}]
[]
[null,null,null,null,null,null,null,null,null,null,null,null,null,"Total Ppto. Otras Fuentes",null,null,{"$f":"SUM(Q17:Q48)","v":0}]
[]
[null,"*Total de Percepciones reportadas por la Entidad Federativa como pagadas al trabajador durante la Licencia."]
[null,"Fuente : Información proporcionada por las Entidades Federativas."]

{"sheet":"B)","index":3,"n_rows":28,"n_cols":19,"rows_kept":28,"cut":false,"hidden":false,"merged":[[12,18,13,18],[12,12,13,12],[12,13,13,13],[12,14,13,14],[12,15,12,16],[12,17,13,17],[9,1,9,10],[12,1,13,1],[12,2,13,2],[12,3,13,3],[12,4,13,4],[12,5,12,11]]}
[]
[]
[]
[]
[]
[]
[]
[]
[null,"Formato: Registro Federal de Contribuyentes de Trabajadores con Pagos Retroactivos con un Periodo Mayor a 45 días"]
[null,{"$f":"IF('Caratula Resumen'!D22=\"Elige el Periodo…\",\"\",'Caratula Resumen'!D22)","v":"Fondo de Aportaciones para la Educación Tecnológica y de Adultos/Colegio Nacional de Educación Profesional Técnica (FAETA/CONALEP)"},null,null,null,null,null,null,null,null,null,null,null,null,null,null,null,{"$f":"IF('Caratula Resumen'!D23=\"Elige el Periodo…\",\"\",'Caratula Resumen'!D23)","v":"1er. Trimestre"}]
[]
[]
[null,"Entidad Federativa","RFC","CURP","Nombre","Clave Presupuestal",null,null,null,null,null,null,"Clave de Centro de Trabajo","Fecha de emisión de pago","Motivo del Pago Retroactivo","Periodo pagado",null,"Días transcurridos para el pago","Percepciones pagadas en el periodo reportado *"]
[null,null,null,null,null,"Partida Presupuestal","Código de Pago","Clave de Unidad","Clave de Sub Unidad","Clave de Categoría","Horas Semana Mes ","Número de Plaza",null,null,null,"Desde","Hasta"]
[]
[null,"Entidad Federativa","RFC","CURP","Nombre","Partida Presupuestal","Código de Pago","Clave de Unidad","Clave de Sub Unidad","Clave de Categoría","Horas semana mes","Número de plaza","Clave de Centro de Trabajo","Fecha de emisión de pago","Motivo del Pago Retroactivo","Periodo pagado\nDesde","Periodo pagado\nHasta","Días transcurridos para el pago","Percepciones pagadas en el periodo reportado *"]
[]
[]
[]
[]
[]
[]
[null,"Total Personas : ",null,null,null,null,null,null,null,null,"Total Plazas : ",null,null,null,null,"Total Percepciones Pagadas:"]
[]
[]
[]
[null,"*Total de Percepciones reportadas por la Entidad Federativa como pagadas en el periodo "]
[null,"Fuente : Información proporcionada por las Entidades Federativas"]

{"sheet":"II B) Y 1","index":4,"n_rows":923,"n_cols":25,"rows_kept":923,"cut":false,"hidden":false,"merged":[[12,4,14,4],[12,3,14,3],[12,2,14,2],[9,1,9,9],[920,21,920,23],[12,1,14,1],[12,5,14,5],[12,24,14,24],[13,6,13,8],[13,9,13,11],[13,12,13,14],[13,15,13,17],[13,18,13,20],[12,6,12,20],[12,21,14,21],[12,22,14,22],[12,23,14,23]]}
[]
[]
[]
[]
[]
[]
[]
[]
[null,"Formato: Plaza / Función"]
[null,{"$f":"IF('Caratula Resumen'!D22=\"Elige el Periodo…\",\"\",'Caratula Resumen'!D22)","v":"Fondo de Aportaciones para la Educación Tecnológica y de Adultos/Colegio Nacional de Educación Profesional Técnica (FAETA/CONALEP)"},null,null,null,null,null,null,null,null,null,null,null,null,null,null,null,null,null,null,null,null,null,{"$f":"IF('Caratula Resumen'!D23=\"Elige el Periodo…\",\"\",'Caratula Resumen'!D23)","v":"1er. Trimestre"}]
[]
[]
[null,"Entidad Federativa","RFC","CURP","Nombre","Centros de Trabajo","Plazas por tipo de función",null,null,null,null,null,null,null,null,null,null,null,null,null,null,"Total plazas Jornada","Total \nHSM","Total de Honorarios","Total de recursos presupuestales ejercidos en servicios personales en el periodo\n(2)"]
[null,null,null,null,null,null,"Apoyo a la labor educativa",null,null,"Administrativo y de servicio",null,null,"Docente y Apoyo Técnico Pedagógico",null,null,"Directivos y Supervisión",null,null,"Mandos medios y superiores"]
[null,null,null,null,null,null,"Jornada","HSM","Honorarios","Jornada","HSM","Honorarios","Jornada","HSM","Honorarios","Jornada","HSM","Honorarios","Jornada","HSM","Honorarios"]
[]
[null,"Entidad Federativa","RFC","CURP","Nombre","Centros de Trabajo","Jornada","HSM","Honorarios","Jornada2","HSM3","Honorarios4","Jornada5","HSM6","Honorarios7","Jornada8","HSM9","Honorarios10","Jornada11","HSM12","Honorarios13","Total plazas Jornada","Total \nHSM","Total de Honorarios","Total de recursos presupuestales ejercidos en servicios personales en el periodo\n(2)"]
[null,"GUANAJUATO","BEEJ790327230","BEEJ790327HGTLSN06  ","JUAN GUSTAVO BELMAN ESPINOSA            ","11DPT0001Q",null,null,null,"X",null,null,null,null,null,null,null,null,null,null,null,1,null,null,31067.719999999998]
[null,"GUANAJUATO","DIJL7203079A3","DIJL720307MGTGCR01  ","MA. DE LOURDES DIEGO JACOBO             ","11DPT0004N",null,null,null,"X",null,null,null,null,null,null,null,null,null,null,null,1,null,null,42757.960000000006]
[null,"GUANAJUATO","FIRG871015PB5","FIRG871015MGTGMB07  ","GABRIELA FIGUEROA RAMIREZ               ","11DPT0005M",null,null,null,"X",null,null,null,null,null,null,null,null,null,null,null,1,null,null,27729.93]
[null,"GUANAJUATO","GOGE730923ME8","GOGE730923MMNNNL00  ","ELIZABETH GONZALEZ GONZALEZ             ","11DPT0004N",null,null,null,"X",null,null,null,null,null,null,null,null,null,null,null,1,null,null,41260.39]
[null,"GUANAJUATO","LAVA8108019Q9","LAVA810801MGTGRN09  ","MARIA DE LOS ANG LAGUNA VARGAS          ","11DPT0008J",null,null,null,"X",null,null,null,null,null,null,null,null,null,null,null,1,null,null,100092.70999999999]
[null,"GUANAJUATO","LIRA890608KM8","LIRA890608MGTZZL06  ","ALMA ROSARIO LIZARRAGA RUIZ             ","11DPT0001Q",null,null,null,"X",null,null,null,null,null,null,null,null,null,null,null,1,null,null,30585.730000000003]
[null,"GUANAJUATO","MELJ7904219Z8","MELJ790421HGTLDN03  ","JUAN MAURICIO MELGOZA LEDESMA           ","11DPT0008J",null,null,null,"X",null,null,null,null,null,null,null,null,null,null,null,1,null,null,32643.68]
[null,"GUANAJUATO","NUCS580811UI9","NUCS580811MGTXRS04  ","SUSANA NUÑEZ CERRITOS                   ","11DPT0008J",null,null,null,"X",null,null,null,null,null,null,null,null,null,null,null,1,null,null,41595.17]
[null,"GUANAJUATO","PACM941015U40","PACM941015MGTLRR06  ","MARIANA PALOMINO CARREñO                ","11DPT0008J",null,null,null,"X",null,null,null,null,null,null,null,null,null,null,null,1,null,null,26639.97]
[null,"GUANAJUATO","PIOP550618BT2","PIOP550618HGTCLB08  ","PABLO PICHARDO OLVERA                   ","11DPT0001Q",null,null,null,"X",null,null,null,null,null,null,null,null,null,null,null,1,null,null,44229.41]
[null,"GUANAJUATO","ROCS8704055G4","ROCS870405MMCDSL06  ","MARIA DEL SOL RODRIGUEZ CASTRO          ","11DPT0008J",null,null,null,"X",null,null,null,null,null,null,null,null,null,null,null,1,null,null,38948.74]
[null,"GUANAJUATO","ROVA500401GUA","ROVA500401HGTJLR05  ","ARTURO ROJAS VALENCIA                   ","11DPT0008J",null,null,null,"X",null,null,null,null,null,null,null,null,null,null,null,1,null,null,37296.209999999992]
[null,"GUANAJUATO","ROZA560516SE3","ROZA560516HGTJPB08  ","ABEL ROJAS ZAPATERO                     ","11DPT0008J",null,null,null,"X",null,null,null,null,null,null,null,null,null,null,null,1,null,null,49616.979999999996]
[null,"GUANAJUATO","SAGN550328CW5","SAGN550328HGTNMC00  ","NICOLAS SANTOYO GOMEZ                   ","11DPT0004N",null,null,null,"X",null,null,null,null,null,null,null,null,null,null,null,1,null,null,41202.019999999997]
[null,"GUANAJUATO","AABC680116196","AABC680116MMCBNL09  ","CLAUDIA CECILIA D ABDALA BUENDIA        ","11DPT0011X",null,null,null,"X",null,null,null,null,null,null,null,null,null,null,null,1,null,null,35566.9]
[null,"GUANAJUATO","AABC720527RL6","AABC720527HGTLRR03  ","CARLOS ALVARADO BARRIOS                 ","11DPT0009I",null,null,null,"X",null,null,null,null,null,null,null,null,null,null,null,1,null,null,37682.68]
[null,"GUANAJUATO","AACG691218L13","AACG691218MMNLSR08  ","GRACIELA ALVAREZ CASTRO                 ","11DPT0004N",null,null,null,"X",null,null,null,null,null,null,null,null,null,null,null,1,null,null,45168.479999999996]
[null,"GUANAJUATO","AAGA521215AI7","AAGA521215HDFLRR19  ","ARTURO GERARDO ALVAREZ GARCIA           ","11DPT0002P",null,null,null,"X",null,null,null,null,null,null,null,null,null,null,null,1,null,null,36338.36]
[null,"GUANAJUATO","AALA880119VB9","AALA880119MGTLPL06  ","ALESSA ALVARADO LOPEZ                   ","11DPT0014U",null,null,null,"X",null,null,null,null,null,null,null,null,null,null,null,1,null,null,46773.85]
[null,"GUANAJUATO","AALR590709UH6","AALR590709MGTNPC06  ","MARIA ROCIO ANAYA LOPEZ                 ","11DPT0008J",null,null,null,"X",null,null,null,null,null,null,null,null,null,null,null,1,null,null,130319.81999999998]
[null,"GUANAJUATO","AALS670904235","AALS670904MGTNPL09  ","SILVIA ANAYA LOPEZ                      ","11DPT0006L",null,null,null,"X",null,null,null,null,null,null,null,null,null,null,null,1,null,null,79790.760000000009]
[null,"GUANAJUATO","AAMD810413AX8","AAMD810413MGTNRN03  ","DIANA LORENA ANAYA MARTINEZ             ","11APT0001T",null,null,null,"X",null,null,null,null,null,null,null,null,null,null,null,1,null,null,39003.949999999997]
[null,"GUANAJUATO","AAMR650620AB4","AAMR650620HGTLGB03  ","ROBERTO ALVARADO MAGAÑA                 ","11DPT0011X",null,null,null,"X",null,null,null,null,null,null,null,null,null,null,null,1,null,null,44915.75]
[null,"GUANAJUATO","AAMR671130JR0","AAMR671130HGTLGB00  ","RUBEN ALVARADO MAGANA                   ","11DPT0011X",null,null,null,"X",null,null,null,null,null,null,null,null,null,null,null,1,null,null,32800.200000000004]
[null,"GUANAJUATO","AARL760126331","AARL760126HGTLMN06  ","LEONARDO ISRAEL ALVAREZ ROMO            ","11DPT0006L",null,null,null,"X",null,null,null,null,null,null,null,null,null,null,null,1,null,null,41470.46]
[null,"GUANAJUATO","AARM7802157H4","AARM780215MGTLDY03  ","MYRIAM DEL ROSAR ALVARADO RODRIGUEZ     ","11DPT0002P",null,null,null,"X",null,null,null,null,null,null,null,null,null,null,null,1,null,null,28798.46]
[null,"GUANAJUATO","AATE760606N24","AATE760606MGTLNV03  ","EVA ALMANZA TINOCO                      ","11DPT0001Q",null,null,null,"X",null,null,null,null,null,null,null,null,null,null,null,1,null,null,34528.67]
[null,"GUANAJUATO","AEAC630530Q21","AEAC630530MGTLLN08  ","MA. CONCEPCION ALEJOS ALONSO            ","11DPT0008J",null,null,null,"X",null,null,null,null,null,null,null,null,null,null,null,1,null,null,76988.259999999995]
[null,"GUANAJUATO","AECJ7908035L8","AECJ790803HGTLRS03  ","JOSE JESUS ALEJO CARRENO                ","11DPT0011X",null,null,null,"X",null,null,null,null,null,null,null,null,null,null,null,1,null,null,34396.22]
[null,"GUANAJUATO","AECL710621SE4","AECL710621HGTRRS02  ","JOSE LUIS ARELLANO CRUZ                 ","11APT0001T",null,null,null,"X",null,null,null,null,null,null,null,null,null,null,null,1,null,null,35725.96]
[null,"GUANAJUATO","AECM720103NB9","AECM720103MGTLRR09  ","MARCELA ALEJO CARREÑO                   ","11DPT0011X",null,null,null,"X",null,null,null,null,null,null,null,null,null,null,null,1,null,null,119697.22]
[null,"GUANAJUATO","AEGJ5311191A4","AEGJ531119HGTSRR09  ","JORGE ASCENCIO GARCIA                   ","11DPT0003O",null,null,null,"X",null,null,null,null,null,null,null,null,null,null,null,1,null,null,40214.769999999997]
[null,"GUANAJUATO","AERG571209NWA","AERG591209HGTRML03  ","GILBERTO ARREOLA ROMERO                 ","11DPT0006L",null,null,null,"X",null,null,null,null,null,null,null,null,null,null,null,1,null,null,34532.310000000005]
[null,"GUANAJUATO","AETA880105TQ0","AETA880105HGTCNN01  ","ANTONIO ACEVEDO TINAJERO                ","11DPT0003O",null,null,null,"X",null,null,null,null,null,null,null,null,null,null,null,1,null,null,93641.98000000001]
[null,"GUANAJUATO","AIGG6105048S8","AIGG610504HGTRZL05  ","GUILLERMO ARIAS GUZMAN                  ","11APT0001T",null,null,null,null,null,null,null,null,null,null,null,null,"X",null,null,1,null,null,118366.07]
[null,"GUANAJUATO","AIMK880805R10","AIMK880805MGTRXR05  ","KARLA GABRIELA ARIAS MUÑOZ              ","11APT0001T",null,null,null,"X",null,null,null,null,null,null,null,null,null,null,null,1,null,null,88525.709999999992]
[null,"GUANAJUATO","AOFA670123A81","AOFA670123MGTBLD06  ","ADRIANA DEL CARM ABONCE FLORES          ","11DPT0011X",null,null,null,"X",null,null,null,null,null,null,null,null,null,null,null,1,null,null,98829.959999999992]
[null,"GUANAJUATO","AOGI790809G38","AOGI790809MGTLRM04  ","IMELDA SUSANA ALONSO GARCIA             ","11APT0001T",null,null,null,"X",null,null,null,null,null,null,null,null,null,null,null,1,null,null,73019.38]
[null,"GUANAJUATO","AOLJ820429DY4","AOLJ820429HGTCPL06  ","JOEL ADOLFO ACOSTA LOPEZ                ","11DPT0007K",null,null,null,"X",null,null,null,null,null,null,null,null,null,null,null,1,null,null,30606.43]
[null,"GUANAJUATO","AORJ6109147M3","AORJ610914HDFMZR05  ","JORGE AMOR RUIZ                         ","11APT0001T",null,null,null,null,null,null,null,null,null,null,null,null,"X",null,null,1,null,null,118366.07]
[null,"GUANAJUATO","AOVP751006KA9","AOVP751006MGTLLL04  ","MA. DEL PILAR ALMONACI VALADEZ          ","11DPT0003O",null,null,null,"X",null,null,null,null,null,null,null,null,null,null,null,1,null,null,80260.500000000015]
[null,"GUANAJUATO","AUDM660425P52","AUDM660425MGTGRR18  ","MIRIAM AGUILAR DURON                    ","11DPT0001Q",null,null,null,"X",null,null,null,null,null,null,null,null,null,null,null,1,null,null,117880.48]
[null,"GUANAJUATO","AUPM640422KR2","AUPM640422HGTGLR03  ","MARTIN AGUIRRE PALMERIN                 ","11DPT0004N",null,null,null,"X",null,null,null,null,null,null,null,null,null,null,null,1,null,null,39503.279999999999]
[null,"GUANAJUATO","BACM8402274W0","BACM840227HGTRNG03  ","MIGUEL ANGEL BARRON CONEJO              ","11DPT0001Q",null,null,null,"X",null,null,null,null,null,null,null,null,null,null,null,1,null,null,93161.760000000009]
[null,"GUANAJUATO","BAGJ5004309G9","BAGJ500430HGTRRR03  ","JORGE BARRERA GARCIA                    ","11DPT0011X",null,null,null,"X",null,null,null,null,null,null,null,null,null,null,null,1,null,null,40033.040000000001]
[null,"GUANAJUATO","BAGS470901EG4","BAGS470901MGTRRL03  ","SILVIA BARRERA GARCIA                   ","11DPT0011X",null,null,null,"X",null,null,null,null,null,null,null,null,null,null,null,1,null,null,39729.600000000006]
[null,"GUANAJUATO","BAJR800429CA7","BAJR800429MGTLRC00  ","ROCIO BALDERAS JUAREZ                   ","11DPT0008J",null,null,null,"X",null,null,null,null,null,null,null,null,null,null,null,1,null,null,41231.009999999995]
[null,"GUANAJUATO","BAMJ6207121X4","BAMJ620712HGTRNN19  ","JUAN ANGEL BRAVO MONTOYA                ","11APT0001T",null,null,null,"X",null,null,null,null,null,null,null,null,null,null,null,1,null,null,62726.2]
[null,"GUANAJUATO","BAPA711019KLA","BAPA711019MGTRRN03  ","ANA LOURDES BARAJAS PEREZ               ","11DPT0007K",null,null,null,"X",null,null,null,null,null,null,null,null,null,null,null,1,null,null,78402.03]
[null,"GUANAJUATO","BAQL620315PN5","BAQL620315HGTRRS00  ","LUIS MANUEL BRAVO QUIROZ                ","11DPT0005M",null,null,null,"X",null,null,null,null,null,null,null,null,null,null,null,1,null,null,118605.56]
[null,"GUANAJUATO","BARJ8305267S1","BARJ830526HGTRYN02  ","REYES JUAN ANGEL BRAVO                  ","11DPT0008J",null,null,null,"X",null,null,null,null,null,null,null,null,null,null,null,1,null,null,79530.91]
[null,"GUANAJUATO","BASS600608U7A","BASS600608MGTRRL08  ","MARIA SOLEDAD ROS BRAVO SERRANO         ","11DPT0005M",null,null,null,"X",null,null,null,null,null,null,null,null,null,null,null,1,null,null,43691.039999999994]
[null,"GUANAJUATO","BAUM780104T8A","BAUM780104MGTRRC01  ","MICAELA BARCENAS URBINA                 ","11DPT0010Y",null,null,null,"X",null,null,null,null,null,null,null,null,null,null,null,1,null,null,32191.310000000005]
[null,"GUANAJUATO","BAUR7105213K8","BAUR710521MDFRRT02  ","RITA BARCENAS URBINA                    ","11DPT0001Q",null,null,null,"X",null,null,null,null,null,null,null,null,null,null,null,1,null,null,40144.28]
[null,"GUANAJUATO","BERC880813NK7","BERC880813MGTLMN05  ","CINDIA ELIZABETH BELTRAN RAMOS          ","11DPT0002P",null,null,null,"X",null,null,null,null,null,null,null,null,null,null,null,1,null,null,38954.199999999997]
[null,"GUANAJUATO","BUSG720302VE9","BUSG720302MGTLND02  ","MA. GUADALUPE BULLONS SANTIAGO          ","11DPT0003O",null,null,null,"X",null,null,null,null,null,null,null,null,null,null,null,1,null,null,38722.219999999994]
[null,"GUANAJUATO","CAAO740517PC6","CAAO740517HGTMRC05  ","OCTAVIANO CAMPOS ARRIAGA                ","11DPT0008J",null,null,null,"X",null,null,null,null,null,null,null,null,null,null,null,1,null,null,75960.340000000011]
[null,"GUANAJUATO","CACF600221UD2","CACF600221HSPMSR07  ","FORTUNATO CAMACHO CASTILLO              ","11DPT0003O",null,null,null,"X",null,null,null,null,null,null,null,null,null,null,null,1,null,null,33484.42]
[null,"GUANAJUATO","CACL650308V86","CACL650308MGTMLZ03  ","MA. DE LA LUZ CAMARILLO COLLAZO         ","11DPT0007K",null,null,null,"X",null,null,null,null,null,null,null,null,null,null,null,1,null,null,122111.44]
[null,"GUANAJUATO","CADG5812029W6","CADG581202MGTHLR09  ","GRACIELA CHAVEZ DELGADO                 ","11DPT0007K",null,null,null,"X",null,null,null,null,null,null,null,null,null,null,null,1,null,null,47695.5]
[null,"GUANAJUATO","CAGM670126RV9","CAGM670126MGTHNR09  ","MARTHA DELIA CHAVEZ GONZALEZ            ","11DPT0003O",null,null,null,"X",null,null,null,null,null,null,null,null,null,null,null,1,null,null,109032.66]
[null,"GUANAJUATO","CAGR660928KD7","CAGR660928MGTSNB07  ","RUBICELIA CASTRO GONZALEZ               ","11DPT0005M",null,null,null,"X",null,null,null,null,null,null,null,null,null,null,null,1,null,null,85788.21]
[null,"GUANAJUATO","CAGT7903078F3","CAGT790307HGTMRM01  ","TOMAS ESTEBAN CAMACHO GARCIA            ","11DPT0001Q",null,null,null,"X",null,null,null,null,null,null,null,null,null,null,null,1,null,null,28744.879999999997]
[null,"GUANAJUATO","CALA611023U79","CALA611023MZSRZD15  ","ADRIANA CARDENAS LOZA                   ","11DPT0003O",null,null,null,"X",null,null,null,null,null,null,null,null,null,null,null,1,null,null,111392.66]
[null,"GUANAJUATO","CALA7006204L0","CALA700620MGTMPL09  ","ALEJANDRA CAMACHO LOPEZ                 ","11APT0001T",null,null,null,"X",null,null,null,null,null,null,null,null,null,null,null,1,null,null,68601.200000000012]
[null,"GUANAJUATO","CALA880830IGA","CALA880830MGTLPD08  ","ADRIANA CALDERON LOPEZ                  ","11DPT0011X",null,null,null,"X",null,null,null,null,null,null,null,null,null,null,null,1,null,null,38193.949999999997]
[null,"GUANAJUATO","CAML640420FH8","CAML640420HDFSRS06  ","JOSE LUIS CASILLAS MIRANDA              ","11DPT0005M",null,null,null,"X",null,null,null,null,null,null,null,null,null,null,null,1,null,null,42334.31]
[null,"GUANAJUATO","CAML820820U36","CAML820820HGTNNS09  ","LUIS MIGUEL CANO MENDOZA                ","11DPT0013V",null,null,null,"X",null,null,null,null,null,null,null,null,null,null,null,1,null,null,62726.2]
[null,"GUANAJUATO","CANS730714K3A","CANS730714MGTSTR04  ","SARA CASTILLO NIETO                     ","11DPT0005M",null,null,null,"X",null,null,null,null,null,null,null,null,null,null,null,1,null,null,43680.82]
[null,"GUANAJUATO","CAPE530526869","CAPE530526MGTRRL07  "," M.ELENA CARDIEL PEREZ                  ","11DPT0007K",null,null,null,"X",null,null,null,null,null,null,null,null,null,null,null,1,null,null,84090.950000000012]
[null,"GUANAJUATO","CAPR810416EKA","CAPR810416HGTLRB07  ","ROBERTO CALDERON PEREZ                  ","11DPT0002P",null,null,null,"X",null,null,null,null,null,null,null,null,null,null,null,1,null,null,62916.84]
[null,"GUANAJUATO","CARM520206UK0","CARM520206HGTBCR09  ","MARIO CABRERA RICO                      ","11DPT0001Q",null,null,null,null,null,null,null,null,null,null,null,null,"X",null,null,1,null,null,96028.53]
[null,"GUANAJUATO","CASI750121969","CASI750121HGTSNS13  ","ISAAC CASTRO SANTILLANES                ","11DPT0002P",null,null,null,"X",null,null,null,null,null,null,null,null,null,null,null,1,null,null,43744.26]
[null,"GUANAJUATO","CAUF560705QGA","CAUF560705HGTHRL05  ","FILOMENO CHAGOYA URRUTIA                ","11DPT0007K",null,null,null,"X",null,null,null,null,null,null,null,null,null,null,null,1,null,null,38712.050000000003]
[null,"GUANAJUATO","CAJU780116N75","CAXJ780116HGTMXN05  ","JUAN JOSE CAMACHO                       ","11APT0001T",null,null,null,"X",null,null,null,null,null,null,null,null,null,null,null,1,null,null,93161.760000000009]
[null,"GUANAJUATO","CEFS680324L40","CEFS680324HJCRLL06  ","SAUL CERPA FLORES                       ","11DPT0001Q",null,null,null,"X",null,null,null,null,null,null,null,null,null,null,null,1,null,null,33330.659999999996]
[null,"GUANAJUATO","CEOS781213SN3","CEOS781213HGTBCL07  ","SALOMON CEBALLOS OCHOA                  ","11DPT0002P",null,null,null,null,null,null,null,null,null,null,null,null,"X",null,null,1,null,null,94180.54]
[null,"GUANAJUATO","CESA870418K76","CESA870418MGTRMN08  ","ANA GABRIELA CERVERA SAMANO             ","11APT0001T",null,null,null,"X",null,null,null,null,null,null,null,null,null,null,null,1,null,null,36737.75]
[null,"GUANAJUATO","CEVB731120C46","CEVB731120HGTDRR00  ","BERNARDO CEDILLO VERA                   ","11DPT0014U",null,null,null,"X",null,null,null,null,null,null,null,null,null,null,null,1,null,null,42828.48000000001]
[null,"GUANAJUATO","CIGP680809983","CIGP680809HGTDRB07  ","PABLO MARTIN CID GARCIA                 ","11DPT0006L",null,null,null,"X",null,null,null,null,null,null,null,null,null,null,null,1,null,null,112433.58]
[null,"GUANAJUATO","COAD7908184B7","COAD790818MGTVRN00  ","DENY COVARRUBIAS ARREGUIN               ","11DPT0005M",null,null,null,"X",null,null,null,null,null,null,null,null,null,null,null,1,null,null,31016.809999999998]
[null,"GUANAJUATO","COCA760915JU4","COCA760915HGTRLL02  ","ALEJANDRO CORIA CALDERON                ","11DPT0002P",null,null,null,"X",null,null,null,null,null,null,null,null,null,null,null,1,null,null,29234.78]
[null,"GUANAJUATO","COCM710215JF9","COCM710215HMNBMR04  ","MARIO COBIAN CAMACHO                    ","11DPT0009I",null,null,null,"X",null,null,null,null,null,null,null,null,null,null,null,1,null,null,112433.58]
[null,"GUANAJUATO","COMI671203D76","COMI671203MGTNLR18  ","MA. IRAIS CONTRERAS MALDONADO           ","11DPT0012W",null,null,null,null,null,null,null,null,null,null,null,null,"X",null,null,1,null,null,81406.77]
[null,"GUANAJUATO","COMP630327QN2","COMP630327HGTNRB00  ","PABLO GERARDO CONTRERAS MARTINEZ        ","11DPT0006L",null,null,null,"X",null,null,null,null,null,null,null,null,null,null,null,1,null,null,124525.68]
[null,"GUANAJUATO","CORJ890525619","CORJ890525HGTRMR07  ","JORGE ARMANDO CORONA RAMIREZ            ","11DPT0010Y",null,null,null,"X",null,null,null,null,null,null,null,null,null,null,null,1,null,null,36436.559999999998]
[null,"GUANAJUATO","COVA700831PW6","COVA700831MGRNRM03  ","AMADA CONDE VERA                        ","11DPT0008J",null,null,null,"X",null,null,null,null,null,null,null,null,null,null,null,1,null,null,46009.760000000002]
[null,"GUANAJUATO","COVF720114623","COVF720114HGTNRR02  ","FRANCISCO JAVIER CONDE VERA             ","11DPT0008J",null,null,null,"X",null,null,null,null,null,null,null,null,null,null,null,1,null,null,33494.81]
[null,"GUANAJUATO","CUAC760716LS6","CUAC760716HGTVCR00  ","JOSE CARMEN NOE CUEVAS ACOSTA           ","11DPT0007K",null,null,null,null,null,null,null,null,null,null,null,null,"X",null,null,1,null,null,81406.77]
[null,"GUANAJUATO","CUHC5501119F9","CUHC550111HGTLNS08  ","CESAR CUELLAR HINOJOSA                  ","11DPT0002P",null,null,null,"X",null,null,null,null,null,null,null,null,null,null,null,1,null,null,43910.16]
[null,"GUANAJUATO","CUTR610723JC8","CUTR610723MGTLTS06  ","ROSA MARIA CUELLAR TETUAN               ","11DPT0010Y",null,null,null,"X",null,null,null,null,null,null,null,null,null,null,null,1,null,null,51411.17]
[null,"GUANAJUATO","CUVL741004T6A","CUVL741004MGTRRR08  ","LAURA CRUZ VARGAS                       ","11DPT0010Y",null,null,null,"X",null,null,null,null,null,null,null,null,null,null,null,1,null,null,116379.66]
[null,"GUANAJUATO","CUVY830805JA3","CUVY830805MGTSRH00  ","YAHAIRA ALICIA E CUESTAS VARGAS         ","11DPT0002P",null,null,null,"X",null,null,null,null,null,null,null,null,null,null,null,1,null,null,28335.65]
[null,"GUANAJUATO","CACX500817KXA","CXCA500817MGTBMN03  ","ANITA CABEZA CAMARGO                    ","11DPT0009I",null,null,null,"X",null,null,null,null,null,null,null,null,null,null,null,1,null,null,42285.72]
[null,"GUANAJUATO","DAFT8701278E1","DAFT870127MZSVLN04  ","TANIA LIZETH DAVILA FLORES              ","11DPT0003O",null,null,null,"X",null,null,null,null,null,null,null,null,null,null,null,1,null,null,29666.78]
[null,"GUANAJUATO","DEHM860518J96","DEHM860518HMCLRG02  ","MIGUEL ANGEL DELGADO HERNANDEZ          ","11DPT0002P",null,null,null,"X",null,null,null,null,null,null,null,null,null,null,null,1,null,null,34309.599999999999]
[null,"GUANAJUATO","DEJA790116B16","DEJA790116HMCLMN00  ","JOSE ANTONIO DELGADO JIMENEZ            ","11DPT0002P",null,null,null,"X",null,null,null,null,null,null,null,null,null,null,null,1,null,null,103868.32]
[null,"GUANAJUATO","DONA780620F80","DONA780620HGTMTL04  ","ALEJANDRO DOMINGUEZ NIETO               ","11DPT0002P",null,null,null,"X",null,null,null,null,null,null,null,null,null,null,null,1,null,null,29727.72]
[null,"GUANAJUATO","DOZL761001RD2","DOZL761001HMNMNS18  ","LUIS ADRIAN DOMINGUEZ ZAVALA            ","11APT0001T",null,null,null,null,null,null,null,null,null,null,null,null,"X",null,null,1,null,null,81406.77]
[null,"GUANAJUATO","DUAJ8704098Q4","DUAJ870409HGTRGR00","JORGE LUIS DURAN AGUILERA               ","11DPT0004N",null,null,null,"X",null,null,null,null,null,null,null,null,null,null,null,1,null,null,12761.81]
[null,"GUANAJUATO","DUFC8505038R7","DUFC850503MGTRLR04  ","MARIA CRUZ DURAN FLORES                 ","11DPT0010Y",null,null,null,"X",null,null,null,null,null,null,null,null,null,null,null,1,null,null,37804.800000000003]
[null,"GUANAJUATO","EACA751029DJ3","EACA751029MGTSRN06  ","MA DE LOS ANGELE ESPARZA CORONA         ","11DPT0013V",null,null,null,"X",null,null,null,null,null,null,null,null,null,null,null,1,null,null,31540.619999999995]
[null,"GUANAJUATO","EAFM570902GM4","EAFM570902HGTSLS06  ","MOISES ESTRADA FLORES                   ","11DPT0011X",null,null,null,"X",null,null,null,null,null,null,null,null,null,null,null,1,null,null,39302.07]
[null,"GUANAJUATO","EAMG8704104G8","EAMG870410MGTSRR00  ","GRECIA ROXANA ESPARZA MARES             ","11DPT0006L",null,null,null,"X",null,null,null,null,null,null,null,null,null,null,null,1,null,null,32188.620000000003]
[null,"GUANAJUATO","EAVG760111SA9","EAVG760111MGTSLD04  ","MA GUADALUPE ESPARZA VALENCIA           ","11APT0001T",null,null,null,"X",null,null,null,null,null,null,null,null,null,null,null,1,null,null,67137.58]
[null,"GUANAJUATO","EICA641219IS3","EICA641219MGTLRL01  ","ALTAGRACIA ELIZARRARAS CERVANTES        ","11DPT0009I",null,null,null,"X",null,null,null,null,null,null,null,null,null,null,null,1,null,null,49872.800000000003]
[null,"GUANAJUATO","EICA780130NQ1","EICA780130MGTSRN03  ","ANA MARIA ESPINOZA CERVANTES            ","11DPT0001Q",null,null,null,"X",null,null,null,null,null,null,null,null,null,null,null,1,null,null,35462.259999999995]
[null,"GUANAJUATO","EICT8203073V8","EICT820307HGTSRM05  ","TOMAS ROGELIO ESPINOZA CERVANTES        ","11DPT0008J",null,null,null,"X",null,null,null,null,null,null,null,null,null,null,null,1,null,null,34401.340000000004]
[null,"GUANAJUATO","EIMJ620524ID9","EIMJ620524HGTLRS02  ","JOSE ELIAS MORENO                       ","11DPT0009I",null,null,null,"X",null,null,null,null,null,null,null,null,null,null,null,1,null,null,127422.72000000002]
[null,"GUANAJUATO","EIMJ880812BK0","EIMJ880812MGTLRH07  ","JHOANA IVON ELIZALDE MARTINEZ           ","11DPT0006L",null,null,null,"X",null,null,null,null,null,null,null,null,null,null,null,1,null,null,30907.060000000005]
[null,"GUANAJUATO","EIPA861113S53","EIPA861113HGTSRB08  ","JOSE ABRAHAM ESPINOZA PORRAS            ","11APT0001T",null,null,null,"X",null,null,null,null,null,null,null,null,null,null,null,1,null,null,35201.94]
[null,"GUANAJUATO","EIPM591011QG5","EIPM591011MGTSRR09  ","MARTHA ALICIA ESPINOSA PEREZ            ","11DPT0002P",null,null,null,"X",null,null,null,null,null,null,null,null,null,null,null,1,null,null,102230.82]
[null,"GUANAJUATO","EISB881118DD0","EISB881118MGTSPT05  ","BETSAIDA MAGDALE ESPINOZA SEPULVEDA     ","11DPT0010Y",null,null,null,"X",null,null,null,null,null,null,null,null,null,null,null,1,null,null,31203.21]
[null,"GUANAJUATO","EITG6112096F3","EITG611209MDFSBD05  ","MARIA GUADALUPE ESPINOSA TABLEROS       ","11DPT0009I",null,null,null,"X",null,null,null,null,null,null,null,null,null,null,null,1,null,null,75193.320000000007]
[null,"GUANAJUATO","EIVC851005GF2","EIVC851005HGTLRR07  ","CARLOS ELIZARRARAS VARGAS               ","11DPT0009I",null,null,null,"X",null,null,null,null,null,null,null,null,null,null,null,1,null,null,30606.43]
[null,"GUANAJUATO","EUVA760924363","EUVA760924HGTSLN02  ","ANTONIO ESQUEDA VILLALON                ","11DPT0012W",null,null,null,"X",null,null,null,null,null,null,null,null,null,null,null,1,null,null,73754.62]
[null,"GUANAJUATO","FAAF540219KI2","FAAF540219MGTRGX06  ","MARIA FE FRAUSTO AGUILAR                ","11DPT0003O",null,null,null,"X",null,null,null,null,null,null,null,null,null,null,null,1,null,null,45061.2]
[null,"GUANAJUATO","FABC530210FR5","FABC530210MDFRRR00  ","MARIA DEL CARMEN FRANCO BOURET          ","11DPT0001Q",null,null,null,"X",null,null,null,null,null,null,null,null,null,null,null,1,null,null,41890.740000000005]
[null,"GUANAJUATO","FIGP640907QP7","FIGP640907HGTGRD01  ","PEDRO FIGUEROA GARCIA                   ","11DPT0005M",null,null,null,"X",null,null,null,null,null,null,null,null,null,null,null,1,null,null,42603.49]
[null,"GUANAJUATO","FOCJ7406233X9","FOCJ740623MGTLLS01  ","JOSEFINA FLORES CALVA                   ","11DPT0010Y",null,null,null,"X",null,null,null,null,null,null,null,null,null,null,null,1,null,null,49952.680000000008]
[null,"GUANAJUATO","FOGA580527FU1","FOGA580527HGTLRL09  ","ALEJANDRO FLORES GARCIA                 ","11APT0001T",null,null,null,null,null,null,null,null,null,null,null,null,"X",null,null,1,null,null,94111.31]
[null,"GUANAJUATO","FOGH740517223","FOGH740517HGTLTC07  ","HECTOR FLORES GUTIERREZ                 ","11DPT0012W",null,null,null,"X",null,null,null,null,null,null,null,null,null,null,null,1,null,null,44038.62]
[null,"GUANAJUATO","FOSA610902SG9","FOSA610902MGTLNL09  ","ALEJANDRA PATRICI FLORES SANDOVAL       ","11DPT0003O",null,null,null,"X",null,null,null,null,null,null,null,null,null,null,null,1,null,null,76523.070000000007]
[null,"GUANAJUATO","FOTE790312PL3","FOTE790312MGTLRR00  ","ERIKA DEL ROCIO FLORES TERRONES         ","11APT0001T",null,null,null,null,null,null,null,null,null,null,null,null,"X",null,null,1,null,null,81406.77]
[null,"GUANAJUATO","FOJU6701074Z1","FOXJ670107HGTLXN09  ","JUAN ANTONIO FLORES                     ","11DPT0008J",null,null,null,"X",null,null,null,null,null,null,null,null,null,null,null,1,null,null,76695.520000000004]
[null,"GUANAJUATO","GAAE770204JK3","GAAE770204MDFYLL06  ","ELIA GAYTAN ALCARAZ                     ","11DPT0014U",null,null,null,null,null,null,null,null,null,null,null,null,"X",null,null,1,null,null,94036.760000000009]
[null,"GUANAJUATO","GAAR6310249B2","GAAR631024HGTLRF01  ","RAFAEL GALLEGOS ARELLANO                ","11DPT0001Q",null,null,null,"X",null,null,null,null,null,null,null,null,null,null,null,1,null,null,42413.96]
[null,"GUANAJUATO","GABI850102NDA","GABI850102MGTRRS03  ","MARIA ISABEL GARCIA BARRIENTOS          ","11DPT0014U",null,null,null,"X",null,null,null,null,null,null,null,null,null,null,null,1,null,null,94781.760000000009]
[null,"GUANAJUATO","GACR6704153I2","GACR670415MGTRRT06  ","MARIA RITA GARCIA CERRATO               ","11DPT0004N",null,null,null,"X",null,null,null,null,null,null,null,null,null,null,null,1,null,null,42371.02]
[null,"GUANAJUATO","GAEL7112229A0","GAEL711222MGTLSLO8  ","LILIANA ESTHERLI GALLARDO ESCOBEDO      ","11APT0001T",null,null,null,null,null,null,null,null,null,null,null,null,"X",null,null,1,null,null,94111.31]
[null,"GUANAJUATO","GAFV6609298F9","GAFV660929MGTRRR06  ","VERONICA ROCIO GRANADOS FRIAS           ","11DPT0008J",null,null,null,"X",null,null,null,null,null,null,null,null,null,null,null,1,null,null,43195.539999999994]
[null,"GUANAJUATO","GAGY700725MG2","GAGY700725MGTRNS04  ","YESENIA GRANADOS GONZALEZ               ","11DPT0012W",null,null,null,null,null,null,null,null,null,null,null,null,"X",null,null,1,null,null,96187.249999999985]
[null,"GUANAJUATO","GAHA7812159G2","GAHA781215MJCMRD07  ","ADRIANA CECILIA GAMA HERNANDEZ          ","11DPT0010Y",null,null,null,"X",null,null,null,null,null,null,null,null,null,null,null,1,null,null,35626.410000000003]
[null,"GUANAJUATO","GAHJ561230M55","GAHJ561230HGTRRN04  ","JUAN GRANADOS HERNANDEZ                 ","11DPT0002P",null,null,null,"X",null,null,null,null,null,null,null,null,null,null,null,1,null,null,109032.66]
[null,"GUANAJUATO","GAJJ660505P94","GAJJ660505HGTRMN06  ","JUAN GARCIA JIMENEZ                     ","11DPT0011X",null,null,null,"X",null,null,null,null,null,null,null,null,null,null,null,1,null,null,42793.32]
[null,"GUANAJUATO","GALE770303QD2","GALE770303HGTRSD04","EDUARDO GARCIA LESSO                    ","11DPT0001Q",null,null,null,"X",null,null,null,null,null,null,null,null,null,null,null,1,null,null,7286.18]
[null,"GUANAJUATO","GALJ930324KX8","GALJ930324HGTRPN06  ","JUAN CARLOS GARCIA LOPEZ                ","11DPT0003O",null,null,null,"X",null,null,null,null,null,null,null,null,null,null,null,1,null,null,30824.65]
[null,"GUANAJUATO","GAMM680220L32","GAMM680220MGTLRR01  ","MARTHA NORMA GALLEGOS MARISCAL          ","11DPT0001Q",null,null,null,"X",null,null,null,null,null,null,null,null,null,null,null,1,null,null,43791.67]
[null,"GUANAJUATO","GAOH8102061G0","GAOH810206HDFLLM04  ","HUMBERTO ISRAEL GALVAN OLVERA           ","11DPT0001Q",null,null,null,"X",null,null,null,null,null,null,null,null,null,null,null,1,null,null,33109.300000000003]
[null,"GUANAJUATO","GARG5704245R5","GARG570424HGTRZB08  ","GABRIEL GARCIA RAZO                     ","11DPT0009I",null,null,null,"X",null,null,null,null,null,null,null,null,null,null,null,1,null,null,40241]
[null,"GUANAJUATO","GARJ840526678","GARJ840526HGTRMV04  ","JAVIER ARTURO GARCIA ROMERO             ","11DPT0007K",null,null,null,"X",null,null,null,null,null,null,null,null,null,null,null,1,null,null,35693.9]
[null,"GUANAJUATO","GARL720427FX0","GARL720427MGTRMZ12  ","LUZ MA. GARCIA ROMERO                   ","11DPT0007K",null,null,null,"X",null,null,null,null,null,null,null,null,null,null,null,1,null,null,42825.450000000004]
[null,"GUANAJUATO","GARS670416A54","GARS670416MGTRYL05  ","SILVIA GARCIA REYES                     ","11DPT0004N",null,null,null,"X",null,null,null,null,null,null,null,null,null,null,null,1,null,null,82645.459999999992]
[null,"GUANAJUATO","GASM690929112","GASM690929HDFRLR02  ","MARIO MIGUEL GARCIA SALINAS             ","11DPT0013V",null,null,null,"X",null,null,null,null,null,null,null,null,null,null,null,1,null,null,66402.340000000011]
[null,"GUANAJUATO","GATG451128UX1","GATG451128HDFYRS05  ","GUSTAVO GAYTAN TORRES                   ","11DPT0002P",null,null,null,"X",null,null,null,null,null,null,null,null,null,null,null,1,null,null,93161.760000000009]
[null,"GUANAJUATO","GAZE690718GX3","GAZE690718MGTRVL07  ","ELIZABETH GARCIA ZAVALA                 ","11DPT0004N",null,null,null,"X",null,null,null,null,null,null,null,null,null,null,null,1,null,null,44733.66]
[null,"GUANAJUATO","GIAJ670517N7A","GIAJ670517HGTRLN07  ","JUAN MANUEL GRIMALDO ALFARO             ","11DPT0001Q",null,null,null,"X",null,null,null,null,null,null,null,null,null,null,null,1,null,null,43637.9]
[null,"GUANAJUATO","GOAA770911HT1","GOAA770911MGTMLN09  ","ANA ROSA GOMEZ ALBA                     ","11DPT0005M",null,null,null,"X",null,null,null,null,null,null,null,null,null,null,null,1,null,null,63536.2]
[null,"GUANAJUATO","GOCH8410237R3","GOCH841023HGTNBC04","HECTOR HUGO GONZALEZ CABRERA            ","11DPT0008J",null,null,null,"X",null,null,null,null,null,null,null,null,null,null,null,1,null,null,10183.74]
[null,"GUANAJUATO","GOGI750427GM1","GOGI750427HMCMYS02  ","ISRAEL GOMEZ GAYTAN                     ","11DPT0012W",null,null,null,"X",null,null,null,null,null,null,null,null,null,null,null,1,null,null,111299.94]
[null,"GUANAJUATO","GOGK890902JT3","GOGK890902MGTNLR04  ","KARLA RAFAELA GONZALEZ GALLARDO         ","11DPT0001Q",null,null,null,"X",null,null,null,null,null,null,null,null,null,null,null,1,null,null,62158.880000000005]
[null,"GUANAJUATO","GOGL6009014D1","GOGL600901MGTNLN08  ","LINA ENGRACIA GONZALEZ GALLARDO         ","11DPT0007K",null,null,null,"X",null,null,null,null,null,null,null,null,null,null,null,1,null,null,47177.790000000008]
[null,"GUANAJUATO","GOLA7812182KA","GOLA781218MQTMPN05  ","ANA GLORIA GOMEZ LOPEZ                  ","11APT0001T",null,null,null,"X",null,null,null,null,null,null,null,null,null,null,null,1,null,null,72824.2]
[null,"GUANAJUATO","GOLR590503HDA","GOLR590503HGTNDB04  ","ROBERTO GONZALEZ LEDESMA                ","11DPT0005M",null,null,null,null,null,null,null,null,null,null,null,null,"X",null,null,1,null,null,81406.77]
[null,"GUANAJUATO","GOMG8812289D6","GOMG881228HQTMLB01  ","GABRIEL GOMEZ MOLINERO                  ","11DPT0001Q",null,null,null,"X",null,null,null,null,null,null,null,null,null,null,null,1,null,null,58984.240000000005]
[null,"GUANAJUATO","GOML690426EW2","GOML690426MGTNDZ08  ","LUZ ESTELA GONZALEZ MEDINA              ","11DPT0003O",null,null,null,"X",null,null,null,null,null,null,null,null,null,null,null,1,null,null,78370.240000000005]
[null,"GUANAJUATO","GONM790924B46","GONM790924HGTNVG00  ","MIGUEL ANGEL GONZALEZ NAVARRO           ","11APT0001T",null,null,null,"X",null,null,null,null,null,null,null,null,null,null,null,1,null,null,72284.2]
[null,"GUANAJUATO","GOSA530514210","GOSA530514HGTMTN06  ","JOSE ANTONIO GOMEZ SOTO                 ","11DPT0013V",null,null,null,null,null,null,null,null,null,null,null,null,"X",null,null,1,null,null,29695.82]
[null,"GUANAJUATO","GOSA4507257Y0","GOXS450725HGTNXN07  ","SANTIAGO GONZALEZ                       ","11DPT0011X",null,null,null,"X",null,null,null,null,null,null,null,null,null,null,null,1,null,null,38384.359999999993]
[null,"GUANAJUATO","GUAA600320L51","GUAA600320MGTTLL03  ","ALEJANDRA GUTIERREZ ALVAREZ             ","11DPT0002P",null,null,null,"X",null,null,null,null,null,null,null,null,null,null,null,1,null,null,40252.61]
[null,"GUANAJUATO","GUAT581022UC2","GUAT581022HGTRLD00  ","TEODORO GUERRERO ALFARO                 ","11DPT0002P",null,null,null,"X",null,null,null,null,null,null,null,null,null,null,null,1,null,null,42013.329999999994]
[null,"GUANAJUATO","GUFO930509HR3","GUFO930509MGTVRL06  ","OLIVIA GUEVARA FARFAN                   ","11DPT0006L",null,null,null,"X",null,null,null,null,null,null,null,null,null,null,null,1,null,null,30193.309999999998]
[null,"GUANAJUATO","GUFV820306TSA","GUFV820306HGRZLC04  ","VICTOR MANUEL GUZMAN FLORES             ","11DPT0003O",null,null,null,"X",null,null,null,null,null,null,null,null,null,null,null,1,null,null,98829.959999999992]
[null,"GUANAJUATO","GUGA7312084M6","GUGA731208HGTTZL01  ","ALFREDO GUTIERREZ GUZMAN                ","11DPT0013V",null,null,null,"X",null,null,null,null,null,null,null,null,null,null,null,1,null,null,37474.550000000003]
[null,"GUANAJUATO","GUGE730901EC4","GUGE730901MGTTNS07  ","ESPERANZA GUTIERREZ GONZALEZ            ","11DPT0007K",null,null,null,"X",null,null,null,null,null,null,null,null,null,null,null,1,null,null,44654.94]
[null,"GUANAJUATO","GUGM650603GP3","GUGM650603MJCTZR08  ","MA. MARTINA GUTIERREZ GUZMAN            ","11DPT0007K",null,null,null,"X",null,null,null,null,null,null,null,null,null,null,null,1,null,null,128920.26999999999]
[null,"GUANAJUATO","GUJE870107661","GUJE870107MGTTRL01  ","ELIZABETH VERONI GUTIERREZ JUAREZ       ","11APT0001T",null,null,null,"X",null,null,null,null,null,null,null,null,null,null,null,1,null,null,65494.650000000009]
[null,"GUANAJUATO","GULH680121BP6","GULH680121HDFTPR01  ","HORACIO GUTIERREZ LOPEZ                 ","11DPT0005M",null,null,null,"X",null,null,null,null,null,null,null,null,null,null,null,1,null,null,31513.920000000002]
[null,"GUANAJUATO","GULM790929U80","GULM790929HGTRGG04  ","MIGUEL ANGEL GUERRERO LAGUNA            ","11DPT0002P",null,null,null,"X",null,null,null,null,null,null,null,null,null,null,null,1,null,null,35320.99]
[null,"GUANAJUATO","GUMB860612B77","GUMB860612MGTTRL01  ","BLANCA EDITH GUTIERREZ MORENO           ","11DPT0010Y",null,null,null,"X",null,null,null,null,null,null,null,null,null,null,null,1,null,null,37254.130000000005]
[null,"GUANAJUATO","GUPD810705I4A","GUPD810705HQTRDM04  ","DOMINGO DANIEL GUERRERO PADILLA         ","11DPT0010Y",null,null,null,null,null,null,null,null,null,null,null,null,"X",null,null,1,null,null,94036.760000000009]
[null,"GUANAJUATO","GURG711212BH3","GURG711212MGTRXD01  ","MA GUADALUPE GUARDADO REA               ","11DPT0013V",null,null,null,"X",null,null,null,null,null,null,null,null,null,null,null,1,null,null,34183.64]
[null,"GUANAJUATO","GUTR690427DSA","GUTR690427MDFPRC02  ","ROCIO GUAPO TORRECILLAS                 ","11DPT0008J",null,null,null,"X",null,null,null,null,null,null,null,null,null,null,null,1,null,null,44567.01]
[null,"GUANAJUATO","GUZA720514FG4","GUZA720514MDFTVL06  ","ALEJANDRA GUTIERREZ ZAVALA              ","11DPT0009I",null,null,null,"X",null,null,null,null,null,null,null,null,null,null,null,1,null,null,42625.36]
[null,"GUANAJUATO","HEBL680226MH6","HEBL680226HDFRNS05  ","LUIS FELIPE HERRERA BUENDIA             ","11DPT0007K",null,null,null,"X",null,null,null,null,null,null,null,null,null,null,null,1,null,null,37366.44]
[null,"GUANAJUATO","HECH720907NC1","HECH720907MDFRNL01  ","HILDA HERNANDEZ CANCHOLA                ","11APT0001T",null,null,null,"X",null,null,null,null,null,null,null,null,null,null,null,1,null,null,32170.279999999995]
[null,"GUANAJUATO","HECL500618L95","HECL500618HGTRRS04  ","JOSE LUIS HERNANDEZ CORTES              ","11DPT0010Y",null,null,null,"X",null,null,null,null,null,null,null,null,null,null,null,1,null,null,43360.08]
[null,"GUANAJUATO","HECL6401228X2","HECL640122MDFRLT03  ","LETICIA HERNANDEZ CALVILLO              ","11DPT0003O",null,null,null,"X",null,null,null,null,null,null,null,null,null,null,null,1,null,null,44240.039999999994]
[null,"GUANAJUATO","HECS621213HZ5","HECS621213HGTRLR02  ","SERGIO HERNANDEZ CALDERON               ","11DPT0005M",null,null,null,"X",null,null,null,null,null,null,null,null,null,null,null,1,null,null,49853.53]
[null,"GUANAJUATO","HEFM781229PE6","HEFM781229MGTRRL06  ","MARIA MILAGROS HERNANDEZ FRAUSTO        ","11DPT0003O",null,null,null,"X",null,null,null,null,null,null,null,null,null,null,null,1,null,null,32731.3]
[null,"GUANAJUATO","HEGC870427C96","HEGC840727HCSRNR00  ","CRISTOBAL DE JES HERNANDEZ GONZALEZ     ","11DPT0012W",null,null,null,"X",null,null,null,null,null,null,null,null,null,null,null,1,null,null,30606.43]
[null,"GUANAJUATO","HEGN8708165Y4","HEGN870816MGTRRY05  ","NAYELI HERREJON GUERRERO                ","11DPT0006L",null,null,null,"X",null,null,null,null,null,null,null,null,null,null,null,1,null,null,31343.510000000002]
[null,"GUANAJUATO","HEGS590916A12","HEGS590916HGTRMR05  ","SERAFIN HERNANDEZ GAMIÑO                ","11DPT0003O",null,null,null,"X",null,null,null,null,null,null,null,null,null,null,null,1,null,null,43767.579999999994]
[null,"GUANAJUATO","HEHA830216PP3","HEHA830216MGTRRL04  ","ALMA DELIA HERNANDEZ HERNANDEZ          ","11DPT0010Y",null,null,null,"X",null,null,null,null,null,null,null,null,null,null,null,1,null,null,27884.75]
[null,"GUANAJUATO","HEHA900701UB1","HEHA900701MGTRRN03  ","ANA LETICIA HERNANDEZ HERRERA           ","11DPT0003O",null,null,null,"X",null,null,null,null,null,null,null,null,null,null,null,1,null,null,30824.65]
[null,"GUANAJUATO","HELB7109192T6","HELB710919MGTRNT04  ","BEATRIZ HERNANDEZ LONA                  ","11DPT0010Y",null,null,null,"X",null,null,null,null,null,null,null,null,null,null,null,1,null,null,42468.959999999999]
[null,"GUANAJUATO","HELJ790519GT9","HELJ790519HGTRPN03  ","JUAN MANUEL HERNANDEZ LOPEZ             ","11DPT0013V",null,null,null,"X",null,null,null,null,null,null,null,null,null,null,null,1,null,null,44551.850000000006]
[null,"GUANAJUATO","HEMG620422565","HEMG620422MGTRRR08  ","GRACIELA HERNANDEZ MARTINEZ             ","11DPT0013V",null,null,null,"X",null,null,null,null,null,null,null,null,null,null,null,1,null,null,39817.300000000003]
[null,"GUANAJUATO","HEMM6706104M9","HEMM670610MGTRNR09  ","MA. MERCEDES HERRERA MANCERA            ","11DPT0001Q",null,null,null,"X",null,null,null,null,null,null,null,null,null,null,null,1,null,null,117888.27999999998]
[null,"GUANAJUATO","HEOS630818TT9","HEOS630818MDFRRN00  ","SONIA GUADALUPE HERNANDEZ OROZCO        ","11APT0001T",null,null,null,"X",null,null,null,null,null,null,null,null,null,null,null,1,null,null,110544.18]
[null,"GUANAJUATO","HEPU760412GG8","HEPU760412HPLRRZ03  ","UZIEL HERNANDEZ PEREZ                   ","11DPT0014U",null,null,null,"X",null,null,null,null,null,null,null,null,null,null,null,1,null,null,33567.93]
[null,"GUANAJUATO","HEVL6006012YA","HEVL600601HGTRLZ00  ","J.LUZ HERNANDEZ VELAZQUEZ               ","11DPT0010Y",null,null,null,"X",null,null,null,null,null,null,null,null,null,null,null,1,null,null,37708.509999999995]
[null,"GUANAJUATO","HELU501011H62","HEXL501011HGTRXZ04  ","DE LA LUZ HERNANDEZ JOSE                ","11DPT0007K",null,null,null,"X",null,null,null,null,null,null,null,null,null,null,null,1,null,null,36546.35]
[null,"GUANAJUATO","HIMK800908LB0","HIMK800908HGTNNR04  ","KRISTIAN MANUEL HINOJOSA MONROY         ","11DPT0010Y",null,null,null,"X",null,null,null,null,null,null,null,null,null,null,null,1,null,null,32563.96]
[null,"GUANAJUATO","IAGY780906K26","IAGY780906MGTBMD00  ","YADIRA ADRIANA IBARRA GOMEZ             ","11DPT0010Y",null,null,null,"X",null,null,null,null,null,null,null,null,null,null,null,1,null,null,81615.45]
[null,"GUANAJUATO","IAVC761114FE1","IAVC761114MNTBLL00  ","CLAUDIA ELIZABET IBARRA VILLANUEVA      ","11DPT0007K",null,null,null,"X",null,null,null,null,null,null,null,null,null,null,null,1,null,null,107521.13999999998]
[null,"GUANAJUATO","JACF700609GI1","JACF700609HGTRML07  ","FELIPE JARAMILLO CAMPOS                 ","11DPT0008J",null,null,null,"X",null,null,null,null,null,null,null,null,null,null,null,1,null,null,28593.949999999997]
[null,"GUANAJUATO","JALS470121DUA","JALS470121HMNMPR04  ","SERGIO JAIMES LOPEZ                     ","11DPT0006L",null,null,null,null,null,null,null,null,null,null,null,null,"X",null,null,1,null,null,96028.53]
[null,"GUANAJUATO","JAMC821119QK9","JAMC821119MGTMSL07  ","CLAUDIA MARCELA JAIME MOSQUEDA          ","11DPT0007K",null,null,null,"X",null,null,null,null,null,null,null,null,null,null,null,1,null,null,32809.009999999995]
[null,"GUANAJUATO","JAMJ591122Q73","JAMJ591122HGTRNV07  ","JAVIER JARALEÑO MANCERA                 ","11DPT0001Q",null,null,null,"X",null,null,null,null,null,null,null,null,null,null,null,1,null,null,38842.100000000006]
[null,"GUANAJUATO","JILD710426DB9","JILD710426HGTMPR06  ","DARIO DAMIAN JIMENEZ LOPEZ              ","11DPT0011X",null,null,null,null,null,null,null,null,null,null,null,null,"X",null,null,1,null,null,96028.53]
[null,"GUANAJUATO","JIOL8008248F7","JIOL800824MGTMRZ11  ","LIZETH ARIADNA JIMENEZ ORTEGA           ","11DPT0003O",null,null,null,"X",null,null,null,null,null,null,null,null,null,null,null,1,null,null,74024.62]
[null,"GUANAJUATO","JOOM700802BM5","JOOM700802HGTYRG06  ","MIGUEL ANGEL JOYA ORTIZ                 ","11DPT0001Q",null,null,null,"X",null,null,null,null,null,null,null,null,null,null,null,1,null,null,109536.51999999999]
[null,"GUANAJUATO","JUHF791105831","JUHF791105HDFRLR06  ","FERNANDO JUAREZ HELGUERA                ","11DPT0002P",null,null,null,"X",null,null,null,null,null,null,null,null,null,null,null,1,null,null,29186.17]
[null,"GUANAJUATO","JUMH681213NW0","JUMH681213HGTRGL00  ","JOSE HILARIO JUAREZ MAGAÑA              ","11DPT0005M",null,null,null,"X",null,null,null,null,null,null,null,null,null,null,null,1,null,null,118731.53999999998]
[null,"GUANAJUATO","JUPA730712HA3","JUPA730712MGTRRN04  ","ANA LAURA JUAREZ PEREZ                  ","11DPT0006L",null,null,null,"X",null,null,null,null,null,null,null,null,null,null,null,1,null,null,46054.32]
[null,"GUANAJUATO","JUSD780922L87","JUSD780922MQTRRL03  ","DULCE MARIA JUAREZ SORIA                ","11DPT0014U",null,null,null,"X",null,null,null,null,null,null,null,null,null,null,null,1,null,null,42357.53]
[null,"GUANAJUATO","LAMA800707D83","LAMA800707HGTRRL05  ","JOSE ALEJANDRO LARA MERCADO             ","11DPT0002P",null,null,null,"X",null,null,null,null,null,null,null,null,null,null,null,1,null,null,33261.85]
[null,"GUANAJUATO","LARV631103246","LARV631103MGTRCR01  ","VERONICA LARA RICO                      ","11DPT0002P",null,null,null,"X",null,null,null,null,null,null,null,null,null,null,null,1,null,null,48852.709999999992]
[null,"GUANAJUATO","LAVD841123J58","LAVD841123HGTGRN02  ","DANIEL LAGUNA VARGAS                    ","11DPT0008J",null,null,null,"X",null,null,null,null,null,null,null,null,null,null,null,1,null,null,30149.21]
[null,"GUANAJUATO","LEAC581017M56","LEAC581017MGTDLN17  ","MARIA CONSEPCION LEDESMA ALMANZA        ","11DPT0005M",null,null,null,"X",null,null,null,null,null,null,null,null,null,null,null,1,null,null,45976.11]
[null,"GUANAJUATO","LEGJ5709056L3","LEGJ570905HGTRNS01  ","JOSE LERA GONZALEZ                      ","11DPT0008J",null,null,null,"X",null,null,null,null,null,null,null,null,null,null,null,1,null,null,39352.530000000006]
[null,"GUANAJUATO","LELE610112FLA","LELE610112MGTMRL09  ","ELSA GUADALUPE LEMUS LIRA               ","11DPT0005M",null,null,null,"X",null,null,null,null,null,null,null,null,null,null,null,1,null,null,105930.03]
[null,"GUANAJUATO","LERD770827UM0","LERD770827HGTNDM00  ","JOSE DOMINGO DE LEON RODRIGUEZ          ","11DPT0013V",null,null,null,"X",null,null,null,null,null,null,null,null,null,null,null,1,null,null,93161.760000000009]
[null,"GUANAJUATO","LILB720207HV3","LILB720207MGTNML02  ","BLANCA ESTELA LINARES LOMELI            ","11DPT0009I",null,null,null,"X",null,null,null,null,null,null,null,null,null,null,null,1,null,null,48755.21]
[null,"GUANAJUATO","LOAP6711257L7","LOAP671125HGTPGB09  ","JOSE PABLO LOPEZ AGUIRRE                ","11DPT0006L",null,null,null,"X",null,null,null,null,null,null,null,null,null,null,null,1,null,null,36198.1]
[null,"GUANAJUATO","LOBM750809KY1","LOBM750809HGTPRG01  ","MIGUEL LOPEZ BARRAGAN                   ","11DPT0002P",null,null,null,"X",null,null,null,null,null,null,null,null,null,null,null,1,null,null,35949.300000000003]
[null,"GUANAJUATO","LOCR480518KR8","LOCR480518HDFPRG01  ","ROGELIO LOPEZ CERVANTES                 ","11DPT0003O",null,null,null,"X",null,null,null,null,null,null,null,null,null,null,null,1,null,null,50623.369999999995]
[null,"GUANAJUATO","LOCV8505084R9","LOCV850508MGTPRR07  ","VERONICA LOPEZ CARDOSO                  ","11DPT0011X",null,null,null,"X",null,null,null,null,null,null,null,null,null,null,null,1,null,null,31828.17]
[null,"GUANAJUATO","LOGM731124S65","LOGM731124MMNPZN04  ","MONICA IVETT LOPEZ GUZMAN               ","11DPT0004N",null,null,null,"X",null,null,null,null,null,null,null,null,null,null,null,1,null,null,99263.82]
[null,"GUANAJUATO","LOGY890331RG1","LOGY890331MGTPZN04  ","YANNET LOPEZ GUZMAN                     ","11DPT0004N",null,null,null,"X",null,null,null,null,null,null,null,null,null,null,null,1,null,null,30080.45]
[null,"GUANAJUATO","LOLA590613UN8","LOLA590613HGTPPN00  ","ANTONIO LOPEZ LOPEZ                     ","11DPT0009I",null,null,null,"X",null,null,null,null,null,null,null,null,null,null,null,1,null,null,126481.52]
[null,"GUANAJUATO","LOLA870110SJ9","LOLA870110MGTPPL02  ","ALMA ALEJANDRA LOPEZ LOPEZ              ","11DPT0001Q",null,null,null,"X",null,null,null,null,null,null,null,null,null,null,null,1,null,null,62907.73000000001]
[null,"GUANAJUATO","LOSG55020446A","LOSG550204HGTPTL09  ","GUILLERMO LOPEZ SOTO                    ","11DPT0012W",null,null,null,"X",null,null,null,null,null,null,null,null,null,null,null,1,null,null,42132.3]
[null,"GUANAJUATO","LOVL610419CF3","LOVL610419MDFPCR09  ","MARIA DE LOURDES LOPEZ VICTORIA         ","11APT0001T",null,null,null,null,null,null,null,null,null,null,null,null,"X",null,null,1,null,null,81406.77]
[null,"GUANAJUATO","LOMA701120ND4","LOXM701120HGTPXR04  ","MARTIN EDUARDO LOPEZ                    ","11DPT0007K",null,null,null,"X",null,null,null,null,null,null,null,null,null,null,null,1,null,null,110166.29999999999]
[null,"GUANAJUATO","LOZE620109TAO","LOZE620109MGTPMV07  ","MA.EVERILDA LOPEZ ZAMORA                ","11DPT0010Y",null,null,null,"X",null,null,null,null,null,null,null,null,null,null,null,1,null,null,38144.67]
[null,"GUANAJUATO","LUBJ6301122R7","LUBJ630112HJCNCR04  ","JORGE IGNACIO LUNA BECERRA              ","11APT0001T",null,null,null,null,null,null,null,null,null,null,null,null,"X",null,null,1,null,null,239628.6]
[null,"GUANAJUATO","LUPG840320SN8","LUPG840320HGTNRD08  ","JOSE GUADALUPE LUNA PEREZ               ","11DPT0003O",null,null,null,"X",null,null,null,null,null,null,null,null,null,null,null,1,null,null,37968.25]
[null,"GUANAJUATO","LURR5303156L3","LURR530315HGTNMY04  ","RAYMUNDO LUNA RAMIREZ                   ","11DPT0004N",null,null,null,"X",null,null,null,null,null,null,null,null,null,null,null,1,null,null,112433.58]
[null,"GUANAJUATO","MABH800524BY7","MABH800524HMNRRG02  ","HUGO MARTINEZ BARRERA                   ","11DPT0002P",null,null,null,"X",null,null,null,null,null,null,null,null,null,null,null,1,null,null,93161.760000000009]
[null,"GUANAJUATO","MABM8602122N2","MABM860212MGTRRL21","MELISSA MARISELA MARTINEZ BARRIOS       ","11APT0001T",null,null,null,"X",null,null,null,null,null,null,null,null,null,null,null,1,null,null,20367.480000000003]
[null,"GUANAJUATO","MACE390728NC3","MACE390713HJCQLV03  ","EVERARDO MAQUEDA CUELLAR                ","11DPT0009I",null,null,null,"X",null,null,null,null,null,null,null,null,null,null,null,1,null,null,41307.31]
[null,"GUANAJUATO","MACP790228577","MACP790228MGTRSL06  ","MARIA DEL PILAR MARTINEZ CASTRO         ","11DPT0002P",null,null,null,"X",null,null,null,null,null,null,null,null,null,null,null,1,null,null,29234.78]
[null,"GUANAJUATO","MADB860405V48","MADB860405MGTLZL02  ","MARIA BLANCA MALAGON DIAZ               ","11DPT0010Y",null,null,null,"X",null,null,null,null,null,null,null,null,null,null,null,1,null,null,50746.82]
[null,"GUANAJUATO","MADJ760413GFA","MADJ760413HGTTZQ01  ","JOAQUIN MATA DIAZ                       ","11DPT0002P",null,null,null,"X",null,null,null,null,null,null,null,null,null,null,null,1,null,null,38505.130000000005]
[null,"GUANAJUATO","MAFJ5906036T8","MAFJ590603HGTRRN00  ","JUAN MANUEL MARTINEZ FRIAS              ","11DPT0006L",null,null,null,"X",null,null,null,null,null,null,null,null,null,null,null,1,null,null,44596.56]
[null,"GUANAJUATO","MAGB8208194P2","MAGB820819MGTLRL08  ","BLANCA ELIA MALDONADO GARCIA            ","11DPT0001Q",null,null,null,"X",null,null,null,null,null,null,null,null,null,null,null,1,null,null,62272.350000000006]
[null,"GUANAJUATO","MAGC661126AJ5","MAGC661126MGTLNR18  ","MA.CARMEN MALDONADO GONZALEZ            ","11DPT0001Q",null,null,null,"X",null,null,null,null,null,null,null,null,null,null,null,1,null,null,107797.55999999998]
[null,"GUANAJUATO","MAGE8309219C9","MAGE830921HSPLRD08  ","EDUARDO MALDONADO GARCIA                ","11DPT0014U",null,null,null,"X",null,null,null,null,null,null,null,null,null,null,null,1,null,null,95418.539999999979]
[null,"GUANAJUATO","MAGF780719PC1","MAGF780719MGTRNT03  ","FATIMA MARTINEZ GONZALEZ                ","11DPT0007K",null,null,null,"X",null,null,null,null,null,null,null,null,null,null,null,1,null,null,28856.78]
[null,"GUANAJUATO","MAHM7308144V2","MAHM730814MGTRRR07  ","MARCELA DEL PILA MARTINEZ HERNANDEZ     ","11DPT0013V",null,null,null,"X",null,null,null,null,null,null,null,null,null,null,null,1,null,null,83364.899999999994]
[null,"GUANAJUATO","MAJG650413GMA","MAJG650413HGTLRS08  ","GUSTAVO MALAGON JUAREZ                  ","11DPT0011X",null,null,null,"X",null,null,null,null,null,null,null,null,null,null,null,1,null,null,117283.01999999999]
[null,"GUANAJUATO","MALR690904B5A","MALR690904MGTRPS03  ","ROSA EUGENIA MARTINEZ LOPEZ             ","11DPT0003O",null,null,null,"X",null,null,null,null,null,null,null,null,null,null,null,1,null,null,43268.4]
[null,"GUANAJUATO","MAMJ550416EN3","MAMJ550416HMNRNS07  ","JOSE MARROQUIN MENDOZA                  ","11DPT0011X",null,null,null,"X",null,null,null,null,null,null,null,null,null,null,null,1,null,null,85724.9]
[null,"GUANAJUATO","MAMJ620217DW9","MAMJ620217HGTRNN03  ","JUAN ANTONIO MARTINEZ MONCIBAIS         ","11DPT0003O",null,null,null,"X",null,null,null,null,null,null,null,null,null,null,null,1,null,null,85572.760000000009]
[null,"GUANAJUATO","MAMM8504029T1","MAMM850402MGTLLS09  ","MASSIEL MALDONADO MALDONADO             ","11DPT0011X",null,null,null,"X",null,null,null,null,null,null,null,null,null,null,null,1,null,null,33254.07]
[null,"GUANAJUATO","MANR8209073S1","MANR820907HGTCGT04  ","RITO MACIAS NEGRETE                     ","11APT0001T",null,null,null,null,null,null,null,null,null,null,null,null,"X",null,null,1,null,null,94111.31]
[null,"GUANAJUATO","MAOJ7405168FA","MAOJ740516MGTRCN05  ","JUANA MARTINEZ OCHOA                    ","11APT0001T",null,null,null,"X",null,null,null,null,null,null,null,null,null,null,null,1,null,null,103850.82]
[null,"GUANAJUATO","MAPU730620D62","MAPU730620HGTRRL07  ","ULISES MARQUEZ DE LA PARRA              ","11DPT0013V",null,null,null,null,null,null,null,null,null,null,null,null,"X",null,null,1,null,null,58340.119999999995]
[null,"GUANAJUATO","MARM6405079G7","MARM640507HGTGVR02  ","MARTIN MAGAÑA RIVERA                    ","11DPT0009I",null,null,null,"X",null,null,null,null,null,null,null,null,null,null,null,1,null,null,111111]
[null,"GUANAJUATO","MATF6010095M3","MATF601009HGTGFR00  ","FRANCISCO MAGAÑA TAFOYA                 ","11DPT0009I",null,null,null,"X",null,null,null,null,null,null,null,null,null,null,null,1,null,null,46380.520000000004]
[null,"GUANAJUATO","MATM660127FH7","MATM660127MGTGFN01  ","MONICA MAGAÑA TAFOYA                    ","11DPT0009I",null,null,null,"X",null,null,null,null,null,null,null,null,null,null,null,1,null,null,52865.73000000001]
[null,"GUANAJUATO","MAVR700118TS6","MAVR700118HGTRRB08  ","RUBEN MARTINEZ VARELA                   ","11DPT0010Y",null,null,null,"X",null,null,null,null,null,null,null,null,null,null,null,1,null,null,121628.58]
[null,"GUANAJUATO","MAZC650708TU1","MAZC650708MGTQRR01  ","MARIA CARMEN MAQUEDA ZARATE             ","11DPT0009I",null,null,null,"X",null,null,null,null,null,null,null,null,null,null,null,1,null,null,39146.109999999993]
[null,"GUANAJUATO","MAZR720405LB8","MAZR720405HMNRTC01  ","RICARDO MARTINEZ ZETINA                 ","11DPT0006L",null,null,null,"X",null,null,null,null,null,null,null,null,null,null,null,1,null,null,56372.36]
[null,"GUANAJUATO","MEAE910606I30","MEAE910606HGTJGD01  ","EDGAR EMMANUEL MEJIA AGUILA             ","11DPT0002P",null,null,null,"X",null,null,null,null,null,null,null,null,null,null,null,1,null,null,28797.369999999995]
[null,"GUANAJUATO","MEEA7012162L2","MEEA701216HZSZSR04  ","ARTURO MEZA ESPARZA                     ","11APT0001T",null,null,null,null,null,null,null,null,null,null,null,null,"X",null,null,1,null,null,119341.85]
[null,"GUANAJUATO","MEES880125B67","MEES880125MGTZSN02  ","SANDRA MARGARITA MEZA ESTRADA           ","11DPT0013V",null,null,null,"X",null,null,null,null,null,null,null,null,null,null,null,1,null,null,35515.909999999996]
[null,"GUANAJUATO","MEGG6410124T0","MEGG641012MGTDRL06  ","GLORIA MEDINA GARCIA                    ","11DPT0005M",null,null,null,"X",null,null,null,null,null,null,null,null,null,null,null,1,null,null,40048.619999999995]
[null,"GUANAJUATO","MEGR631011V43","MEGR631011MGTNRS04  ","ROSA MENDEZ GARCIA                      ","11DPT0004N",null,null,null,"X",null,null,null,null,null,null,null,null,null,null,null,1,null,null,38868.589999999997]
[null,"GUANAJUATO","MELN680719F21","MELN680719MGTLDR00  ","NORMA LETICIA MELGOZA LEDESMA           ","11DPT0001Q",null,null,null,"X",null,null,null,null,null,null,null,null,null,null,null,1,null,null,42759.09]
[null,"GUANAJUATO","MEME901101QT3","MEME901101MGTNRL08  ","MARIA ELENA MENDOZA MARTINEZ            ","11DPT0014U",null,null,null,"X",null,null,null,null,null,null,null,null,null,null,null,1,null,null,36834.14]
[null,"GUANAJUATO","MEMM670521N64","MEMM670521MDFDJR03  ","MARTHA PATRICIA MEDEL MEJIA             ","11DPT0005M",null,null,null,"X",null,null,null,null,null,null,null,null,null,null,null,1,null,null,52779.989999999991]
[null,"GUANAJUATO","MEMM740704297","MEMM740704MDFDRR03  ","MIRNA MEDINA MARIN                      ","11DPT0001Q",null,null,null,"X",null,null,null,null,null,null,null,null,null,null,null,1,null,null,33061.65]
[null,"GUANAJUATO","MERA680725T53","MERA680725MGTJML04  ","ALMA DELIA MEJIA RAMOS                  ","11DPT0009I",null,null,null,"X",null,null,null,null,null,null,null,null,null,null,null,1,null,null,42275.64]
[null,"GUANAJUATO","MERE680309FN1","MERE680309HDFDVD07  ","EDGAR RUBEN MEDINA RIVERO               ","11APT0001T",null,null,null,null,null,null,null,null,null,null,null,null,"X",null,null,1,null,null,37378.76]
[null,"GUANAJUATO","MEVJ760816A58","MEVJ760816HGTJLL19  ","JULIO ENRIQUE MEJIA VILLANUEVA          ","11DPT0002P",null,null,null,"X",null,null,null,null,null,null,null,null,null,null,null,1,null,null,111069.03]
[null,"GUANAJUATO","MIAO8312189C2","MIAO831218HDFLPM04  ","OMAR MILLAN APUD                        ","11DPT0001Q",null,null,null,"X",null,null,null,null,null,null,null,null,null,null,null,1,null,null,59935.039999999994]
[null,"GUANAJUATO","MIHG8606185P2","MIHG860618MDFRRB06  ","GABRIELA MIRAMONTES HERNANDEZ           ","11DPT0014U",null,null,null,"X",null,null,null,null,null,null,null,null,null,null,null,1,null,null,27387.93]
[null,"GUANAJUATO","MIRA590513QB0","MIRA590513HGTRMR01  ","JOSE ARMANDO MIRANDA RAMOS              ","11DPT0002P",null,null,null,"X",null,null,null,null,null,null,null,null,null,null,null,1,null,null,43174.29]
[null,"GUANAJUATO","MOFD480314HT2","MOFD480314HGTRLL00  ","JOSE DOLORES MORALES FLORES             ","11DPT0008J",null,null,null,"X",null,null,null,null,null,null,null,null,null,null,null,1,null,null,41690.269999999997]
[null,"GUANAJUATO","MOFD741006FM4","MOFD741006HGTSLV05  ","DAVID MOSQUEDA FLORES                   ","11DPT0014U",null,null,null,"X",null,null,null,null,null,null,null,null,null,null,null,1,null,null,38085.15]
[null,"GUANAJUATO","MOFY680125UV7","MOFY680125MGTSLL00  ","YOLANDA MOSQUEDA FLORES                 ","11DPT0002P",null,null,null,"X",null,null,null,null,null,null,null,null,null,null,null,1,null,null,43919.82]
[null,"GUANAJUATO","MOGM581228P96","MOGM581228MGTRNR09  ","MARTHA DEL CARME MORENO GONZALEZ        ","11APT0001T",null,null,null,"X",null,null,null,null,null,null,null,null,null,null,null,1,null,null,46840.320000000007]
[null,"GUANAJUATO","MOHA6909151AA","MOHA690915MGTRRN03  ","ANDREA MORALES HERNANDEZ                ","11DPT0001Q",null,null,null,"X",null,null,null,null,null,null,null,null,null,null,null,1,null,null,34630.400000000001]
[null,"GUANAJUATO","MOJC851117J2A","MOJC851117MGTRST08  ","CITLALLI TONANCI MORA JASSO             ","11DPT0014U",null,null,null,"X",null,null,null,null,null,null,null,null,null,null,null,1,null,null,99465.010000000009]
[null,"GUANAJUATO","MOLJ6908066K2","MOLJ690806HGTNRN01  ","JUAN ANTONIO MONTALVO LIRA              ","11DPT0013V",null,null,null,"X",null,null,null,null,null,null,null,null,null,null,null,1,null,null,65040.800000000003]
[null,"GUANAJUATO","MOMA590424218","MOMA590424HGTNLN04  ","JOSE ANTONIO MONCADA MALDONADO          ","11DPT0011X",null,null,null,"X",null,null,null,null,null,null,null,null,null,null,null,1,null,null,43268.4]
[null,"GUANAJUATO","MORA580316U78","MORA580316HGTJML06  ","ALEJANDRO MOJICA RAMIREZ                ","11DPT0007K",null,null,null,"X",null,null,null,null,null,null,null,null,null,null,null,1,null,null,45029.15]
[null,"GUANAJUATO","MORM6501066X7","MORM650106HGTRSL00  ","MELCHOR BENITO MORENO ROSALES           ","11DPT0005M",null,null,null,"X",null,null,null,null,null,null,null,null,null,null,null,1,null,null,118221.59999999999]
[null,"GUANAJUATO","MORM731010QZ9","MORM731010MVZLZR03  ","MIRSA MARICELA MOLGORA RAZO             ","11DPT0004N",null,null,null,null,null,null,null,null,null,null,null,null,"X",null,null,1,null,null,94036.760000000009]
[null,"GUANAJUATO","MORM8011214B7","MORM801121HDFRMN03","MANUEL EFRAIN MORENO ROMERO             ","11DPT0005M",null,null,null,"X",null,null,null,null,null,null,null,null,null,null,null,1,null,null,16972.900000000001]
[null,"GUANAJUATO","MOSJ790615LD6","MOSJ790615HGTLNN00  ","JUAN MOLINA SANCHEZ                     ","11DPT0006L",null,null,null,"X",null,null,null,null,null,null,null,null,null,null,null,1,null,null,33801.96]
[null,"GUANAJUATO","MOSP780508DF7","MOSP780508HGTLND02  ","PEDRO MOLINA SANCHEZ                    ","11DPT0006L",null,null,null,"X",null,null,null,null,null,null,null,null,null,null,null,1,null,null,42473.27]
[null,"GUANAJUATO","MUHA861028V94","MUHA861028HGTXRD02  ","JOSE ADAN MUÑOZ HERNANDEZ               ","11DPT0012W",null,null,null,"X",null,null,null,null,null,null,null,null,null,null,null,1,null,null,27884.75]
[null,"GUANAJUATO","MUPT600105IQ9","MUPT600105MGTRRR07  ","MA. TRINIDAD MURILLO PEREZ              ","11DPT0007K",null,null,null,"X",null,null,null,null,null,null,null,null,null,null,null,1,null,null,38244.46]
[null,"GUANAJUATO","MUSF920131CIA","MUSF920131MGTXCR06  ","MARIA FERNANDA MUÑOZ SAUCILLO           ","11DPT0001Q",null,null,null,"X",null,null,null,null,null,null,null,null,null,null,null,1,null,null,30401.21]
[null,"GUANAJUATO","MUVA591117ID0","MUVA591117HGTRGN01  ","ANTONIO MURILLO VEGA                    ","11DPT0011X",null,null,null,"X",null,null,null,null,null,null,null,null,null,null,null,1,null,null,41240.239999999998]
[null,"GUANAJUATO","NAAA9105064C6","NAAA910506MGTCRN09  ","ANDREA BERENICE NACHEZ ARREDONDO        ","11APT0001T",null,null,null,"X",null,null,null,null,null,null,null,null,null,null,null,1,null,null,67633.900000000009]
[null,"GUANAJUATO","NAME6411037H1","NAME641103MDFVDV03  ","EVA NAVARRO MADRIGAL                    ","11DPT0003O",null,null,null,"X",null,null,null,null,null,null,null,null,null,null,null,1,null,null,34338.840000000004]
[null,"GUANAJUATO","NAQI780206S92","NAQI780206HDFVXV07  ","IVAN AGUSTIN NAVARRETE QUIÑONES         ","11DPT0014U",null,null,null,"X",null,null,null,null,null,null,null,null,null,null,null,1,null,null,35498.26]
[null,"GUANAJUATO","NAVS621206356","NAVS621206MGTVLN00  ","SANDRA JUANA NAVA VELAZQUEZ             ","11DPT0006L",null,null,null,"X",null,null,null,null,null,null,null,null,null,null,null,1,null,null,78431.520000000004]
[null,"GUANAJUATO","NECL411005F85","NECL411005HGTGRS08  ","LUIS NEGRETE CRUZ                       ","11DPT0009I",null,null,null,"X",null,null,null,null,null,null,null,null,null,null,null,1,null,null,39735.659999999996]
[null,"GUANAJUATO","NIHE721201VC3","NIHE721201HGTTRS04  ","EUSEBIO MIGUEL A NIETO HERNANDEZ        ","11DPT0001Q",null,null,null,"X",null,null,null,null,null,null,null,null,null,null,null,1,null,null,33302.259999999995]
[null,"GUANAJUATO","NIMA711025LJ1","NIMA711025MGTTRL07  ","ALICIA NIETO MARTINEZ                   ","11DPT0005M",null,null,null,"X",null,null,null,null,null,null,null,null,null,null,null,1,null,null,41098.799999999996]
[null,"GUANAJUATO","NIMT691014GT1","NIMT691014MGTTRR05  ","TERESITA NIETO MARTINEZ                 ","11DPT0011X",null,null,null,"X",null,null,null,null,null,null,null,null,null,null,null,1,null,null,33954.78]
[null,"GUANAJUATO","NIPD811108TF1","NIPD811108HBCTSN09  ","DANIEL NIETO PASCALIS                   ","11DPT0003O",null,null,null,null,null,null,null,null,null,null,null,null,"X",null,null,1,null,null,96028.53]
[null,"GUANAJUATO","NIRA700123GK9","NIRA700123MGTTVN01  ","ANA LAURA NIETO RIVERA                  ","11DPT0003O",null,null,null,"X",null,null,null,null,null,null,null,null,null,null,null,1,null,null,117195.53999999998]
[null,"GUANAJUATO","NIRG591215T84","NIRG591215MGTTVR06  ","GEORGINA DE LOURD NIETO RIVERA          ","11DPT0007K",null,null,null,null,null,null,null,null,null,null,null,null,"X",null,null,1,null,null,96028.53]
[null,"GUANAJUATO","NUBS660923MR4","NUBS660923MGTXRL07  ","MA.SILVIA NUÑEZ BARRERA                 ","11DPT0001Q",null,null,null,"X",null,null,null,null,null,null,null,null,null,null,null,1,null,null,46200.6]
[null,"GUANAJUATO","OAGS860412RP6","OAGS860412MGTRTR05  ","SARA DEL ROSARIO ORRANTI GUTIERREZ      ","11DPT0010Y",null,null,null,"X",null,null,null,null,null,null,null,null,null,null,null,1,null,null,35130.340000000004]
[null,"GUANAJUATO","OAMC600520F43","OAMC600520HSLLLR01  ","CARLOS JAVIER OLAVEZ MELESIO            ","11DPT0001Q",null,null,null,"X",null,null,null,null,null,null,null,null,null,null,null,1,null,null,44759.53]
[null,"GUANAJUATO","OELW670610C88","OELW670610HGTLDN06  ","WENSESLAO OLVERA LEDESMA                ","11DPT0012W",null,null,null,"X",null,null,null,null,null,null,null,null,null,null,null,1,null,null,43602.37]
[null,"GUANAJUATO","OERM770419UD7","OERM770419HGTLSG03  ","MIGUEL ANGEL OLVERA RESENDIZ            ","11DPT0012W",null,null,null,"X",null,null,null,null,null,null,null,null,null,null,null,1,null,null,37411.619999999995]
[null,"GUANAJUATO","OESM7609303HA","OESM760930MQTLTR09  ","MARIBEL OLVERA SOTO                     ","11DPT0012W",null,null,null,"X",null,null,null,null,null,null,null,null,null,null,null,1,null,null,83364.899999999994]
[null,"GUANAJUATO","OETL661122IZ6","OETL661122MGTRRZ06  ","LUZ CECILIA ORTEGA TORRES               ","11DPT0008J",null,null,null,"X",null,null,null,null,null,null,null,null,null,null,null,1,null,null,36191.58]
[null,"GUANAJUATO","OEVL65021376A","OEVL650213MGTRLR01  ","LAURA INES ORTEGA VALADEZ               ","11DPT0004N",null,null,null,"X",null,null,null,null,null,null,null,null,null,null,null,1,null,null,125372.42000000001]
[null,"GUANAJUATO","OIHA541221R95","OIHA541221HGTRRL04  ","ALFONSO ORTIZ HERNANDEZ                 ","11DPT0007K",null,null,null,"X",null,null,null,null,null,null,null,null,null,null,null,1,null,null,45517.920000000006]
[null,"GUANAJUATO","OILP6802156K9","OILP680215MDFVGL09  ","MARIA DEL PILAR OVIEDO LUGO             ","11DPT0007K",null,null,null,"X",null,null,null,null,null,null,null,null,null,null,null,1,null,null,40329.600000000006]
[null,"GUANAJUATO","OING5906128T6","OING590612HGTRCS02  ","GUSTAVO ORTIZ NICASIO                   ","11APT0001T",null,null,null,"X",null,null,null,null,null,null,null,null,null,null,null,1,null,null,47436.23]
[null,"GUANAJUATO","OIOM621117BE8","OIOM621117HGTLLN02  ","MANUEL MARTIN OLIVA OLIVA               ","11DPT0003O",null,null,null,"X",null,null,null,null,null,null,null,null,null,null,null,1,null,null,55800.929999999993]
[null,"GUANAJUATO","OOCM7903122F9","OOCM790312MGTRRR03  ","MARCELA OROZCO CORNEJO                  ","11DPT0014U",null,null,null,"X",null,null,null,null,null,null,null,null,null,null,null,1,null,null,71181.34]
[null,"GUANAJUATO","OUGM7012272G3","OUGM701227MGTRRN03  ","MONICA ORDUNA GARCIA                    ","11DPT0005M",null,null,null,"X",null,null,null,null,null,null,null,null,null,null,null,1,null,null,32731.3]
[null,"GUANAJUATO","PACM840215MT1","PACM840215MGTLRR00  ","MAURA ANGELICA PALOMINO CARREÑO         ","11DPT0005M",null,null,null,"X",null,null,null,null,null,null,null,null,null,null,null,1,null,null,25278.630000000005]
[null,"GUANAJUATO","PACS8101228Y0","PACS810122MGTLRR02  ","SARA PALOMINO CARREÑO                   ","11DPT0001Q",null,null,null,"X",null,null,null,null,null,null,null,null,null,null,null,1,null,null,30686.300000000003]
[null,"GUANAJUATO","PAGA670111I35","PAGA670111HNTLRR03  ","ARMANDO PALOMARES GARCIA                ","11DPT0013V",null,null,null,"X",null,null,null,null,null,null,null,null,null,null,null,1,null,null,110166.29999999999]
[null,"GUANAJUATO","PAGM5802105H5","PAGM580210HNTLRT06  ","MATIAS PALOMARES GARCIA                 ","11DPT0005M",null,null,null,"X",null,null,null,null,null,null,null,null,null,null,null,1,null,null,31672.05]
[null,"GUANAJUATO","PAGR7307144R1","PAGR730714MGTNMF00  ","MARIA DEL REFUGIO PANTOJA GOMEZ         ","11DPT0004N",null,null,null,"X",null,null,null,null,null,null,null,null,null,null,null,1,null,null,42408.539999999994]
[null,"GUANAJUATO","PAHM630123LJ6","PAHM630123HGTNRN05  ","MANUEL PANTOJA HERRERA                  ","11DPT0006L",null,null,null,"X",null,null,null,null,null,null,null,null,null,null,null,1,null,null,124042.84]
[null,"GUANAJUATO","PAJJ830708SK1","PAJJ830708HQTTMR06  ","JORGE ADALBERTO PATINO JIMENEZ          ","11DPT0008J",null,null,null,"X",null,null,null,null,null,null,null,null,null,null,null,1,null,null,36137.42]
[null,"GUANAJUATO","PALM711130LV9","PALM711130HGTRGG02  ","MIGUEL ANGEL PARAMO LAGUNA              ","11DPT0002P",null,null,null,"X",null,null,null,null,null,null,null,null,null,null,null,1,null,null,38269.69]
[null,"GUANAJUATO","PAPA810618AR6","PAPA810618HGTLLB03","ABRAHAM PALACIOS PALACIOS               ","11DPT0003O",null,null,null,"X",null,null,null,null,null,null,null,null,null,null,null,1,null,null,20367.480000000003]
[null,"GUANAJUATO","PAPM510404DG5","PAPM510404MGTNCR08  ","MARIA PANIAGUA PICAZO                   ","11DPT0006L",null,null,null,"X",null,null,null,null,null,null,null,null,null,null,null,1,null,null,31629.079999999994]
[null,"GUANAJUATO","PAZR620620HP0","PAZR620620MGTCPQ07  ","RAQUEL PACHECO ZAPIEN                   ","11DPT0007K",null,null,null,"X",null,null,null,null,null,null,null,null,null,null,null,1,null,null,85572.760000000009]
[null,"GUANAJUATO","PECE671111QE4","PECE671111HDFRSL09  ","ELOY MARTIN PEREZ CASTILLO              ","11DPT0012W",null,null,null,"X",null,null,null,null,null,null,null,null,null,null,null,1,null,null,114700.85999999999]
[null,"GUANAJUATO","PEGL590326TB4","PEGL590326MGTRMZ05  ","LUZ ELENA PERALES GOMEZ                 ","11APT0001T",null,null,null,"X",null,null,null,null,null,null,null,null,null,null,null,1,null,null,41226.11]
[null,"GUANAJUATO","PELI680925LM6","PELI680925MGTDPV03  ","IVONNE YOLANDA PEDROZA LOPEZ            ","11APT0001T",null,null,null,"X",null,null,null,null,null,null,null,null,null,null,null,1,null,null,118731.53999999998]
[null,"GUANAJUATO","PELL790204HW5","PELL790204MNTRRC05  ","LUCIA PEREZ LARA                        ","11DPT0010Y",null,null,null,"X",null,null,null,null,null,null,null,null,null,null,null,1,null,null,40699.980000000003]
[null,"GUANAJUATO","PESE6410262J8","PESE641026HTSRNR02  ","ERNESTO PEREZ SANCHEZ                   ","11APT0001T",null,null,null,null,null,null,null,null,null,null,null,null,"X",null,null,1,null,null,94111.31]
[null,"GUANAJUATO","PEVG640422LA3","PEVG640422MGTRRR00  ","GEORGINA SOLEDAD PEREZ VERA             ","11DPT0002P",null,null,null,"X",null,null,null,null,null,null,null,null,null,null,null,1,null,null,49101.62999999999]
[null,"GUANAJUATO","PIAR680730PSA","PIAR680730MGTRGG01  ","MARIA REGINA PRIETO AGUILAR             ","11DPT0005M",null,null,null,"X",null,null,null,null,null,null,null,null,null,null,null,1,null,null,84946.48000000001]
[null,"GUANAJUATO","POGA630408KE8","POGA630408MGTNRD08  ","MARIA ADRIANA PONCE GARCIA              ","11DPT0002P",null,null,null,"X",null,null,null,null,null,null,null,null,null,null,null,1,null,null,44787.74]
[null,"GUANAJUATO","POGA790726B24","POGA790726MGTNZL05  ","ALMA DELIA PONCE GUZMAN                 ","11DPT0012W",null,null,null,"X",null,null,null,null,null,null,null,null,null,null,null,1,null,null,41503.929999999993]
[null,"GUANAJUATO","POMR6708302N1","POMR670830MGTRNS05  ","ROSA MARIA PORRAS MANRIQUE              ","11DPT0007K",null,null,null,"X",null,null,null,null,null,null,null,null,null,null,null,1,null,null,80167.47]
[null,"GUANAJUATO","POPG430527TB7","POPG430527HGTRDD09  ","J. GUADALUPE PORRAS PADILLA             ","11APT0001T",null,null,null,"X",null,null,null,null,null,null,null,null,null,null,null,1,null,null,40784.629999999997]
[null,"GUANAJUATO","PUAJ821120LU8","PUAJ821120MJCGLN05  ","JUANA PUGA ALDANA                       ","11APT0001T",null,null,null,"X",null,null,null,null,null,null,null,null,null,null,null,1,null,null,32611.62]
[null,"GUANAJUATO","QUDW870430HH4","QUDW870430MGTNMN07  ","WENDY YAZMIN QUINTANA DOMINGUEZ         ","11DPT0006L",null,null,null,"X",null,null,null,null,null,null,null,null,null,null,null,1,null,null,38272.61]
[null,"GUANAJUATO","QUGE620101NK4","QUGE620101HGTNRF01  ","EFRAIN QUINTANA GARCIA                  ","11DPT0001Q",null,null,null,"X",null,null,null,null,null,null,null,null,null,null,null,1,null,null,33897.4]
[null,"GUANAJUATO","QUZJ6303282J5","QUZJ630328HSRLNN05  ","JUAN QUILES ZUNO                        ","11APT0001T",null,null,null,"X",null,null,null,null,null,null,null,null,null,null,null,1,null,null,44165.760000000002]
[null,"GUANAJUATO","RAAE850827HM7","RAAE850827MGTMNL05  ","ELVIA RAMIREZ ANDRADE                   ","11DPT0007K",null,null,null,"X",null,null,null,null,null,null,null,null,null,null,null,1,null,null,42154.43]
[null,"GUANAJUATO","RAAG5908278S6","RAAG590827HMNNBL08  ","GUILLERMO RANGEL ABURTO                 ","11DPT0001Q",null,null,null,"X",null,null,null,null,null,null,null,null,null,null,null,1,null,null,50240.989999999991]
[null,"GUANAJUATO","RAAI811229BW5","RAAI811229MMCMNS05  ","MARIA ISABEL RAMIREZ ANDRADE            ","11DPT0014U",null,null,null,"X",null,null,null,null,null,null,null,null,null,null,null,1,null,null,47614.69]
[null,"GUANAJUATO","RABF730512PD1","RABF730512HGTMLD04  ","JOSE FIDEL RAMIREZ BELMAN               ","11APT0001T",null,null,null,null,null,null,null,null,null,null,null,null,"X",null,null,1,null,null,94111.31]
[null,"GUANAJUATO","RABR820601BH9","RABR820601HGTMND08  ","RODOLFO OSVALDO RAMIREZ BUENO           ","11DPT0010Y",null,null,null,"X",null,null,null,null,null,null,null,null,null,null,null,1,null,null,40961.459999999992]
[null,"GUANAJUATO","RACA8011159T0","RACA801115MGTMRD05  ","ADELA RAMIREZ CERRITOS                  ","11DPT0008J",null,null,null,"X",null,null,null,null,null,null,null,null,null,null,null,1,null,null,34664.300000000003]
[null,"GUANAJUATO","RACB5510265G3","RACB551026HGTMSN05  ","BENITO RAMIREZ CASTILLO                 ","11DPT0011X",null,null,null,"X",null,null,null,null,null,null,null,null,null,null,null,1,null,null,43643.199999999997]
[null,"GUANAJUATO","RAEL8409015U2","RAEL840901MGTMSR07  ","LAURA PATRICIA RAMOS ESTRADA            ","11APT0001T",null,null,null,"X",null,null,null,null,null,null,null,null,null,null,null,1,null,null,94727.459999999992]
[null,"GUANAJUATO","RAFA620326696","RAFA620326HGTMNN00  ","JOSE ANTONIO RAMIREZ FUENTES            ","11DPT0005M",null,null,null,"X",null,null,null,null,null,null,null,null,null,null,null,1,null,null,123077.16]
[null,"GUANAJUATO","RAFG691106392","RAFG691106HGTMRR04  ","GERARDO RAMIREZ FERNANDEZ               ","11DPT0008J",null,null,null,null,null,null,null,null,null,null,null,null,"X",null,null,1,null,null,94036.760000000009]
[null,"GUANAJUATO","RAGC520726TJ0","RAGC520726MGTYNR12  ","MARIA CARMEN RAYA GONZALEZ              ","11DPT0009I",null,null,null,"X",null,null,null,null,null,null,null,null,null,null,null,1,null,null,47967.380000000005]
[null,"GUANAJUATO","RAGJ8207054L2","RAGJ820705HGTNMN05  ","JUAN ANTONIO RANGEL GOMEZ               ","11DPT0010Y",null,null,null,"X",null,null,null,null,null,null,null,null,null,null,null,1,null,null,38244.81]
[null,"GUANAJUATO","RAGT730306AI0","RAGT730306HGTNRR07  ","JOSE TRINIDAD RANGEL GUERRERO           ","11DPT0012W",null,null,null,"X",null,null,null,null,null,null,null,null,null,null,null,1,null,null,46565.16]
[null,"GUANAJUATO","RAHJ6410105C3","RAHJ641010MGTMRS04  ","MA. DE JESUS RAMIREZ HORTA              ","11DPT0007K",null,null,null,"X",null,null,null,null,null,null,null,null,null,null,null,1,null,null,120180.06]
[null,"GUANAJUATO","RAMA640606AQ0","RAMA640606HGTNXL06  ","ALBERTO RANGEL MUÑOZ                    ","11APT0001T",null,null,null,"X",null,null,null,null,null,null,null,null,null,null,null,1,null,null,41580.779999999992]
[null,"GUANAJUATO","RAMD6103291R4","RAMD610329HGTMNV10  ","DAVID RAMIREZ MONJARAZ                  ","11APT0001T",null,null,null,"X",null,null,null,null,null,null,null,null,null,null,null,1,null,null,40655.760000000002]
[null,"GUANAJUATO","RARE590716V64","RARE590716MJCMMV05  ","EVELIA DEL CARMEN RAMIREZ RAMIREZ       ","11DPT0003O",null,null,null,"X",null,null,null,null,null,null,null,null,null,null,null,1,null,null,50128.09]
[null,"GUANAJUATO","RARP630605NP2","RARP630605HJCMMD06  ","PEDRO RAMIREZ RAMIREZ                   ","11DPT0007K",null,null,null,"X",null,null,null,null,null,null,null,null,null,null,null,1,null,null,37894.99]
[null,"GUANAJUATO","RARR701207IA9","RARR701207MDFMMT08  ","RITA RAMIREZ RAMIREZ                    ","11DPT0003O",null,null,null,"X",null,null,null,null,null,null,null,null,null,null,null,1,null,null,42891.75]
[null,"GUANAJUATO","RARR710422AB6","RARR710422HGTMDM09  ","RAMON RAMIREZ RODRIGUEZ                 ","11DPT0010Y",null,null,null,"X",null,null,null,null,null,null,null,null,null,null,null,1,null,null,73754.62]
[null,"GUANAJUATO","RASE540830U28","RASE540830HGTYLL02  ","ELEAZAR RAYAS SILVA                     ","11DPT0008J",null,null,null,"X",null,null,null,null,null,null,null,null,null,null,null,1,null,null,46689.430000000008]
[null,"GUANAJUATO","RALU580110A37","RAXL580110HGTMXS01  ","LUIS FERNANDO RAMOS                     ","11APT0001T",null,null,null,null,null,null,null,null,null,null,null,null,"X",null,null,1,null,null,81406.77]
[null,"GUANAJUATO","RELR6206286CA","RELR620628HGTYPG09  ","ROGELIO REYES LOPEZ                     ","11DPT0009I",null,null,null,"X",null,null,null,null,null,null,null,null,null,null,null,1,null,null,50762.709999999992]
[null,"GUANAJUATO","RELS650704P63","RELS650704MGTXZL00  ","MA. SOLEDAD REA LOZANO                  ","11DPT0013V",null,null,null,"X",null,null,null,null,null,null,null,null,null,null,null,1,null,null,58342.930000000008]
[null,"GUANAJUATO","RERE8505068T2","RERE850506HMNYMD04  ","EDUARDO REYES RAMIREZ                   ","11DPT0001Q",null,null,null,"X",null,null,null,null,null,null,null,null,null,null,null,1,null,null,29740.880000000001]
[null,"GUANAJUATO","RESO730809AI4","RESO730809MGTYNF03  ","OFELIA REYES SANDOVAL                   ","11DPT0014U",null,null,null,"X",null,null,null,null,null,null,null,null,null,null,null,1,null,null,40044.410000000003]
[null,"GUANAJUATO","RIAA790529868","RIAA790529MMNSGN11  ","ANA KATHERINE RIOS AGUILAR              ","11DPT0001Q",null,null,null,null,null,null,null,null,null,null,null,null,"X",null,null,1,null,null,81406.77]
[null,"GUANAJUATO","RIAC7102242N8","RIAC710224HMNSGR00  ","JOSE CARLOS RIOS AGUILAR                ","11DPT0010Y",null,null,null,"X",null,null,null,null,null,null,null,null,null,null,null,1,null,null,83364.899999999994]
[null,"GUANAJUATO","RIGA780625KX0","RIGA780625HGTVMG07  ","JOSE AUGUSTO RIVERA GOMEZ               ","11DPT0011X",null,null,null,"X",null,null,null,null,null,null,null,null,null,null,null,1,null,null,35948.06]
[null,"GUANAJUATO","RIGJ550502E94","RIGJ550502HCLVRN04  ","JOSE JUAN RIVERA GARCIA                 ","11DPT0007K",null,null,null,"X",null,null,null,null,null,null,null,null,null,null,null,1,null,null,114679.82]
[null,"GUANAJUATO","RIHM610919TU2","RIHM610919MGTCRR07  ","MARICELA RICO HERNANDEZ                 ","11DPT0008J",null,null,null,"X",null,null,null,null,null,null,null,null,null,null,null,1,null,null,31745.260000000002]
[null,"GUANAJUATO","RIHR880331D30","RIHR880331HGTSRC09  ","RICARDO RIOS HERNANDEZ                  ","11DPT0014U",null,null,null,"X",null,null,null,null,null,null,null,null,null,null,null,1,null,null,63452.350000000006]
[null,"GUANAJUATO","RIOS5803272M4","RIOS580327MZSVLC03  ","MA. DEL SOCORRO RIVERA OLVERA           ","11DPT0007K",null,null,null,"X",null,null,null,null,null,null,null,null,null,null,null,1,null,null,79096.390000000014]
[null,"GUANAJUATO","ROBA710226BG0","ROBA710226MGTBRL07  ","ALMA ROBLES BRAVO                       ","11DPT0002P",null,null,null,"X",null,null,null,null,null,null,null,null,null,null,null,1,null,null,36868.459999999992]
[null,"GUANAJUATO","ROBB6412029G0","ROBB641202MGTBRL04  ","BLANCA ESTELA ROBLES BRAVO              ","11DPT0002P",null,null,null,"X",null,null,null,null,null,null,null,null,null,null,null,1,null,null,46476.92]
[null,"GUANAJUATO","ROBY7612249Q3","ROBY761224MMCDCN00  ","YUNUEN RODRIGUEZ BECERRA                ","11DPT0001Q",null,null,null,"X",null,null,null,null,null,null,null,null,null,null,null,1,null,null,37299.120000000003]
[null,"GUANAJUATO","RODY660703MQ8","RODY660703MGTXLL07  ","YOLANDA ROA DELGADO                     ","11DPT0002P",null,null,null,"X",null,null,null,null,null,null,null,null,null,null,null,1,null,null,76538.97]
[null,"GUANAJUATO","ROEJ700824751","ROEJ700824HVZMSL05  ","JULIO CESAR ROMERO ESCOBAR              ","11DPT0001Q",null,null,null,"X",null,null,null,null,null,null,null,null,null,null,null,1,null,null,31724.75]
[null,"GUANAJUATO","ROGA640613DQ5","ROGA640613MDFJTN05  ","ANTONIA ESTELA ROJAS GUTIERREZ          ","11DPT0011X",null,null,null,"X",null,null,null,null,null,null,null,null,null,null,null,1,null,null,108843.72]
[null,"GUANAJUATO","ROGC891121D58","ROGC891121MGTJRR05","MARIA DEL CARMEN ROJAS GRANADOS         ","11DPT0002P",null,null,null,"X",null,null,null,null,null,null,null,null,null,null,null,1,null,null,20367.480000000003]
[null,"GUANAJUATO","ROGJ631018GD6","ROGJ631018HGTMRN04  ","JUAN JOSE ROMERO GARCIA                 ","11DPT0003O",null,null,null,"X",null,null,null,null,null,null,null,null,null,null,null,1,null,null,44693.64]
[null,"GUANAJUATO","ROGJ6708253EA","ROGJ670825HJCMTS04","JOSE DE JESUS ROMO GUTIERREZ            ","11APT0001T",null,null,null,null,null,null,null,null,null,null,null,null,"X",null,null,1,null,null,33880.15]
[null,"GUANAJUATO","ROGJ720412CD2","ROGJ720412HGTCNL01  ","JULIO BERNARDO ROCHA GONZALEZ           ","11DPT0007K",null,null,null,"X",null,null,null,null,null,null,null,null,null,null,null,1,null,null,44219.55]
[null,"GUANAJUATO","ROGJ7905253Y5","ROGJ790525HPLJDN05  ","JOSE JUAN ROJAS GODOY                   ","11DPT0008J",null,null,null,"X",null,null,null,null,null,null,null,null,null,null,null,1,null,null,109295.06999999998]
[null,"GUANAJUATO","ROGL591003DS4","ROGL591003MGTMNN05  ","MA.LINA TERESA ROMERO GONZALEZ          ","11DPT0007K",null,null,null,"X",null,null,null,null,null,null,null,null,null,null,null,1,null,null,37685.24]
[null,"GUANAJUATO","ROHR681221N53","ROHR681221MGTJRB00  ","RUBISELA ROJAS HUARACHA                 ","11DPT0001Q",null,null,null,"X",null,null,null,null,null,null,null,null,null,null,null,1,null,null,78386.13]
[null,"GUANAJUATO","ROMI501119KW9","ROMI501119HGTCZS06  ","J. ISABEL ROCHA MEZA                    ","11DPT0007K",null,null,null,"X",null,null,null,null,null,null,null,null,null,null,null,1,null,null,38309.629999999997]
[null,"GUANAJUATO","ROMR681004UF2","ROMR681004HGTDRM02  ","RAMIRO RODRIGUEZ MARTINEZ               ","11DPT0001Q",null,null,null,"X",null,null,null,null,null,null,null,null,null,null,null,1,null,null,49335.58]
[null,"GUANAJUATO","ROMR861218274","ROMR861218HGTDGC00","RICARDO RODRIGUEZ MAGDALENO             ","11DPT0013V",null,null,null,"X",null,null,null,null,null,null,null,null,null,null,null,1,null,null,65850.78]
[null,"GUANAJUATO","ROMV410405227","ROMV410306HGTCZC05  ","VICENTE ROCHA MEZA                      ","11DPT0007K",null,null,null,"X",null,null,null,null,null,null,null,null,null,null,null,1,null,null,37504.79]
[null,"GUANAJUATO","ROPA921225ML5","ROPA921225MGTMRB01  ","ABRIL ANDREA ROMERO PEREZ               ","11APT0001T",null,null,null,"X",null,null,null,null,null,null,null,null,null,null,null,1,null,null,29720.799999999996]
[null,"GUANAJUATO","ROPJ630922717","ROPJ630922MGTDRS08  ","JOSEFINA RODRIGUEZ PEREZ                ","11DPT0009I",null,null,null,"X",null,null,null,null,null,null,null,null,null,null,null,1,null,null,39578.32]
[null,"GUANAJUATO","ROPR4911033YA","ROPR491103HGTDTF04  ","RAFAEL RODRIGUEZ PATINO                 ","11DPT0001Q",null,null,null,"X",null,null,null,null,null,null,null,null,null,null,null,1,null,null,33990.729999999996]
[null,"GUANAJUATO","ROPR8607125H9","ROPR860712MGTDNS08  ","ROSA AIDE RODRIGUEZ PANIAGUA            ","11DPT0011X",null,null,null,"X",null,null,null,null,null,null,null,null,null,null,null,1,null,null,83364.899999999994]
[null,"GUANAJUATO","RORC850223K78","RORC850223HGTDMR02  ","CARLOS ALBERTO RODRIGUEZ RAMIREZ        ","11DPT0013V",null,null,null,"X",null,null,null,null,null,null,null,null,null,null,null,1,null,null,40097.81]
[null,"GUANAJUATO","RORF650224FV1","RORF650224HDFDDR03  ","FERNANDO RODRIGUEZ RODRIGUEZ            ","11DPT0005M",null,null,null,"X",null,null,null,null,null,null,null,null,null,null,null,1,null,null,32169.9]
[null,"GUANAJUATO","RORJ800328CB1","RORJ800328HGTDMN01  ","JUAN PABLO RODRIGUEZ RAMIREZ            ","11DPT0003O",null,null,null,"X",null,null,null,null,null,null,null,null,null,null,null,1,null,null,34447.300000000003]
[null,"GUANAJUATO","ROSA621019UW4","ROSA621019HGTDNG01  ","AGAPITO RODRIGUEZ SANCHEZ               ","11DPT0002P",null,null,null,"X",null,null,null,null,null,null,null,null,null,null,null,1,null,null,40791.840000000004]
[null,"GUANAJUATO","ROSJ840320PL5","ROSJ840320MMCMGL06  ","JULIA OYUKI ROMERO SEGURA               ","11DPT0013V",null,null,null,"X",null,null,null,null,null,null,null,null,null,null,null,1,null,null,33742.36]
[null,"GUANAJUATO","ROTF640526L74","ROTF640526HGTDVL07  ","FELIPE RODRIGUEZ TOVAR                  ","11DPT0010Y",null,null,null,"X",null,null,null,null,null,null,null,null,null,null,null,1,null,null,36304.019999999997]
[null,"GUANAJUATO","ROVL470314635","ROVL470314HGTXGS09  ","LUIS RUBEN ROA VEGA                     ","11DPT0010Y",null,null,null,"X",null,null,null,null,null,null,null,null,null,null,null,1,null,null,37649.9]
[null,"GUANAJUATO","ROVR751027UW3","ROVR751027MGTBRS09  ","MARIA DEL ROSARI ROBLES VARGAS          ","11DPT0012W",null,null,null,"X",null,null,null,null,null,null,null,null,null,null,null,1,null,null,32811.01]
[null,"GUANAJUATO","ROVS5612313Z0","ROVS561231HGTBNL05  ","J. SILVESTRE ROBLEDO VENEGAS            ","11DPT0003O",null,null,null,"X",null,null,null,null,null,null,null,null,null,null,null,1,null,null,45808.36]
[null,"GUANAJUATO","ROMA570516SW1","ROXM570516HGTJXR04  ","MARIO ROJAS                             ","11DPT0007K",null,null,null,"X",null,null,null,null,null,null,null,null,null,null,null,1,null,null,85432.050000000017]
[null,"GUANAJUATO","RUER840817TJ2","RUER840817HGTZSN07  ","RENE RUIZ ESPINOZA                      ","11DPT0013V",null,null,null,"X",null,null,null,null,null,null,null,null,null,null,null,1,null,null,42553.62000000001]
[null,"GUANAJUATO","RURO710818A13","RURO710818MGTZFL04  ","OLGA AMALIA RUIZ RUFINO                 ","11DPT0001Q",null,null,null,"X",null,null,null,null,null,null,null,null,null,null,null,1,null,null,46666.39]
[null,"GUANAJUATO","SAAA790117M77","SAAA790117HGTNRL19  ","JOSE ALFREDO SANCHEZ ARREDONDO          ","11DPT0009I",null,null,null,"X",null,null,null,null,null,null,null,null,null,null,null,1,null,null,99963.6]
[null,"GUANAJUATO","SAAK880407FL7","SAAK880407MJCNNR03  ","KARLA ANGELINA SANDOVAL DE ANDA         ","11APT0001T",null,null,null,null,null,null,null,null,null,null,null,null,"X",null,null,1,null,null,81406.77]
[null,"GUANAJUATO","SAAL680317PF6","SAAL680317MGTLRR00  ","LAURA PATRICIA SALDAÑA ARELLANO         ","11DPT0003O",null,null,null,"X",null,null,null,null,null,null,null,null,null,null,null,1,null,null,93161.760000000009]
[null,"GUANAJUATO","SABA620417HF9","SABA620417HVZNTN05  ","ANICETO SANTIAGO BAUTISTA               ","11DPT0008J",null,null,null,"X",null,null,null,null,null,null,null,null,null,null,null,1,null,null,123101.63999999998]
[null,"GUANAJUATO","SABM631225F45","SABM631225HGTVRR06  ","MARTIN SALVADOR SAAVEDRA BRAVO          ","11DPT0005M",null,null,null,"X",null,null,null,null,null,null,null,null,null,null,null,1,null,null,30984.43]
[null,"GUANAJUATO","SACA791207U75","SACA791207MGTLSL02  ","MARIA ALEJANDRA SALAZAR CASTANEDA       ","11APT0001T",null,null,null,"X",null,null,null,null,null,null,null,null,null,null,null,1,null,null,99396.78]
[null,"GUANAJUATO","SACM851223UV7","SACM851223MDFNSN01  ","MONSERRAT SANCHEZ CISNEROS              ","11DPT0002P",null,null,null,"X",null,null,null,null,null,null,null,null,null,null,null,1,null,null,30186.14]
[null,"GUANAJUATO","SAGG7304218VA","SAGG730421MGTNLL02  ","GLORIA SANCHEZ GALVAN                   ","11DPT0007K",null,null,null,"X",null,null,null,null,null,null,null,null,null,null,null,1,null,null,40829.899999999994]
[null,"GUANAJUATO","SAGM730131V93","SAGM730131MDFNRR07  ","MARCELA SANCHEZ GARCIA                  ","11DPT0001Q",null,null,null,"X",null,null,null,null,null,null,null,null,null,null,null,1,null,null,94214.93]
[null,"GUANAJUATO","SAGS78112652A","SAGS781126HGTLTS16  ","SASHA EMMANUEL SALINAS GUTIERREZ        ","11DPT0002P",null,null,null,"X",null,null,null,null,null,null,null,null,null,null,null,1,null,null,28593.229999999996]
[null,"GUANAJUATO","SAHA7408317B1","SAHA740831MDFNRR01  ","AURELIA SANDOVAL HERNANDEZ              ","11DPT0012W",null,null,null,"X",null,null,null,null,null,null,null,null,null,null,null,1,null,null,31792.319999999996]
[null,"GUANAJUATO","SAHE741012DCA","SAHE741012MGTNRS04  ","MA. ESTHER SANCHEZ HERNANDEZ            ","11APT0001T",null,null,null,null,null,null,null,null,null,null,null,null,"X",null,null,1,null,null,94111.31]
[null,"GUANAJUATO","SAHI670121KQ3","SAHI670121MGTNRN07  ","MA. INES SANDOVAL HERNANDEZ             ","11DPT0002P",null,null,null,"X",null,null,null,null,null,null,null,null,null,null,null,1,null,null,42793.32]
[null,"GUANAJUATO","SAHL6309234X5","SAHL630923HGTNRS00  ","LUIS MIGUEL SANCHEZ HERNANDEZ           ","11DPT0002P",null,null,null,"X",null,null,null,null,null,null,null,null,null,null,null,1,null,null,83725.63]
[null,"GUANAJUATO","SAHO620602LB0","SAHO620602HSRLRS06  ","OSMAN SALAZAR HERNANDEZ                 ","11DPT0004N",null,null,null,"X",null,null,null,null,null,null,null,null,null,null,null,1,null,null,30595.619999999995]
[null,"GUANAJUATO","SALM811102IP0","SALG811102MGTNGD00  ","MA. GUADALUPE SANCHEZ LAGUNA            ","11DPT0002P",null,null,null,"X",null,null,null,null,null,null,null,null,null,null,null,1,null,null,58641.59]
[null,"GUANAJUATO","SALS651213I40","SALS651213MGTNNN03  ","SANJUANA SANCHEZ LUNA                   ","11DPT0008J",null,null,null,"X",null,null,null,null,null,null,null,null,null,null,null,1,null,null,47530.960000000006]
[null,"GUANAJUATO","SAMG651113CLA","SAMG651113MGTVDD08  ","MARIA GUADALUPE SAAVEDRA MEDRANO        ","11DPT0006L",null,null,null,"X",null,null,null,null,null,null,null,null,null,null,null,1,null,null,41372.61]
[null,"GUANAJUATO","SAML830406CC2","SAML830406HDFNNS01  ","LUIS ENRIQUE SANCHEZ MENDOZA            ","11APT0001T",null,null,null,"X",null,null,null,null,null,null,null,null,null,null,null,1,null,null,60456.94]
[null,"GUANAJUATO","SAMN650727TS7","SAMN650727MGTNJT03  ","MA. NATALIA SANCHEZ MOJICA              ","11APT0001T",null,null,null,"X",null,null,null,null,null,null,null,null,null,null,null,1,null,null,32018.68]
[null,"GUANAJUATO","SAOC521104BAA","SAOC521104HGTNLR02  ","CARLOS SANCHEZ OLIVA                    ","11DPT0010Y",null,null,null,"X",null,null,null,null,null,null,null,null,null,null,null,1,null,null,42230.67]
[null,"GUANAJUATO","SARA881017KA5","SARA811017HGTNXL07  ","ALBERTO ALEXANDR SANTILLAN REA          ","11DPT0002P",null,null,null,"X",null,null,null,null,null,null,null,null,null,null,null,1,null,null,30414.78]
[null,"GUANAJUATO","SARF810815QJ5","SARF810815MDFNCB12  ","MARIA FABIOLA SANCHEZ RICO              ","11DPT0011X",null,null,null,"X",null,null,null,null,null,null,null,null,null,null,null,1,null,null,32667.23]
[null,"GUANAJUATO","SARR700714SU4","SARR700714MGTCMS06  ","MARIA DEL ROSARI SAUCILLO RAMIREZ       ","11DPT0001Q",null,null,null,"X",null,null,null,null,null,null,null,null,null,null,null,1,null,null,66316.11]
[null,"GUANAJUATO","SASJ650121CF2","SAST650121HGTNMR00  ","J. TRINIDAD SANCHEZ SAMANO              ","11DPT0002P",null,null,null,"X",null,null,null,null,null,null,null,null,null,null,null,1,null,null,70114.77]
[null,"GUANAJUATO","SATR640529JN3","SATR640529HGTLRB08  ","RUBEN SALAZAR TORRES                    ","11DPT0005M",null,null,null,"X",null,null,null,null,null,null,null,null,null,null,null,1,null,null,46831.500000000007]
[null,"GUANAJUATO","SAVJ890118LK2","SAVJ890118HGTNZS05  ","JOSE DE JESUS SANCHEZ VAZQUEZ           ","11DPT0002P",null,null,null,"X",null,null,null,null,null,null,null,null,null,null,null,1,null,null,34219.68]
[null,"GUANAJUATO","SEES881205VA7","SEES881205MGTRSR08  ","SARA SERRANO ESTRADA                    ","11DPT0011X",null,null,null,"X",null,null,null,null,null,null,null,null,null,null,null,1,null,null,39943.03]
[null,"GUANAJUATO","SIFB790507EM8","SIFB790507HGTRRR00  ","BRAULIO ISAAC SIERRA FERREYRA           ","11DPT0005M",null,null,null,"X",null,null,null,null,null,null,null,null,null,null,null,1,null,null,93161.760000000009]
[null,"GUANAJUATO","SIRI830722KG2","SIRI830722HGTXCG04  ","IGNACIO MANUEL SIXTOS RICO              ","11DPT0014U",null,null,null,"X",null,null,null,null,null,null,null,null,null,null,null,1,null,null,66266.17]
[null,"GUANAJUATO","SIRO600318LE2","SIRO600318HGTRDC04  ","JOSE OCTAVIO SIERRA RODRIGUEZ           ","11DPT0006L",null,null,null,"X",null,null,null,null,null,null,null,null,null,null,null,1,null,null,78313.5]
[null,"GUANAJUATO","SOMC8307243E3","SOMC830724HGTTNH06  ","CHRISTIAN SOTO MENDOZA                  ","11DPT0014U",null,null,null,"X",null,null,null,null,null,null,null,null,null,null,null,1,null,null,92378.010000000009]
[null,"GUANAJUATO","SOMJ580901N40","SOMJ580901HMNLRS02  ","JESUS SOLIS MARIN                       ","11DPT0009I",null,null,null,"X",null,null,null,null,null,null,null,null,null,null,null,1,null,null,43408.41]
[null,"GUANAJUATO","SOPA800206QN0","SOPA800206HMCRRB02  ","ABNER ISAI SORIA PEREZ                  ","11DPT0004N",null,null,null,"X",null,null,null,null,null,null,null,null,null,null,null,1,null,null,65176.960000000006]
[null,"GUANAJUATO","SOPL831024T56","SOPL831024MGTTRR09  ","LAURA ANGELICA SOTO PEREZ               ","11DPT0012W",null,null,null,"X",null,null,null,null,null,null,null,null,null,null,null,1,null,null,69570.179999999993]
[null,"GUANAJUATO","SUFR660516C81","SUFR660516MDFRLQ08  ","RAQUEL SUAREZ FALCON                    ","11DPT0012W",null,null,null,"X",null,null,null,null,null,null,null,null,null,null,null,1,null,null,74489.86]
[null,"GUANAJUATO","TAAS6205308FA","TAAS620530MJCPLR01  ","SARA TAPIA ALCANTARA                    ","11DPT0004N",null,null,null,"X",null,null,null,null,null,null,null,null,null,null,null,1,null,null,40565.96]
[null,"GUANAJUATO","TAPM7310026U1","TAPM731002HDFRSG06  ","MIGUEL ANGEL TAURINO PASTEN             ","11DPT0003O",null,null,null,"X",null,null,null,null,null,null,null,null,null,null,null,1,null,null,36005.300000000003]
[null,"GUANAJUATO","TEHM7408294G1","TEHM740829HGTLRR02  ","MARCO ANTONIO TELLEZ HERRERA            ","11DPT0001Q",null,null,null,"X",null,null,null,null,null,null,null,null,null,null,null,1,null,null,28262.739999999998]
[null,"GUANAJUATO","TOCB650526UK9","TOCB650526MGTRVR00  ","BERTHA TORRES COVARRUBIAS               ","11DPT0005M",null,null,null,null,null,null,null,null,null,null,null,null,"X",null,null,1,null,null,96028.53]
[null,"GUANAJUATO","TOCF910415931","TOCF910415MGTRRT00  ","FATIMA DEL ROSAR TORRES CERVANTES       ","11DPT0001Q",null,null,null,"X",null,null,null,null,null,null,null,null,null,null,null,1,null,null,27884.75]
[null,"GUANAJUATO","TOMP701231IUA","TOMP701231MGTRJT08  ","PATRICIA TORRES MEJIA                   ","11DPT0006L",null,null,null,"X",null,null,null,null,null,null,null,null,null,null,null,1,null,null,44551.850000000006]
[null,"GUANAJUATO","TORM8008155Q9","TORM800815HGTRVR02  ","MARIO TORRES RIVERA                     ","11DPT0014U",null,null,null,"X",null,null,null,null,null,null,null,null,null,null,null,1,null,null,32058.879999999997]
[null,"GUANAJUATO","TOSS530312KL6","TOSS530312HDFRMM05  ","SAMUEL TORRES SUMOZA                    ","11DPT0001Q",null,null,null,"X",null,null,null,null,null,null,null,null,null,null,null,1,null,null,31248.35]
[null,"GUANAJUATO","VAAM631105TU4","VAAM631105HGTLYR06  ","MARTIN VALENTE AYALA                    ","11DPT0001Q",null,null,null,"X",null,null,null,null,null,null,null,null,null,null,null,1,null,null,40210.46]
[null,"GUANAJUATO","VACM560124H46","VACM560124HGTZRR03  ","MAURILIO VAZQUEZ CERVANTES              ","11DPT0009I",null,null,null,"X",null,null,null,null,null,null,null,null,null,null,null,1,null,null,39930.06]
[null,"GUANAJUATO","VACY6607278R7","VACY660727MGTRSL08  ","YOLANDA VARGAS CASTILLO                 ","11DPT0005M",null,null,null,"X",null,null,null,null,null,null,null,null,null,null,null,1,null,null,85885.900000000009]
[null,"GUANAJUATO","VAEA7904041V2","VAEA790404HGTLLL05  ","ALEJANDRO VALADEZ ELIAS                 ","11DPT0002P",null,null,null,"X",null,null,null,null,null,null,null,null,null,null,null,1,null,null,29234.78]
[null,"GUANAJUATO","VAGC6606185V3","VAGC660618MGTRRN09  ","CANDELARIA VARGAS GARCIA                ","11DPT0005M",null,null,null,"X",null,null,null,null,null,null,null,null,null,null,null,1,null,null,30790.019999999997]
[null,"GUANAJUATO","VALN7508285U9","VALN750828MGTZMR00  ","NORMA ADRIANA VAZQUEZ LOMELI            ","11DPT0005M",null,null,null,"X",null,null,null,null,null,null,null,null,null,null,null,1,null,null,41875.29]
[null,"GUANAJUATO","VAMF590309CY5","VAMF590309HGTLNR07  ","FERNANDO VALDES MONTES                  ","11DPT0012W",null,null,null,"X",null,null,null,null,null,null,null,null,null,null,null,1,null,null,107899.01999999999]
[null,"GUANAJUATO","VARG660927MXA","VARG660927MDFLSL01  ","GLORIA GUADALUPE VALENZUELA RIOS        ","11APT0001T",null,null,null,null,null,null,null,null,null,null,null,null,"X",null,null,1,null,null,94111.31]
[null,"GUANAJUATO","VASO730804UX2","VASO730804HGTRTC00  ","OCTAVIO VARGAS SOTO                     ","11DPT0004N",null,null,null,"X",null,null,null,null,null,null,null,null,null,null,null,1,null,null,107623.48]
[null,"GUANAJUATO","VEGG461124SB3","VEGG461124HGTLLD01  ","J. GUADALUPE VELAZQUEZ GALLARDO         ","11DPT0002P",null,null,null,"X",null,null,null,null,null,null,null,null,null,null,null,1,null,null,42616.12]
[null,"GUANAJUATO","VEGR631014AK5","VEGR631014HGTLRB01  ","RUBEN VELAZQUEZ GARCIA                  ","11DPT0001Q",null,null,null,"X",null,null,null,null,null,null,null,null,null,null,null,1,null,null,35269.090000000004]
[null,"GUANAJUATO","VEHP610906SJ2","VEHP610906HGTRRT04  ","PETRONILO VERA HERNANDEZ                ","11DPT0001Q",null,null,null,"X",null,null,null,null,null,null,null,null,null,null,null,1,null,null,46758.520000000004]
[null,"GUANAJUATO","VEMM86100222D","VEMM861022MGTRNR00","MIRIAM SOLEDAD VERA MENDIETA            ","11DPT0001Q",null,null,null,"X",null,null,null,null,null,null,null,null,null,null,null,1,null,null,10183.74]
[null,"GUANAJUATO","VEMR6104101A1","VEMR610410HGTLRM02  ","JOSE RAMON VELEZ MORENO                 ","11DPT0010Y",null,null,null,"X",null,null,null,null,null,null,null,null,null,null,null,1,null,null,93161.760000000009]
[null,"GUANAJUATO","VIRS630902SUA","VIRS630902HMNLYL09  ","SALVADOR VILLANUEVA REYNOSO             ","11DPT0012W",null,null,null,"X",null,null,null,null,null,null,null,null,null,null,null,1,null,null,105540.78]
[null,"GUANAJUATO","VIVM841025NR4","VIVM841025MGTLRL07  ","MELINA VILLARREAL VARGAS                ","11DPT0008J",null,null,null,"X",null,null,null,null,null,null,null,null,null,null,null,1,null,null,80044.44]
[null,"GUANAJUATO","ZAAF7902055E9","ZAAF790205HGTMLR09  ","FERNANDO ZAMARRIPA ALDAPE               ","11APT0001T",null,null,null,"X",null,null,null,null,null,null,null,null,null,null,null,1,null,null,101097.18]
[null,"GUANAJUATO","ZABS740117LZ8","ZABS740117MGRMLS00  ","SUSY ROCIO ZAMUDIO BALVUENA             ","11DPT0012W",null,null,null,"X",null,null,null,null,null,null,null,null,null,null,null,1,null,null,75960.340000000011]
[null,"GUANAJUATO","ZABS850402N68","ZABS850402HGTMLR06  ","SERGIO LUIS ZAMUDIO BELTRAN             ","11DPT0012W",null,null,null,"X",null,null,null,null,null,null,null,null,null,null,null,1,null,null,39110.46]
[null,"GUANAJUATO","ZAHE711130S69","ZAHE711130MDFMRR03  ","ERIKA DE LOS ANGE ZAMORA HERNANDEZ      ","11APT0001T",null,null,null,"X",null,null,null,null,null,null,null,null,null,null,null,1,null,null,110976.29999999999]
[null,"GUANAJUATO","ZALC5604237Q2","ZALC560423HGTVPR01  ","CARLOS ZAVALA LOPEZ                     ","11DPT0001Q",null,null,null,"X",null,null,null,null,null,null,null,null,null,null,null,1,null,null,39955.25]
[null,"GUANAJUATO","ZALE620903MK9","ZALE620903HGTVND01  ","EDUARDO ZAVALA LEON                     ","11APT0001T",null,null,null,"X",null,null,null,null,null,null,null,null,null,null,null,1,null,null,72284.2]
[null,"GUANAJUATO","ZERV770303SS4","ZERV770303MGTNCN07  ","MARIA  VANESSA ZENDEJAS ROCHA           ","11DPT0013V",null,null,null,"X",null,null,null,null,null,null,null,null,null,null,null,1,null,null,46274.53]
[null,"GUANAJUATO","ZERY820116NN8","ZERY820116MGTNCD08  ","YADIRA BERENICE ZENDEJAS ROCHA          ","11APT0001T",null,null,null,"X",null,null,null,null,null,null,null,null,null,null,null,1,null,null,47204.58]
[null,"GUANAJUATO","ZUGJ5210227C5","ZUGJ521022HGTXRV02  ","JAVIER ZUÑIGA GARCIA                    ","11DPT0009I",null,null,null,null,null,null,null,null,null,null,null,null,"X",null,null,1,null,null,96028.53]
[null,"GUANAJUATO","MASJ651012DZ4","MASJ651012HVZRNN09","JUAN CARLOS MARTINEZ SANTOS","11DPT0001Q",null,null,null,null,null,null,null,"X",null,null,null,null,null,null,null,1,null,null,53629.22]
[null,"GUANAJUATO","MORA600920UJ0","MORA600920MGTSVN08","MARÍA DE LOS ÁNGELES MOSQUEDA RUVALCABA","11DPT0010Y",null,null,null,null,null,null,null,"X",null,null,null,null,null,null,null,1,null,null,50121.520000000004]
[null,"GUANAJUATO","LOBA7910123P2","LOBA791012HJCPRL00","ALEJANDRO LOPEZ BRIONES","11DPT0001Q",null,null,null,null,null,null,null,"X",null,null,null,null,null,null,null,1,null,null,41957.619999999995]
[null,"GUANAJUATO","ZARG760122LM0","ZARG760122MGTRDR05","  GRACIELA ZARAGOZA RODRIGUEZ ","11DPT0007K",null,null,null,null,null,null,null,"X",null,null,null,null,null,null,null,1,null,null,41131.909999999996]
[null,"GUANAJUATO","PATD7212262V2","PATD721226MGTCRL02","DULCE CONCEPCIÓN PACHECO TORRES","11DPT0010Y",null,null,null,null,null,null,null,"X",null,null,null,null,null,null,null,1,null,null,37513.180000000008]
[null,"GUANAJUATO","LUWR540208FX7","LUWR540208MDFNRB04","REBECA LUNA WIARCO","11DPT0006L",null,null,null,null,null,null,null,"X",null,null,null,null,null,null,null,1,null,null,33835.46]
[null,"GUANAJUATO","MAMA711017CPA","MAMA711017HGTRNR02","ARTURO MARTINEZ MONCADA","11DPT0001Q",null,null,null,null,null,null,null,"X",null,null,null,null,null,null,null,1,null,null,33265.919999999998]
[null,"GUANAJUATO","MOSR800811KH0","MOSR800811HGTLNC05","RICARDO MOLINA SANCHEZ","11DPT0006L",null,null,null,null,null,null,null,"X",null,null,null,null,null,null,null,1,null,null,28868.760000000002]
[null,"GUANAJUATO","SOZC590907935","SOZC590907HQTRXN08","JOSE CONRADO SORIA  ZUÑIGA ","11DPT0012W",null,null,null,null,null,null,null,"X",null,null,null,null,null,null,null,1,null,null,25976.17]
[null,"GUANAJUATO","VAME680312QT2","VAME680312MGTZLR00","ELISA VAZQUEZ MARTINEZ","11DPT0008J",null,null,null,null,null,null,null,"X",null,null,null,null,null,null,null,1,null,null,23718.93]
[null,"GUANAJUATO","SAGI850902B58","SAGI850902MJCNNS03","ISAURA SANCHEZ GONZALEZ","11DPT0006L",null,null,null,null,null,null,null,"X",null,null,null,null,null,null,null,1,null,null,21916.86]
[null,"GUANAJUATO","MAJO8201113IA","MAJO820111HOCRMS09","OSIRIS MARTINEZ JIMENEZ","11DPT0001Q",null,null,null,null,null,null,null,"X",null,null,null,null,null,null,null,1,null,null,21497.52]
[null,"GUANAJUATO","CABA581007J13","CABA581007MMNRZN16","MARIA DE LOS ANGELES CARDENAS BAEZA","11DPT0005M",null,null,null,null,null,null,null,"X",null,null,null,null,null,null,null,1,null,null,21031.75]
[null,"GUANAJUATO","AOVI670402NJA","AOVI670402HGTCZS07","ISMAEL ACOSTA VAZQUEZ","11DPT0002P",null,null,null,null,null,null,null,"X",null,null,null,null,null,null,null,1,null,null,20860]
[null,"GUANAJUATO","HEPM8111294E4","HEPM811129HGTRRG03","MIGUEL ANGEL HERNANDEZ PEREZ","11DPT0001Q",null,null,null,null,null,null,null,"X",null,null,null,null,null,null,null,1,null,null,20517.37]
[null,"GUANAJUATO","SAPG841029F61","SAPG841029HGTNRD01","JOSE GUADALUPE SANDOVAL PEREZ","11DPT0014U",null,null,null,null,null,null,null,"X",null,null,null,null,null,null,null,1,null,null,19857.48]
[null,"GUANAJUATO","MARR660925MG9","MARR660925MGTRDC04","ROCIO MARTINEZ RODRIGUEZ","11DPT0001Q",null,null,null,null,null,null,null,"X",null,null,null,null,null,null,null,1,null,null,18185.059999999998]
[null,"GUANAJUATO","NIGC7311229F4","NIGC731122HGTLSC01","CECILIO NILA GASCA","11DPT0010Y",null,null,null,null,null,null,null,"X",null,null,null,null,null,null,null,1,null,null,18153.72]
[null,"GUANAJUATO","GASM760821854","GASS760821MGTRTC10","MA. DEL SOCORRO GARCIA SOTELO","11DPT0006L",null,null,null,null,null,null,null,"X",null,null,null,null,null,null,null,1,null,null,17693.760000000002]
[null,"GUANAJUATO","AAAL5409208IA","AAXA540920HDFLXL04","JOSE ALEJANDRO ALVAREZ ","11DPT0013V",null,null,null,null,null,null,null,"X",null,null,null,null,null,null,null,1,null,null,17649.739999999998]
[null,"GUANAJUATO","AASR710311P25","AASR710311MGTLNC02","ROCÍO DEL CARMEN ALMANZA SANDOVAL","11DPT0010Y",null,null,null,null,null,null,null,"X",null,null,null,null,null,null,null,1,null,null,17460.89]
[null,"GUANAJUATO","IACC631023AI2","IACC631023HGTBNH06","CUAUHTEMOC IBARRA CANO","11DPT0009I",null,null,null,null,null,null,null,"X",null,null,null,null,null,null,null,1,null,null,17228.13]
[null,"GUANAJUATO","MAGM780331EF7","MAGM780331MGTRZR08","MARIANA MARIN GUZMAN","11DPT0006L",null,null,null,null,null,null,null,"X",null,null,null,null,null,null,null,1,null,null,16945.12]
[null,"GUANAJUATO","MOHD5903208E0","MOHD590320HMCCRL05","JOSE DOLORES GUADALUPE MOCTEZUMA HERNANDEZ","11DPT0001Q",null,null,null,null,null,null,null,"X",null,null,null,null,null,null,null,1,null,null,16762.5]
[null,"GUANAJUATO","JAMJ8502091S3","JAMJ850209HDFSRL04","JULIO CESAR JASSO MARTINEZ","11DPT0006L",null,null,null,null,null,null,null,"X",null,null,null,null,null,null,null,1,null,null,16141.7]
[null,"GUANAJUATO","DULJ8108233XA","DULJ810823HGTQPN02","JUAN IGNACIO DUQUE LOPEZ","11DPT0013V",null,null,null,null,null,null,null,"X",null,null,null,null,null,null,null,1,null,null,16015.67]
[null,"GUANAJUATO","RORE431022TB0","RORE431022HGTDMD08","EDILBERTO RODRIGUEZ ROMERO","11DPT0012W",null,null,null,null,null,null,null,"X",null,null,null,null,null,null,null,1,null,null,15657.37]
[null,"GUANAJUATO","MAMD780104125","MAMD780104MGTTRL05","MARIA DOLORES MATA MARTINEZ","11DPT0007K",null,null,null,null,null,null,null,"X",null,null,null,null,null,null,null,1,null,null,15657.37]
[null,"GUANAJUATO","HIBA631027337","HIBA631027HGTNLN08","ANTONIO HINOJOSA BALANDRÁN","11DPT0010Y",null,null,null,null,null,null,null,"X",null,null,null,null,null,null,null,1,null,null,15608.58]
[null,"GUANAJUATO","CAEL721019IZ9","CAEL721019MGTSLL08","LILIA ISELA CASTILLO ELIZARRARAZ","11DPT0002P",null,null,null,null,null,null,null,"X",null,null,null,null,null,null,null,1,null,null,15489.779999999999]
[null,"GUANAJUATO","LORF540804250","LORF540804HJCPLR09","FRANCISCO JAVIER LOPEZ RUELAS","11DPT0007K",null,null,null,null,null,null,null,"X",null,null,null,null,null,null,null,1,null,null,15478.199999999999]
[null,"GUANAJUATO","COVE740314GR2","COVE740314HGTRZN07","ENRIQUE CORTEZ VAZQUEZ","11DPT0001Q",null,null,null,null,null,null,null,"X",null,null,null,null,null,null,null,1,null,null,15370.240000000002]
[null,"GUANAJUATO","SAPG631009QMA","SAPG631009MGTNRD02","MA GUADALUPE  SANCHEZ  PARRA ","11DPT0011X",null,null,null,null,null,null,null,"X",null,null,null,null,null,null,null,1,null,null,15081.02]
[null,"GUANAJUATO","MOVM841118881","MOVM841118MGTNRR09","MARIELA MONTIEL  VERA","11DPT0007K",null,null,null,null,null,null,null,"X",null,null,null,null,null,null,null,1,null,null,14952.86]
[null,"GUANAJUATO","HECM670422CC4","HECM670422MDFRBR02","MARIA MARCELA  HERRERA  CEBALLOS ","11DPT0011X",null,null,null,null,null,null,null,"X",null,null,null,null,null,null,null,1,null,null,14940.789999999999]
[null,"GUANAJUATO","ROZA8409121VA","ROZA840912MGTDXL02","ALMA ROSARIO RODRIGUEZ ZUÑIGA","11DPT0007K",null,null,null,null,null,null,null,"X",null,null,null,null,null,null,null,1,null,null,14918.650000000001]
[null,"GUANAJUATO","LORM590406948","LORM590406MGTPDD05","MA GUADALUPE LOPEZ RODRIGUEZ","11DPT0013V",null,null,null,null,null,null,null,"X",null,null,null,null,null,null,null,1,null,null,14900]
[null,"GUANAJUATO","HEMR760314HY6","HEMR760314HGTRRL06","RAUL HERNANDEZ MARTINEZ","11DPT0008J",null,null,null,null,null,null,null,"X",null,null,null,null,null,null,null,1,null,null,14434.380000000001]
[null,"GUANAJUATO","NAVG770820NG1","NAVG770820MGTVGB02","GABRIELA NAVA VIGIL","11DPT0002P",null,null,null,null,null,null,null,"X",null,null,null,null,null,null,null,1,null,null,14434.380000000001]
[null,"GUANAJUATO","JAPM610407F53","JAPM610407HGTSRR00","MARCELINO JASSO PEREZ","11DPT0006L",null,null,null,null,null,null,null,"X",null,null,null,null,null,null,null,1,null,null,14362.86]
[null,"GUANAJUATO","ROMO790623E30","ROMO790623HGTSRL08","OLIMPO ROSILLO MORENO","11DPT0010Y",null,null,null,null,null,null,null,"X",null,null,null,null,null,null,null,1,null,null,14304.83]
[null,"GUANAJUATO","AAGC731126M29","AAGC731126HDFLNN07","CONRRADO ARTURO ALVAREZ GONZALEZ","11DPT0002P",null,null,null,null,null,null,null,"X",null,null,null,null,null,null,null,1,null,null,14155]
[null,"GUANAJUATO","AOOS720925113","AOOS720925MGTBRN08","SANDRA ABOYTES OROZCO","11DPT0001Q",null,null,null,null,null,null,null,"X",null,null,null,null,null,null,null,1,null,null,14110.4]
[null,"GUANAJUATO","PEGS750625V73","PEGS750625HGTRRR05","SERGIO JAVIER  PEREZ GUERRERO","11DPT0010Y",null,null,null,null,null,null,null,"X",null,null,null,null,null,null,null,1,null,null,14026.25]
[null,"GUANAJUATO","TEAR801024C6A","TEAR801024MGTJDS18","ROSA BEATRIZ TEJEDA ADAME","11DPT0009I",null,null,null,null,null,null,null,"X",null,null,null,null,null,null,null,1,null,null,13969.75]
[null,"GUANAJUATO","PESA790927U25","PESA790927MGTRTN06","ANDREA MAGDALENA PEREZ SOTO","11DPT0009I",null,null,null,null,null,null,null,"X",null,null,null,null,null,null,null,1,null,null,13968.75]
[null,"GUANAJUATO","VITF791111L77","VITF791111HGTLVR01","FRANCISCO VILLAFAÑA  TAVERA","11DPT0005M",null,null,null,null,null,null,null,"X",null,null,null,null,null,null,null,1,null,null,13782.5]
[null,"GUANAJUATO","ROEL820326QF8","ROEL820326MGTCSZ05","MARIA DE LA LUZ ROCHA  ESCOBAR ","11DPT0012W",null,null,null,null,null,null,null,"X",null,null,null,null,null,null,null,1,null,null,13503.130000000001]
[null,"GUANAJUATO","MACM811125AAA","MACM811125MGTSRR00","MARLENE SELENE MASCOTTE CRUZ","11DPT0001Q",null,null,null,null,null,null,null,"X",null,null,null,null,null,null,null,1,null,null,13472.1]
[null,"GUANAJUATO","DOMN670802UR9","DOMN670802MGTMNT03","NATALIA DE LOS ANGELES DOMINGUEZ MANZANO","11DPT0002P",null,null,null,null,null,null,null,"X",null,null,null,null,null,null,null,1,null,null,13410]
[null,"GUANAJUATO","LOGJ711211E25","LOGJ711211HGTMVN07","JUAN LOMAS GUEVARA","11DPT0001Q",null,null,null,null,null,null,null,"X",null,null,null,null,null,null,null,1,null,null,13192.73]
[null,"GUANAJUATO","AAMT550321C79","AAMT550321MGTLRR02","MARIA TERESA ALVAREZ MARES","11DPT0013V",null,null,null,null,null,null,null,"X",null,null,null,null,null,null,null,1,null,null,13192.73]
[null,"GUANAJUATO","HERD520203ADO","HERD520203MSLRSB04","DEBORA HERN RUSSEL","11DPT0002P",null,null,null,null,null,null,null,"X",null,null,null,null,null,null,null,1,null,null,13009.439999999999]
[null,"GUANAJUATO","PEQP6003137R3","PEQP600313MQTRNT01","PATRICIA ANTONIA PEREZ  QUINTERO ","11DPT0012W",null,null,null,null,null,null,null,"X",null,null,null,null,null,null,null,1,null,null,12898.5]
[null,"GUANAJUATO","GUHR661007QW0","GUHR661007MGTTRC18","ROCIO DEL ROSARIO GUTIERREZ HERNANDEZ","11DPT0007K",null,null,null,null,null,null,null,"X",null,null,null,null,null,null,null,1,null,null,12898.5]
[null,"GUANAJUATO","RAAL791208PR9","RAAL791208MGTZNL07","LILIA CONCEPCION RAZO ANGELES","11DPT0005M",null,null,null,null,null,null,null,"X",null,null,null,null,null,null,null,1,null,null,12842.810000000001]
[null,"GUANAJUATO","MESM670501FH5","MESM670501HDFNGR03","MARCO ALFREDO MENDOZA SEGURA","11DPT0007K",null,null,null,null,null,null,null,"X",null,null,null,null,null,null,null,1,null,null,12753.79]
[null,"GUANAJUATO","ZARI821025R29","ZARI821025MGTRBG09","MARIA IGNACIA ZARAZUA  RUBIO ","11DPT0012W",null,null,null,null,null,null,null,"X",null,null,null,null,null,null,null,1,null,null,12571.880000000001]
[null,"GUANAJUATO","COPG691022N6A","COPG691022MGTNRD08","MA GUADALUPE CONTRERAS PEREZ","11DPT0006L",null,null,null,null,null,null,null,"X",null,null,null,null,null,null,null,1,null,null,12556.16]
[null,"GUANAJUATO","IAMJ700913223","IAMJ700913HGTBLS01","JOSE DE JESUS IBARRA MELENDEZ","11DPT0007K",null,null,null,null,null,null,null,"X",null,null,null,null,null,null,null,1,null,null,12556.16]
[null,"GUANAJUATO","CARS710511U36","CARS710511HGTMNR10","SERGIO ARTURO CAMPOS RANGEL","11DPT0002P",null,null,null,null,null,null,null,"X",null,null,null,null,null,null,null,1,null,null,12490.51]
[null,"GUANAJUATO","QUOG780110GB9","QUOG780110HGTNRN00","GONZALO  QUINTANA  ORTEGA ","11DPT0010Y",null,null,null,null,null,null,null,"X",null,null,null,null,null,null,null,1,null,null,12160.04]
[null,"GUANAJUATO","FIOM790619I13","FIOM790619HDFLRH07","MAHY ROLANDO FILOMENO ORTIZ","11DPT0010Y",null,null,null,null,null,null,null,"X",null,null,null,null,null,null,null,1,null,null,12106.26]
[null,"GUANAJUATO","MOPL8106219G5","MOPL810621MGTRLD07","LIDIA MORENO PALOALTO","11DPT0001Q",null,null,null,null,null,null,null,"X",null,null,null,null,null,null,null,1,null,null,12106.25]
[null,"GUANAJUATO","VAAJ751004U60","VAAJ751004MGTLRN04","JUANA YANET VALDEZ ARGUELLO","11DPT0006L",null,null,null,null,null,null,null,"X",null,null,null,null,null,null,null,1,null,null,12038.6]
[null,"GUANAJUATO","DEGJ790106AH3","DEGJ790106HGTLRR08","JORGE ALBERTO DELGADO GUERRERO","11DPT0008J",null,null,null,null,null,null,null,"X",null,null,null,null,null,null,null,1,null,null,11644.490000000002]
[null,"GUANAJUATO","GOPA710319IB0","GOPA710319HGTNRD02","ADAN ALEJANDRO GONZALEZ PRESA","11DPT0008J",null,null,null,null,null,null,null,"X",null,null,null,null,null,null,null,1,null,null,11644.490000000002]
[null,"GUANAJUATO","OOSJ630117DK1","OOSJ630117HGTRNN00","JUAN MANUEL OROPEZA SANCHEZ","11DPT0008J",null,null,null,null,null,null,null,"X",null,null,null,null,null,null,null,1,null,null,11644.490000000002]
[null,"GUANAJUATO","MAPP7311016D0","MAPP731101MJCRRR02","PERLA ANDREA MARTINEZ PEREZ","11DPT0002P",null,null,null,null,null,null,null,"X",null,null,null,null,null,null,null,1,null,null,11640.630000000001]
[null,"GUANAJUATO","GUHM640516HF8","GUHM640516MGTTRR04","MARTHA GUTIERREZ HERNANDEZ","11DPT0007K",null,null,null,null,null,null,null,"X",null,null,null,null,null,null,null,1,null,null,11608.66]
[null,"GUANAJUATO","HEFJ700120711","HEFG700120HGTRSD12","J. GUADALUPE HERNANDEZ FISCAL","11DPT0008J",null,null,null,null,null,null,null,"X",null,null,null,null,null,null,null,1,null,null,11429.51]
[null,"GUANAJUATO","RONE740321QJ6","RONE740321MGTJTS01","MARIA ESTHER ROJAS NIETO","11DPT0008J",null,null,null,null,null,null,null,"X",null,null,null,null,null,null,null,1,null,null,11429.51]
[null,"GUANAJUATO","AUGJ550312251","AUJG550312HGTGTR07","JORGE AGUILERA GUTIERREZ","11DPT0002P",null,null,null,null,null,null,null,"X",null,null,null,null,null,null,null,1,null,null,11423.35]
[null,"GUANAJUATO","COVI910507TA9","COVI910507MQTNRT08","ITZMALSI GUADALUPE CONTRERAS VARGAS","11DPT0012W",null,null,null,null,null,null,null,"X",null,null,null,null,null,null,null,1,null,null,11347]
[null,"GUANAJUATO","COMM610831NKA","COMM610831HDFRRG06","MIGUEL CORTES MORALES","11DPT0001Q",null,null,null,null,null,null,null,"X",null,null,null,null,null,null,null,1,null,null,11324.83]
[null,"GUANAJUATO","GUPG670506661","GUPG670506HGTTLS06","GUSTAVO GUTIERREZ PELAGIO","11DPT0002P",null,null,null,null,null,null,null,"X",null,null,null,null,null,null,null,1,null,null,11206.029999999999]
[null,"GUANAJUATO","NUHG820619JC1","NUHG820619MGTXRR08","GRACIELA GUADALUPE NUÑEZ HERNANDEZ","11DPT0001Q",null,null,null,null,null,null,null,"X",null,null,null,null,null,null,null,1,null,null,11186.470000000001]
[null,"GUANAJUATO","EUGC810902JNA","EUGC810902HGTSZS09","CESAR JAVIER ESQUIVEL GUZMAN","11DPT0002P",null,null,null,null,null,null,null,"X",null,null,null,null,null,null,null,1,null,null,11175]
[null,"GUANAJUATO","HEGV820527FN1","HEGV820527MGTRRR00","VERONICA HERNANDEZ GARCIA","11DPT0002P",null,null,null,null,null,null,null,"X",null,null,null,null,null,null,null,1,null,null,11175]
[null,"GUANAJUATO","MEMV791203112","MEVM791203HGTDZR15","MARIO MEDINA VÁZQUEZ","11DPT0010Y",null,null,null,null,null,null,null,"X",null,null,null,null,null,null,null,1,null,null,11175]
[null,"GUANAJUATO","MASS590809U18","MASS590809HGTRTL08","SALVADOR MARTINEZ SOTO","11DPT0002P",null,null,null,null,null,null,null,"X",null,null,null,null,null,null,null,1,null,null,11032.759999999998]
[null,"GUANAJUATO","EAGL600822HR9","EAGL600822HGTSNR08","LORENZO PABLO ESTRADA GONZALEZ","11DPT0014U",null,null,null,null,null,null,null,"X",null,null,null,null,null,null,null,1,null,null,10964.25]
[null,"GUANAJUATO","CAMJ670419324","CAMJ670419HGTRRS00","JOSE DE JESUS CARRILLO MARTINEZ","11DPT0013V",null,null,null,null,null,null,null,"X",null,null,null,null,null,null,null,1,null,null,10892.05]
[null,"GUANAJUATO","MAMX651202NJ5","MXME651202MGTTEV07","EVA MATA MARTINEZ","11DPT0007K",null,null,null,null,null,null,null,"X",null,null,null,null,null,null,null,1,null,null,10892.05]
[null,"GUANAJUATO","HERA790726J96","HERA790726MGTRMN07","ANA VERONICA HERNANDEZ RAMIREZ","11DPT0013V",null,null,null,null,null,null,null,"X",null,null,null,null,null,null,null,1,null,null,10855.009999999998]
[null,"GUANAJUATO","CAPD830504746","CAPD830504HGTRTG05","DIEGO FELIPE CARDENAS  PATIÑO","11DPT0014U",null,null,null,null,null,null,null,"X",null,null,null,null,null,null,null,1,null,null,10802.5]
[null,"GUANAJUATO","GUJE600723CI3","GUJE600723HGTZMR03","ERNESTO GUZMAN JIMENEZ","11DPT0001Q",null,null,null,null,null,null,null,"X",null,null,null,null,null,null,null,1,null,null,10782.35]
[null,"GUANAJUATO","AERJ730331GZ5","AERJ730331HGTRMN05","JUAN CARLOS ARREOLA ROMERO","11DPT0006L",null,null,null,null,null,null,null,"X",null,null,null,null,null,null,null,1,null,null,10775.6]
[null,"GUANAJUATO","MEHE811224IH7","MEHE811224HGTNRM08","EMMANUEL MENDOZA HERNANDEZ","11DPT0001Q",null,null,null,null,null,null,null,"X",null,null,null,null,null,null,null,1,null,null,10722.71]
[null,"GUANAJUATO","TIEA7005021TA","TIEA700502MDFHSN02"," ANGELICA THIRION ESCUDER  ","11DPT0007K",null,null,null,null,null,null,null,"X",null,null,null,null,null,null,null,1,null,null,10712.94]
[null,"GUANAJUATO","RURA710611JV5","RURA710611HDFZML07","ALEJANDRO RUIZ RAMIREZ","11DPT0002P",null,null,null,null,null,null,null,"X",null,null,null,null,null,null,null,1,null,null,10678.35]
[null,"GUANAJUATO","RANS8002268Z7","RASN800226HGTNRS07","NESTOR  RANGEL  SUAREZ ","11DPT0012W",null,null,null,null,null,null,null,"X",null,null,null,null,null,null,null,1,null,null,10619.09]
[null,"GUANAJUATO","AUCL821209DC6","AUCL821209MVZRRT05","LETICIA CAROLINA ARGUELLES CRUZ","11DPT0002P",null,null,null,null,null,null,null,"X",null,null,null,null,null,null,null,1,null,null,10606.4]
[null,"GUANAJUATO","MAMG691216UYA","MAMG691216HGTRRD04","JOSE GUADALUPE RAUL MARTINEZ MORENO","11DPT0008J",null,null,null,null,null,null,null,"X",null,null,null,null,null,null,null,1,null,null,10495.93]
[null,"GUANAJUATO","CAPJ680119DJ7","CAPJ680119HGTZTN01","J. ANDRES CAZARES PATIÑO","11DPT0001Q",null,null,null,null,null,null,null,"X",null,null,null,null,null,null,null,1,null,null,10461.029999999999]
[null,"GUANAJUATO","MEAA781114FWA","MEAA781114MGTDRD01","ADRIANA MEDEL ARROYO","11DPT0009I",null,null,null,null,null,null,null,"X",null,null,null,null,null,null,null,1,null,null,10357.85]
[null,"GUANAJUATO","RAFB620409PS9","RAFB620409MNLMNL08","BLANCA ESTHELA RAMOS FUENTES","11DPT0008J",null,null,null,null,null,null,null,"X",null,null,null,null,null,null,null,1,null,null,10318.799999999999]
[null,"GUANAJUATO","ROJL7510077S9","ROJL751007MGTJMR17","LAURA MARICELA ROJAS JIMENEZ","11DPT0008J",null,null,null,null,null,null,null,"X",null,null,null,null,null,null,null,1,null,null,10318.799999999999]
[null,"GUANAJUATO","COML571122DD6","COML571122MGTRRT18","LETICIA CORNEJO MARTINEZ","11DPT0013V",null,null,null,null,null,null,null,"X",null,null,null,null,null,null,null,1,null,null,10318.799999999999]
[null,"GUANAJUATO","GULM751128QC4","GULM751128HGTRNR07","MARIO DE JESUS GUERRERO LUNA","11DPT0007K",null,null,null,null,null,null,null,"X",null,null,null,null,null,null,null,1,null,null,10259.24]
[null,"GUANAJUATO","CUGV730427G51","CUGV730427HGTLMC00","VICTOR MANUEL CUELLAR GOMEZ","11DPT0005M",null,null,null,null,null,null,null,"X",null,null,null,null,null,null,null,1,null,null,10243.75]
[null,"GUANAJUATO","ROFL880718AL5","ROFL880718MGTDLR00","LAURA VIRIDIANA RODRIGUEZ FLORES","11DPT0007K",null,null,null,null,null,null,null,"X",null,null,null,null,null,null,null,1,null,null,10212.689999999999]
[null,"GUANAJUATO","MACD620420JFA","MACD620420HGTRRV07","DAVID MARTINEZ CURTIDOR","11DPT0008J",null,null,null,null,null,null,null,"X",null,null,null,null,null,null,null,1,null,null,10151.73]
[null,"GUANAJUATO","HERE800329V17","HERE800329HGTRDD03","EDGAR IVÁN HERNÁNDEZ RODRÍGUEZ","11DPT0010Y",null,null,null,null,null,null,null,"X",null,null,null,null,null,null,null,1,null,null,9984.66]
[null,"GUANAJUATO","RAGM860115N6A","RAGM860115HGTMRR00","MAURO RAMIREZ GARCIA","11DPT0001Q",null,null,null,null,null,null,null,"X",null,null,null,null,null,null,null,1,null,null,9984.66]
[null,"GUANAJUATO","RALG600418P69","RALG600418MGTMPD09","MARIA GUADALUPE RAMOS LOPEZ","11DPT0001Q",null,null,null,null,null,null,null,"X",null,null,null,null,null,null,null,1,null,null,9984.66]
[null,"GUANAJUATO","RORM6503108B9","RORM650310MGTSDL03","MILAGROS ROSAS RODRIGUEZ","11DPT0006L",null,null,null,null,null,null,null,"X",null,null,null,null,null,null,null,1,null,null,9984.66]
[null,"GUANAJUATO","MARJ690613N97","MARJ690613HGTGYN00","JUAN MIGUEL MAGAÑA  RAYA","11DPT0005M",null,null,null,null,null,null,null,"X",null,null,null,null,null,null,null,1,null,null,9950.36]
[null,"GUANAJUATO","VESJ58011884A","VESJ580118HGTGNN01","JUAN CARLOS VEGA SANCHEZ","11DPT0006L",null,null,null,null,null,null,null,"X",null,null,null,null,null,null,null,1,null,null,9943.52]
[null,"GUANAJUATO","GAMA5108287F5","GAMA510828HGTRR609","AGUSTIN  GARDIAZABAL  MORALES ","11DPT0011X",null,null,null,null,null,null,null,"X",null,null,null,null,null,null,null,1,null,null,9936.76]
[null,"GUANAJUATO","AACN800319VC6","AACN800319MGTYRY15","NAYELI DE JESUS AYALA CARRERA","11DPT0009I",null,null,null,null,null,null,null,"X",null,null,null,null,null,null,null,1,null,null,9933.35]
[null,"GUANAJUATO","COMI550105UFA","COMI550105MVZRRS01","MARIA ISABEL CORTES MARTINEZ","11DPT0002P",null,null,null,null,null,null,null,"X",null,null,null,null,null,null,null,1,null,null,9933.35]
[null,"GUANAJUATO","GULA760327G74","GULA760327MCSLPN05","ANA CELIA GUILLEN LOPEZ","11DPT0001Q",null,null,null,null,null,null,null,"X",null,null,null,null,null,null,null,1,null,null,9882.5]
[null,"GUANAJUATO","LOJA720726KJ9","LOJA720726MGTPMN03","ANA CRISTINA LOPEZ JIMENEZ","11DPT0003O",null,null,null,null,null,null,null,"X",null,null,null,null,null,null,null,1,null,null,9781.39]
[null,"GUANAJUATO","RIMA811003E55","RIMA811003MGTVRN05","ANA PAOLA RIVADENEYRA MARTINEZ","11DPT0002P",null,null,null,null,null,null,null,"X",null,null,null,null,null,null,null,1,null,null,9777.7800000000007]
[null,"GUANAJUATO","MOVJ75111289A","MOVJ751112HJCRRR01","JORGE ARMANDO MORALES VARGAS","11DPT0007K",null,null,null,null,null,null,null,"X",null,null,null,null,null,null,null,1,null,null,9775.7899999999991]
[null,"GUANAJUATO","CECE690308KZ9","CECE690308HGTRRL05","ELIAS CERVANTES CRUZ","11DPT0002P",null,null,null,null,null,null,null,"X",null,null,null,null,null,null,null,1,null,null,9758.7800000000007]
[null,"GUANAJUATO","OIMD8504181Z5","OIMD850418MGTLRN00","DIANA OLIVA MORENO","11DPT0007K",null,null,null,null,null,null,null,"X",null,null,null,null,null,null,null,1,null,null,9685]
[null,"GUANAJUATO","AACJ6404113K8","AACJ640411HGTNBV01","JAVIER ANDRADE CIBRIAN","11DPT0014U",null,null,null,null,null,null,null,"X",null,null,null,null,null,null,null,1,null,null,9685]
[null,"GUANAJUATO","DIRS7905261S6","DIRS790526MJCZVR00","SAIRA  ESTHER DIAZ RIVERA","11DPT0010Y",null,null,null,null,null,null,null,"X",null,null,null,null,null,null,null,1,null,null,9632.630000000001]
[null,"GUANAJUATO","MABG7804019Z5","MABG780401MGTCRL00","GLORIA ELENA MACIEL  BARAJAS","11DPT0005M",null,null,null,null,null,null,null,"X",null,null,null,null,null,null,null,1,null,null,9591.880000000001]
[null,"GUANAJUATO","GOVA7403201E8","GOVA740320HGTMLR06","JOSE ARMANDO GOMEZ VALENCIA","11DPT0008J",null,null,null,null,null,null,null,"X",null,null,null,null,null,null,null,1,null,null,9584.43]
[null,"GUANAJUATO","PACM790918HT8","PACM790918HGTNRR13","MAURICIO  PANIAGUA  CARRILLO ","11DPT0011X",null,null,null,null,null,null,null,"X",null,null,null,null,null,null,null,1,null,null,9530.58]
[null,"GUANAJUATO","EIME671030L39","EIME671030HGTSRD00","EDUARDO ESPINO MIRANDA","11DPT0006L",null,null,null,null,null,null,null,"X",null,null,null,null,null,null,null,1,null,null,9506.8100000000013]
[null,"GUANAJUATO","AOOV770724DZ8","AOOV770724MGTRRR09","VERONICA ARZOLA ORTEGA","11DPT0010Y",null,null,null,null,null,null,null,"X",null,null,null,null,null,null,null,1,null,null,9451.32]
[null,"GUANAJUATO","MUIM8412058X9","MUIM841205MQTXBR03","MARIANA MUÑOZ IBARRA","11DPT0012W",null,null,null,null,null,null,null,"X",null,null,null,null,null,null,null,1,null,null,9312.5]
[null,"GUANAJUATO","NAGM7308014C0","NAGM730801MGTJZR05"," MARCELA NAJERA GUZMAN ","11DPT0007K",null,null,null,null,null,null,null,"X",null,null,null,null,null,null,null,1,null,null,9312.5]
[null,"GUANAJUATO","FORA850413INA","FORA850413HGTLZL09","ALBERTO FLORES RAZO","11DPT0002P",null,null,null,null,null,null,null,"X",null,null,null,null,null,null,null,1,null,null,9312.5]
[null,"GUANAJUATO","DIGJ5805018S3","DIGJ580501HGTZTR09","JORGE DIAZ GUTIERREZ","11DPT0005M",null,null,null,null,null,null,null,"X",null,null,null,null,null,null,null,1,null,null,9126.25]
[null,"GUANAJUATO","PEGR750725A34","PEGR750725HDFRTC00","RICARDO PEREZ GUTIERREZ","11DPT0012W",null,null,null,null,null,null,null,"X",null,null,null,null,null,null,null,1,null,null,9016.9]
[null,"GUANAJUATO","TOCR790420PZ9","TOCR790420HGTRRB01","RUBEN  TORRES  CARMONA ","11DPT0011X",null,null,null,null,null,null,null,"X",null,null,null,null,null,null,null,1,null,null,8976.7900000000009]
[null,"GUANAJUATO","NARV8007097C1","NARV800709HGTVQC06","VICTOR MANUEL  NAVARRO  ROQUE ","11DPT0011X",null,null,null,null,null,null,null,"X",null,null,null,null,null,null,null,1,null,null,8971.93]
[null,"GUANAJUATO","PARB8612287J6","PARB861228MGTCDR09","BARBARA PALOMA PACHECO  RODRIGUEZ","11DPT0012W",null,null,null,null,null,null,null,"X",null,null,null,null,null,null,null,1,null,null,8940]
[null,"GUANAJUATO","CACR540413CR4","CACR540413HBCSSL00","RAUL CASTAÑEDA CASTRO","11DPT0005M",null,null,null,null,null,null,null,"X",null,null,null,null,null,null,null,1,null,null,8940]
[null,"GUANAJUATO","GOOE760928BN1","GOOE760928HGTMRN01","ENRIQUE ALEJANDRO GOMEZ OROPEZA","11DPT0007K",null,null,null,null,null,null,null,"X",null,null,null,null,null,null,null,1,null,null,8813.98]
[null,"GUANAJUATO","MEGR720113GQ8","MEGR720113HMNRNM02","RAMIRO MERCADO  GONZALEZ","11DPT0012W",null,null,null,null,null,null,null,"X",null,null,null,null,null,null,null,1,null,null,8691.7000000000007]
[null,"GUANAJUATO","ZAVJ481005MS5","ZAVJ481005HGTVLS09","JOSE DE JESUS ZAVALA VILLAGOMEZ","11DPT0001Q",null,null,null,null,null,null,null,"X",null,null,null,null,null,null,null,1,null,null,8638.2799999999988]
[null,"GUANAJUATO","LAML7310086Z6","LAML731008MGTRNR00","LAURA LARA MANCERA","11DPT0001Q",null,null,null,null,null,null,null,"X",null,null,null,null,null,null,null,1,null,null,8599]
[null,"GUANAJUATO","HERA5904202S0","HERA590420HGTRSN04","JOSE ANTONIO HERRERA  ROSALES","11DPT0002P",null,null,null,null,null,null,null,"X",null,null,null,null,null,null,null,1,null,null,8416.4699999999993]
[null,"GUANAJUATO","MAST560810KJ7","MAST560810HGTRNR00","J. TRINIDAD  MARTINEZ  SANCHEZ ","11DPT0011X",null,null,null,null,null,null,null,"X",null,null,null,null,null,null,null,1,null,null,8286.26]
[null,"GUANAJUATO","GOAJ7711065Z5","GOAJ771106HGTNLN00","JUAN PABLO GONZALEZ ALVARADO","11DPT0009I",null,null,null,null,null,null,null,"X",null,null,null,null,null,null,null,1,null,null,8257.26]
[null,"GUANAJUATO","GOPS6802087F1","GOPS680208HGTNDN00","SANTIAGO GONZALEZ PADILLA","11DPT0007K",null,null,null,null,null,null,null,"X",null,null,null,null,null,null,null,1,null,null,8216.9599999999991]
[null,"GUANAJUATO","SACF740918BK7","SACF740918HJCNML11","FELIX SANCHEZ CAMPOS","11DPT0011X",null,null,null,null,null,null,null,"X",null,null,null,null,null,null,null,1,null,null,8199.52]
[null,"GUANAJUATO","CARL560630141","CARL560630HGTSVS09","JOSE LUIS CASTRO RIVAS","11DPT0001Q",null,null,null,null,null,null,null,"X",null,null,null,null,null,null,null,1,null,null,8195]
[null,"GUANAJUATO","AAVL730510P19","AAVL730510MGTYLR00","LAURA ELENA AYALA VALTIERRA","11DPT0009I",null,null,null,null,null,null,null,"X",null,null,null,null,null,null,null,1,null,null,8070.85]
[null,"GUANAJUATO","BAGA680215FI6","BAGA680215HDFRDD03","ADRIAN BRAVO GUADARRAMA","11DPT0005M",null,null,null,null,null,null,null,"X",null,null,null,null,null,null,null,1,null,null,8070.85]
[null,"GUANAJUATO","EIGG680608R24","EIGG680608HGTSNR01","GERARDO ESPITIA GONZALEZ","11DPT0008J",null,null,null,null,null,null,null,"X",null,null,null,null,null,null,null,1,null,null,8070.85]
[null,"GUANAJUATO","SAPR691204HS9","SAPR691204MGTNRS09","ROSA ELIA SANDOVAL PRADO","11DPT0009I",null,null,null,null,null,null,null,"X",null,null,null,null,null,null,null,1,null,null,8070.85]
[null,"GUANAJUATO","PEGA8608144V9","PEGA860814MGTRTD07","MARIA AIDA PEREZ  GUTIERREZ ","11DPT0012W",null,null,null,null,null,null,null,"X",null,null,null,null,null,null,null,1,null,null,8010.0599999999995]
[null,"GUANAJUATO","MALS720215M37","MALS720215MGTRPR06","SARA MARTINEZ LOPEZ","11DPT0009I",null,null,null,null,null,null,null,"X",null,null,null,null,null,null,null,1,null,null,8008.75]
[null,"GUANAJUATO","MESL721106M79","MESL721106HMCNNC01","LUCIANO MENDOZA SANCHEZ","11DPT0012W",null,null,null,null,null,null,null,"X",null,null,null,null,null,null,null,1,null,null,7871.97]
[null,"GUANAJUATO","DARE870421E95","DARE870421MGTMDD0","EDUARDINA ESAIG DAMIAN  RODRIGUEZ","11DPT0002P",null,null,null,null,null,null,null,"X",null,null,null,null,null,null,null,1,null,null,7822.5]
[null,"GUANAJUATO","RECT770406EE9","RECT770406MMNNHR04","TERESITA DEL NIÑO JESUS RENTERIA CHAVEZ","11DPT0001Q",null,null,null,null,null,null,null,"X",null,null,null,null,null,null,null,1,null,null,7733.86]
[null,"GUANAJUATO","AURJ751104NX7","AURJ751104HGTGDN09","JUAN CARLOS  AGUIRRE RODRÌGUEZ","11DPT0010Y",null,null,null,null,null,null,null,"X",null,null,null,null,null,null,null,1,null,null,7667.28]
[null,"GUANAJUATO","GORC720101Q12","GORC720101MMNNBR04","CRISTINA GONZALEZ ROBLES","11DPT0012W",null,null,null,null,null,null,null,"X",null,null,null,null,null,null,null,1,null,null,7607.16]
[null,"GUANAJUATO","PEGO840715TW6","PEGO840715MGTRRL04","OLGA CRISTINA  PEREZ GUERRERO","11DPT0010Y",null,null,null,null,null,null,null,"X",null,null,null,null,null,null,null,1,null,null,7554.4400000000005]
[null,"GUANAJUATO","GACP660324G26","GACP660324HGTLPD03","PEDRO GALVEZ CAPORAL","11DPT0008J",null,null,null,null,null,null,null,"X",null,null,null,null,null,null,null,1,null,null,7540.51]
[null,"GUANAJUATO","MOCM7012151Q9","MOCM701215MGTRNN01","MANUELA MORALES CENDEJAS","11DPT0009I",null,null,null,null,null,null,null,"X",null,null,null,null,null,null,null,1,null,null,7519.1100000000006]
[null,"GUANAJUATO","MEZJ750302AC9","MEZJ750302HGTNPR00","JORGE MENDOZA ZAPATA","11DPT0007K",null,null,null,null,null,null,null,"X",null,null,null,null,null,null,null,1,null,null,7452.5499999999993]
[null,"GUANAJUATO","RAPB721103D6A","RAPB721103MMNMZT09","BEATRIZ EUGENIA RAMOS PAZ","11DPT0010Y",null,null,null,null,null,null,null,"X",null,null,null,null,null,null,null,1,null,null,7452.45]
[null,"GUANAJUATO","RUBS800124TR0","RUBS800124HGTZRL06","SAUL RUIZ BERBENA","11DPT0007K",null,null,null,null,null,null,null,"X",null,null,null,null,null,null,null,1,null,null,7452.45]
[null,"GUANAJUATO","DEPT800907TBA","DEPT800907MGTRDR04","MARIA TERESA DERRAMADERO PADILLA","11DPT0001Q",null,null,null,null,null,null,null,"X",null,null,null,null,null,null,null,1,null,null,7450]
[null,"GUANAJUATO","SOGC7802151Z2","SOGC780215MDFLRL01","CLAUDIA SOLACHE GARCÍA","11DPT0010Y",null,null,null,null,null,null,null,"X",null,null,null,null,null,null,null,1,null,null,7450]
[null,"GUANAJUATO","AOOC650822A32","AOOC650822MGTRJR02","MA CRISTINA ARROYO OJEDA","11DPT0001Q",null,null,null,null,null,null,null,"X",null,null,null,null,null,null,null,1,null,null,7450]
[null,"GUANAJUATO","AUME740716A41","AUME740716HPLGDN13","ENRIQUE AGUILAR MEDRANO","11DPT0008J",null,null,null,null,null,null,null,"X",null,null,null,null,null,null,null,1,null,null,7374.78]
[null,"GUANAJUATO","GUVG640807PZ4","GUVG640807MDFZRB04","GABRIELA GUIZAR VARGAS","11DPT0002P",null,null,null,null,null,null,null,"X",null,null,null,null,null,null,null,1,null,null,7374.5599999999995]
[null,"GUANAJUATO","MASA840303K12","MASA840303MDFRNN08","MARIA DE LOS ANGELES MARTINEZ SANCHEZ","11DPT0012W",null,null,null,null,null,null,null,"X",null,null,null,null,null,null,null,1,null,null,7369.6100000000006]
[null,"GUANAJUATO","CUMJ850922E29","CUMJ850922MGTVRV00","JAVIERA MARIANA CUEVAS MIRELES","11DPT0008J",null,null,null,null,null,null,null,"X",null,null,null,null,null,null,null,1,null,null,7291.9]
[null,"GUANAJUATO","RARM6206207M6","RARM620620HGTMDN03","MANUEL RAMÍREZ RODRÍGUEZ","11DPT0010Y",null,null,null,null,null,null,null,"X",null,null,null,null,null,null,null,1,null,null,7281.58]
[null,"GUANAJUATO","ROGA700124964","ROGA700124MGTCZN09","ANA ELENA ROCHA GUZMÁN","11DPT0010Y",null,null,null,null,null,null,null,"X",null,null,null,null,null,null,null,1,null,null,7251.61]
[null,"GUANAJUATO","LARJ570720TF2","LARJ570720HGTGDR08","JORGE ARTURO LAGUNA RODIGUEZ","11DPT0002P",null,null,null,null,null,null,null,"X",null,null,null,null,null,null,null,1,null,null,7201.68]
[null,"GUANAJUATO","GARB840625CP8","GARB840625MQTLDR08","BRENDA LIDIA GALLEGOS RODRIGUEZ","11DPT0012W",null,null,null,null,null,null,null,"X",null,null,null,null,null,null,null,1,null,null,7181.43]
[null,"GUANAJUATO","LOGS791206JH1","LOGS791206HGTPPR07","SERGIO LOPEZ GUAPO","11DPT0008J",null,null,null,null,null,null,null,"X",null,null,null,null,null,null,null,1,null,null,7181.43]
[null,"GUANAJUATO","MEMJ801218ND2","MEMJ801218HGTNRS09","JOSE DE JESUS MENDIOLA MARTINEZ","11DPT0002P",null,null,null,null,null,null,null,"X",null,null,null,null,null,null,null,1,null,null,7181.43]
[null,"GUANAJUATO","ROVA6201238U9","ROVA620123HGTDGL01","ALFONSO RODRIGUEZ VEGA","11DPT0009I",null,null,null,null,null,null,null,"X",null,null,null,null,null,null,null,1,null,null,7181.43]
[null,"GUANAJUATO","SECJ780511UPA","SECJ780511MGTRHN02","JUANA MARIA CONCEPCION SERRANO CHAGOYA","11DPT0013V",null,null,null,null,null,null,null,"X",null,null,null,null,null,null,null,1,null,null,7181.43]
[null,"GUANAJUATO","TOAB770225NZ9","TOAB770225MGTRRR00","BERENICE TORRES ARROYO","11DPT0009I",null,null,null,null,null,null,null,"X",null,null,null,null,null,null,null,1,null,null,7181.43]
[null,"GUANAJUATO","DEBY851217D4A","DEBJ851217MGTLLS09","JUSELY GUADALUPE DELGADO BELTRAN","11DPT0002P",null,null,null,null,null,null,null,"X",null,null,null,null,null,null,null,1,null,null,7077.5]
[null,"GUANAJUATO","EUQJ600614JNA","EUQJ600614HDFSRN05","JUAN MIGUEL ESQUIVEL QUIROZ","11DPT0002P",null,null,null,null,null,null,null,"X",null,null,null,null,null,null,null,1,null,null,7077.5]
[null,"GUANAJUATO","VESA780412778","VESA780412MZSLNN00","ANGELICA MARIA VELAZCO SANDOVAL","11DPT0001Q",null,null,null,null,null,null,null,"X",null,null,null,null,null,null,null,1,null,null,7077.5]
[null,"GUANAJUATO","CAHJ750812FB7","CAHJ750812HGTHRR09","JORGE ALEJANDRO CHAGOYA HERNANDEZ","11DPT0002P",null,null,null,null,null,null,null,"X",null,null,null,null,null,null,null,1,null,null,7001.2800000000007]
[null,"GUANAJUATO","TAGL820524R17","TAGL820524MGTPMZ06"," MARIA DE LA LUZ TAPIA GOMEZ     ","11DPT0007K",null,null,null,null,null,null,null,"X",null,null,null,null,null,null,null,1,null,null,6986.71]
[null,"GUANAJUATO","RORL860709G29","RORL860709MGTDML06","LILIA BERENICE RODRIGUEZ RAMIREZ","11DPT0007K",null,null,null,null,null,null,null,"X",null,null,null,null,null,null,null,1,null,null,6972.51]
[null,"GUANAJUATO","ROSC730321AY9","ROSC730321HGTSLR07","JOSE CRUZ ROSALES SOLARZANO","11DPT0001Q",null,null,null,null,null,null,null,"X",null,null,null,null,null,null,null,1,null,null,6960.46]
[null,"GUANAJUATO","TEAC711130CQ2","TEAC711130MGTJDL00","CLAUDIA ELENA TEJEDA ADAME","11DPT0009I",null,null,null,null,null,null,null,"X",null,null,null,null,null,null,null,1,null,null,6948.4500000000007]
[null,"GUANAJUATO","JAAM590516MH6","JAAM590516HGTMRN03","MANUEL JAIME ARELLANO","11DPT0012W",null,null,null,null,null,null,null,"X",null,null,null,null,null,null,null,1,null,null,6913.34]
[null,"GUANAJUATO","VESX850703GKA","VESX850703MGTLLC16","XOCHITL TOMASA VELÁZQUEZ SILVA","11DPT0010Y",null,null,null,null,null,null,null,"X",null,null,null,null,null,null,null,1,null,null,6912.4499999999989]
[null,"GUANAJUATO","MAST621028SCA","MAST621028MGTRTT12","MA TERESA MARTINEZ SOTO","11DPT0002P",null,null,null,null,null,null,null,"X",null,null,null,null,null,null,null,1,null,null,6891.25]
[null,"GUANAJUATO","POAA7404163G8","POAA740416MDFRCN05","ANA LILIA PROA ACEVEDO","11DPT0010Y",null,null,null,null,null,null,null,"X",null,null,null,null,null,null,null,1,null,null,6879.11]
[null,"GUANAJUATO","DIVA711128CB2","DIVA711128MMCZGL03","ALEJANDRA DIAZ VEGA","11DPT0007K",null,null,null,null,null,null,null,"X",null,null,null,null,null,null,null,1,null,null,6860.23]
[null,"GUANAJUATO","CAVA820322S74","CAVA820322HDFHRB06","ABRAHAM CHAVEZ VARELA","11DPT0001Q",null,null,null,null,null,null,null,"X",null,null,null,null,null,null,null,1,null,null,6798.13]
[null,"GUANAJUATO","JIEC831030A73","JIEC831030MGTMSR07","MARIA CRISTHIAN JIMENEZ ESQUEDA","11DPT0001Q",null,null,null,null,null,null,null,"X",null,null,null,null,null,null,null,1,null,null,6794.73]
[null,"GUANAJUATO","MOHT651003EA6","MOHT651003MGTRRR13","MA TERESA MORENO HERNANDEZ","11DPT0002P",null,null,null,null,null,null,null,"X",null,null,null,null,null,null,null,1,null,null,6769.05]
[null,"GUANAJUATO","MERA6410168B4","MERA641016HGTDZL14","ALEJANDRO MEDINA REZA","11DPT0011X",null,null,null,null,null,null,null,"X",null,null,null,null,null,null,null,1,null,null,6637.95]
[null,"GUANAJUATO","NOIG870606719","NOIG870606HMCGNS09","GUSTAVO NOGUEZ INIESTA","11DPT0012W",null,null,null,null,null,null,null,"X",null,null,null,null,null,null,null,1,null,null,6629.01]
[null,"GUANAJUATO","COTR740102LT0","COTR740102MMCRRC00","ROCIO CORONA TIRADO","11DPT0006L",null,null,null,null,null,null,null,"X",null,null,null,null,null,null,null,1,null,null,6629]
[null,"GUANAJUATO","EAGA611030B76","EAGA611030HGTSTN01","ANTONIO MARTIN ESTRADA GUTIERREZ","11DPT0002P",null,null,null,null,null,null,null,"X",null,null,null,null,null,null,null,1,null,null,6601.38]
[null,"GUANAJUATO","REBJ861120CG2","REBJ861120HGTYNN00","JUAN CARLOS REYNOSO BANDERAS","11DPT0010Y",null,null,null,null,null,null,null,"X",null,null,null,null,null,null,null,1,null,null,6578.55]
[null,"GUANAJUATO","CABD840721MI3","CABD840721HGTSNN09","DANIEL CASIQUE BUENAVISTA","11DPT0001Q",null,null,null,null,null,null,null,"X",null,null,null,null,null,null,null,1,null,null,6537.11]
[null,"GUANAJUATO","PAEI8110081S7","PAEI811008MOCDSR01","IRMA LORENZ PADILLA ESCUDERO","11DPT0001Q",null,null,null,null,null,null,null,"X",null,null,null,null,null,null,null,1,null,null,6535.51]
[null,"GUANAJUATO","MORB790906FV5","MORB790906MGTNSR05","BERTHA ALICIA MONJARAZ RIOS","11DPT0007K",null,null,null,null,null,null,null,"X",null,null,null,null,null,null,null,1,null,null,6480.08]
[null,"GUANAJUATO","EILL500310BA8","EILL500310MDFLLL09","LILIA SUSANA ELIZALDE LLOPIS","11DPT0013V",null,null,null,null,null,null,null,"X",null,null,null,null,null,null,null,1,null,null,6463.2800000000007]
[null,"GUANAJUATO","VERA861220MM3","VERA861220MTLLML06","ALMA ROCIO VELA ROMERO","11DPT0007K",null,null,null,null,null,null,null,"X",null,null,null,null,null,null,null,1,null,null,6370.41]
[null,"GUANAJUATO","ROLM821117536","ROLM821117HGTDPN05","MANUEL CHRISTIAN JARED RODRIGUEZ  LOPEZ","11DPT0005M",null,null,null,null,null,null,null,"X",null,null,null,null,null,null,null,1,null,null,6332.5]
[null,"GUANAJUATO","LOHE8811064TA","LOHE881106MJCPRD00","EDITH LOPEZ HERNANDEZ","11DPT0006L",null,null,null,null,null,null,null,"X",null,null,null,null,null,null,null,1,null,null,6283.68]
[null,"GUANAJUATO","EOTJ551129MU2","EOTS551129HGTSPT10"," J. SATURNINO ESCOTO TAPIA","11DPT0007K",null,null,null,null,null,null,null,"X",null,null,null,null,null,null,null,1,null,null,6221.49]
[null,"GUANAJUATO","EALA741207MR5","EALA741207MGTSND01","ADRIANA ESCAMILLA  LUNA","11DPT0014U",null,null,null,null,null,null,null,"X",null,null,null,null,null,null,null,1,null,null,6187.08]
[null,"GUANAJUATO","LOJL93033086","LOJL930330HGTPMS07","LUIS ANGEL LOPEZ JIMENEZ","11DPT0010Y",null,null,null,null,null,null,null,"X",null,null,null,null,null,null,null,1,null,null,6134.0899999999992]
[null,"GUANAJUATO","GOHV780329HP0","GOHV780329MGTNRR00","VERÓNICA GONZÁLEZ HERNÁNDEZ","11DPT0010Y",null,null,null,null,null,null,null,"X",null,null,null,null,null,null,null,1,null,null,6053.13]
[null,"GUANAJUATO","CAGG7503244Z4","CAGG750324MGTBTB00","GABRIELA DEL CARMEN CABRERA GUTIÉRREZ","11DPT0010Y",null,null,null,null,null,null,null,"X",null,null,null,null,null,null,null,1,null,null,6053.13]
[null,"GUANAJUATO","EIVJ6412112B7","EIVJ641211HGTLLN00","JUAN CARLOS ELIZARRARAZ VILLALPANDO","11DPT0002P",null,null,null,null,null,null,null,"X",null,null,null,null,null,null,null,1,null,null,6019.3]
[null,"GUANAJUATO","HELM570929SP5","HELM570929HQTRRG04","MIGUEL HERNANDEZ LIRA","11DPT0012W",null,null,null,null,null,null,null,"X",null,null,null,null,null,null,null,1,null,null,5997.54]
[null,"GUANAJUATO","JAOP740625985","JAOP740625MGTMLT05","PATRICIA JAIME  OLVERA","11DPT0002P",null,null,null,null,null,null,null,"X",null,null,null,null,null,null,null,1,null,null,5966.1]
[null,"GUANAJUATO","VEGJ690320CV6","VEGJ690320HGTGNN02","JUAN ANTONIO VEGA GONZALEZ","11DPT0006L",null,null,null,null,null,null,null,"X",null,null,null,null,null,null,null,1,null,null,5966.1]
[null,"GUANAJUATO","RACM561219L8A","RACM561219HGTMNR07","MARIO RAMÍREZ CONTRERAS","11DPT0010Y",null,null,null,null,null,null,null,"X",null,null,null,null,null,null,null,1,null,null,5937.57]
[null,"GUANAJUATO","MAVR720809AXA","MAVR720809MGTNZS05","ROSA BEATRIZ MANJARREZ VAZQUEZ","11DPT0010Y",null,null,null,null,null,null,null,"X",null,null,null,null,null,null,null,1,null,null,5902.3]
[null,"GUANAJUATO","HEGJ8007282N5","HEGJ800728MGTRTN07","JANETH HERNANDEZ GUTIERREZ","11DPT0002P",null,null,null,null,null,null,null,"X",null,null,null,null,null,null,null,1,null,null,5712.35]
[null,"GUANAJUATO","SAVD840330123","SAVD840330MCLLGL06","DULCE IRENE SALINAS VEGA","11DPT0012W",null,null,null,null,null,null,null,"X",null,null,null,null,null,null,null,1,null,null,5712.35]
[null,"GUANAJUATO","ZARJ781201E25","ZARJ781201HGTRNS07","JESUS ZARAZUA RANGEL","11DPT0012W",null,null,null,null,null,null,null,"X",null,null,null,null,null,null,null,1,null,null,5712.35]
[null,"GUANAJUATO","RAEM750806613","RAEM750806MDFMLN07","MONICA MARCELA RAMIREZ ELIZALDE","11DPT0013V",null,null,null,null,null,null,null,"X",null,null,null,null,null,null,null,1,null,null,5668]
[null,"GUANAJUATO","LOVV821208K16","LOVV821208HGTPZC03","VICTOR HUGO LOPEZ VAZQUEZ","11DPT0008J",null,null,null,null,null,null,null,"X",null,null,null,null,null,null,null,1,null,null,5634.66]
[null,"GUANAJUATO","NETN640509LW1","NETN640509MNLRRR02","NORA MERCEDES NEIRA TORRES","11DPT0010Y",null,null,null,null,null,null,null,"X",null,null,null,null,null,null,null,1,null,null,5626.8600000000006]
[null,"GUANAJUATO","OASF640805DW4","OASF640805HGTCTR00","FRANCISCO JAVIER OCAMPO SOTO","11DPT0002P",null,null,null,null,null,null,null,"X",null,null,null,null,null,null,null,1,null,null,5589.35]
[null,"GUANAJUATO","CACV851205PW0","CACV851205MQTRRR00","VERA CABELLO  CORONA","11DPT0012W",null,null,null,null,null,null,null,"X",null,null,null,null,null,null,null,1,null,null,5587.5]
[null,"GUANAJUATO","CAMH790325MK6","CAMH790325HGTSSC09","HECTOR CASTRO MOSQUEDA","11DPT0002P",null,null,null,null,null,null,null,"X",null,null,null,null,null,null,null,1,null,null,5587.5]
[null,"GUANAJUATO","CIAV791109IT0","CIAV791109MGTRRR05","VERONICA CRISANTO ARRIAGA","11DPT0008J",null,null,null,null,null,null,null,"X",null,null,null,null,null,null,null,1,null,null,5587.5]
[null,"GUANAJUATO","COAA820127CJ8","COAA820127MGTRYN00","ANA ERICKA CORRALES AYALA","11DPT0002P",null,null,null,null,null,null,null,"X",null,null,null,null,null,null,null,1,null,null,5587.5]
[null,"GUANAJUATO","GABM731224PP4","GABM731224HGTRLG09","MIGUEL ANGEL GARCIA BELTRAN","11DPT0005M",null,null,null,null,null,null,null,"X",null,null,null,null,null,null,null,1,null,null,5426.19]
[null,"GUANAJUATO","GAMM750120RB8","GANN750120MGTRSR08","MARTHA ELBA GARCIA MOSQUEDA","11DPT0002P",null,null,null,null,null,null,null,"X",null,null,null,null,null,null,null,1,null,null,5401.25]
[null,"GUANAJUATO","LOVJ660127MI1","LOVJ660127HGTPLN03","JUAN LÓPEZ VALENCIA","11DPT0010Y",null,null,null,null,null,null,null,"X",null,null,null,null,null,null,null,1,null,null,5401.25]
[null,"GUANAJUATO","JULB700329347","JULB700329HGTRNN09","BENITO JUAREZ LEON","11DPT0008J",null,null,null,null,null,null,null,"X",null,null,null,null,null,null,null,1,null,null,5389.11]
[null,"GUANAJUATO","RIGM700422KM3","RIGM700422MGTVNG06","MA MAGDALENA RIVERA GONZALEZ","11DPT0013V",null,null,null,null,null,null,null,"X",null,null,null,null,null,null,null,1,null,null,5374.38]
[null,"GUANAJUATO","AEDI770518OLA","AEDI770518HGTRRS01","ISRAEL ARMANDO ARREDONDO  DORANTES","11DPT0012W",null,null,null,null,null,null,null,"X",null,null,null,null,null,null,null,1,null,null,5325.74]
[null,"GUANAJUATO","GOZV911104PZ4","GOZV911104HGTNMC06","VICTOR HUGO GONZALEZ ZAMUDIO","11DPT0012W",null,null,null,null,null,null,null,"X",null,null,null,null,null,null,null,1,null,null,5291.28]
[null,"GUANAJUATO","GOOC7007237B8","GOOC700123MGTMRR07","MA. DEL CARMEN GOMEZ OROPEZA","11DPT0007K",null,null,null,null,null,null,null,"X",null,null,null,null,null,null,null,1,null,null,5266.91]
[null,"GUANAJUATO","VALS820325LX7","VALS820325MGTLNL09","SILVIA NANCY VALADEZ LEON","11DPT0008J",null,null,null,null,null,null,null,"X",null,null,null,null,null,null,null,1,null,null,5266.91]
[null,"GUANAJUATO","RICE740107C14","RICE740107MGTVSR06","  ERIKA ADRIANA RIVERA CISNEROS   ","11DPT0007K",null,null,null,null,null,null,null,"X",null,null,null,null,null,null,null,1,null,null,5215]
[null,"GUANAJUATO","RICM661008713","RICM661008MGTSSR09","MARIBEL RIOS CASTRO","11DPT0001Q",null,null,null,null,null,null,null,"X",null,null,null,null,null,null,null,1,null,null,5215]
[null,"GUANAJUATO","VIZM6610296H8","VIZM661029MMNLRN03","MONICA VILLAGOMEZ  ZARATE","11DPT0005M",null,null,null,null,null,null,null,"X",null,null,null,null,null,null,null,1,null,null,5215]
[null,"GUANAJUATO","RORA810803AE8","RORA810803HGTDZR02","CARLOS ALFONSO RODRIGUEZ  RUIZ","11DPT0002P",null,null,null,null,null,null,null,"X",null,null,null,null,null,null,null,1,null,null,5207.4799999999996]
[null,"GUANAJUATO","SAOF7912075J9","SAOF791207HGTLRR02","FRANCISCO JAVIER  SALGADO ORTIZ","11DPT0011X",null,null,null,null,null,null,null,"X",null,null,null,null,null,null,null,1,null,null,5159.3999999999996]
[null,"GUANAJUATO","SATJ701026RC3","SATJ701026HGTNFS09","JOSE SANCHEZ TAFOYA","11DPT0009I",null,null,null,null,null,null,null,"X",null,null,null,null,null,null,null,1,null,null,5159.3999999999996]
[null,"GUANAJUATO","BAEJ7111265C6","BAEJ711126HGTTSS04","JESUS MARIO  BAUTISTA  ESCAMILLA ","11DPT0011X",null,null,null,null,null,null,null,"X",null,null,null,null,null,null,null,1,null,null,5159.3999999999996]
[null,"GUANAJUATO","HEAM5406144E9","HEAM540614MDFRRR09","MARISELA HERRERA ARVIZU","11DPT0007K",null,null,null,null,null,null,null,"X",null,null,null,null,null,null,null,1,null,null,5159.3999999999996]
[null,"GUANAJUATO","MAPA6006036V3","MAPA600603MGTCLN00","ANA AMPARO MACIAS PALACIOS","11DPT0007K",null,null,null,null,null,null,null,"X",null,null,null,null,null,null,null,1,null,null,5159.3999999999996]
[null,"GUANAJUATO","LOOE660716UY7","LOOE660716HGTPJD01","EDUARDO LOPEZ OJEDA","11DPT0004N",null,null,null,null,null,null,null,"X",null,null,null,null,null,null,null,1,null,null,5072.84]
[null,"GUANAJUATO","GOCE620703SD6","GOCE620703HDFNRN08","ENRIQUE GONZALEZ CARDONA","11DPT0004N",null,null,null,null,null,null,null,"X",null,null,null,null,null,null,null,1,null,null,4992.33]
[null,"GUANAJUATO","PARA650525ER4","PARA650525HGTNYR08","ARMANDO PANTOJA REYES","11DPT0004N",null,null,null,null,null,null,null,"X",null,null,null,null,null,null,null,1,null,null,4992.33]
[null,"GUANAJUATO","TOLJ711229Q89","TOLJ711229HGTRPV00","JAVIER TORRES LOPEZ","11DPT0008J",null,null,null,null,null,null,null,"X",null,null,null,null,null,null,null,1,null,null,4992.33]
[null,"GUANAJUATO","FAMD850123CZ0","FAMD850123HGTLNN04","DANIEL  FALCON  MONROY ","11DPT0011X",null,null,null,null,null,null,null,"X",null,null,null,null,null,null,null,1,null,null,4992.33]
[null,"GUANAJUATO","GARR8203151UA","GARR820315HHGRBY08","REYMUNDO GARCIA ROBLES","11DPT0011X",null,null,null,null,null,null,null,"X",null,null,null,null,null,null,null,1,null,null,4992.33]
[null,"GUANAJUATO","MOSA681126R27","MOSA681126MGTNRN06","MA ANGELES  MONTERO  SIERRA ","11DPT0011X",null,null,null,null,null,null,null,"X",null,null,null,null,null,null,null,1,null,null,4992.33]
[null,"GUANAJUATO","MUAO8512081H3","MUAO851208HGTXCS06","OSCAR  MUÑOZ ACEVEDO ","11DPT0011X",null,null,null,null,null,null,null,"X",null,null,null,null,null,null,null,1,null,null,4992.33]
[null,"GUANAJUATO","RORM810208UU3","RORM810208HGTCCR04","MARTIN RAFAEL ROCHA RICO","11DPT0001Q",null,null,null,null,null,null,null,"X",null,null,null,null,null,null,null,1,null,null,4992.33]
[null,"GUANAJUATO","SACM860807000","SACM860807HGTMMN00","JOSE MANUEL  SAMANO  CAMARGO ","11DPT0011X",null,null,null,null,null,null,null,"X",null,null,null,null,null,null,null,1,null,null,4992.33]
[null,"GUANAJUATO","AAGE740808PN4","AAGE740808HGTLRM03","EMMANUEL FRANCISCO ALCARAZ GARCIA","11DPT0007K",null,null,null,null,null,null,null,"X",null,null,null,null,null,null,null,1,null,null,4992.33]
[null,"GUANAJUATO","AAME860903","AAME860903HMNLDD08","EDGAR ALAN ALFARO MEDINA","11DPT0011X",null,null,null,null,null,null,null,"X",null,null,null,null,null,null,null,1,null,null,4992.33]
[null,"GUANAJUATO","AAVB660401UL2","AAVB660401MDFLVL01","BLANCA IVETTE ALVAREZ DEL CASTILLO VENTRE","11DPT0001Q",null,null,null,null,null,null,null,"X",null,null,null,null,null,null,null,1,null,null,4992.33]
[null,"GUANAJUATO","AEGE750228CT2","AEGE750228MGTRMR09","ERIKA ARÉVALO GÓMEZ","11DPT0010Y",null,null,null,null,null,null,null,"X",null,null,null,null,null,null,null,1,null,null,4992.33]
[null,"GUANAJUATO","CADJ720202F14","CADJ720202HMNHRN03","JUAN CHAVEZ DURAN","11DPT0006L",null,null,null,null,null,null,null,"X",null,null,null,null,null,null,null,1,null,null,4992.33]
[null,"GUANAJUATO","GUCT560830E19","GUCT560830MGTRSR17","MA TERESA GUERRERO CASTRO","11DPT0011X",null,null,null,null,null,null,null,"X",null,null,null,null,null,null,null,1,null,null,4992.33]
[null,"GUANAJUATO","LORC760609NB1","LORC760609MDFPVL08","CLAUDETTE LÓPEZ DE LA RIVA","11DPT0010Y",null,null,null,null,null,null,null,"X",null,null,null,null,null,null,null,1,null,null,4992.33]
[null,"GUANAJUATO","RAMO6702175A0","RAMO670217MMNNJL07","OLGA OFELIA RANGEL MEJIA","11DPT0006L",null,null,null,null,null,null,null,"X",null,null,null,null,null,null,null,1,null,null,4992.33]
[null,"GUANAJUATO","RIOL830629124","RIOL830629MGTVJZ05","MARIA DE LA LUZ RIVERA OJEDA","11DPT0011X",null,null,null,null,null,null,null,"X",null,null,null,null,null,null,null,1,null,null,4992.33]
[null,"GUANAJUATO","VELL651008V35","VELL651008MDFLGR02","MARÍA DE LOURDES JUANA VELÁZQUEZ LUGO","11DPT0010Y",null,null,null,null,null,null,null,"X",null,null,null,null,null,null,null,1,null,null,4992.33]
[null,"GUANAJUATO","GOHS8907177Z1","GOHS890717MQTMRN05","SANDRA IRAIS GOMEZ HERNANDEZ","11DPT0012W",null,null,null,null,null,null,null,"X",null,null,null,null,null,null,null,1,null,null,4989.2400000000007]
[null,"GUANAJUATO","JUBE7310241I6","JUBE731024MGTRLL05","ELIDUVINA JUAREZ BALANDRÁN","11DPT0010Y",null,null,null,null,null,null,null,"X",null,null,null,null,null,null,null,1,null,null,4989.2400000000007]
[null,"GUANAJUATO","GAPG840330FB1","GAPG840330MMCRRB02","GABRIELA GARCIA PEREZ","11DPT0008J",null,null,null,null,null,null,null,"X",null,null,null,null,null,null,null,1,null,null,4978.6099999999997]
[null,"GUANAJUATO","GOPR781214HT1","GOPR781214HGTNRD05","RODOLFO GONZALEZ PRESA","11DPT0008J",null,null,null,null,null,null,null,"X",null,null,null,null,null,null,null,1,null,null,4978.6099999999997]
[null,"GUANAJUATO","NAFE720728918","NAFE720728MDFVRV08","EVANGELINA NAVARRETE FARFAN","11DPT0011X",null,null,null,null,null,null,null,"X",null,null,null,null,null,null,null,1,null,null,4971.76]
[null,"GUANAJUATO","PABG6901266Q2","PABG690126HGTZNR06","GERARDO PAZ BONILLA","11DPT0009I",null,null,null,null,null,null,null,"X",null,null,null,null,null,null,null,1,null,null,4971.76]
[null,"GUANAJUATO","RARM770914S13","RARM770914HGTNYR07","MAURICIO RANGEL REYES","11DPT0009I",null,null,null,null,null,null,null,"X",null,null,null,null,null,null,null,1,null,null,4971.76]
[null,"GUANAJUATO","GORC820608RCA","GORC820608MGTLRT07","MA CONCEPCION GONZALEZ RAMIREZ","11DPT0002P",null,null,null,null,null,null,null,"X",null,null,null,null,null,null,null,1,null,null,4944.43]
[null,"GUANAJUATO","SOAO850607U46","SOAO850607HGGTGM04","OMAR DAVID SOTO AGUIRRE","11DPT0002P",null,null,null,null,null,null,null,"X",null,null,null,null,null,null,null,1,null,null,4882.08]
[null,"GUANAJUATO","GOGF7511182R7","GOGF751118HGTNSR05","FRANCISCO JAVIER GONZALEZ GASCA","11DPT0008J",null,null,null,null,null,null,null,"X",null,null,null,null,null,null,null,1,null,null,4842.5]
[null,"GUANAJUATO","GABM720316FV9","GABM720316MGTLRR09","MARTHA PATRICIA GARCIA BELTRAN","11DPT0005M",null,null,null,null,null,null,null,"X",null,null,null,null,null,null,null,1,null,null,4842.5]
[null,"GUANAJUATO","PEAS8212087J7","PEAS821208HDFRNL03","SAUL PEREZ ANGUIANO","11DPT0010Y",null,null,null,null,null,null,null,"X",null,null,null,null,null,null,null,1,null,null,4752.1499999999996]
[null,"GUANAJUATO","SOMJ860107SDA","SOMJ860107MTSSNS08","JESSICA SOSA MENA","11DPT0012W",null,null,null,null,null,null,null,"X",null,null,null,null,null,null,null,1,null,null,4729.45]
[null,"GUANAJUATO","AUGJ780722V55","AUGJ780722HGTGMN00","JUAN SIMON  AGUILAR  GOMEZ ","11DPT0011X",null,null,null,null,null,null,null,"X",null,null,null,null,null,null,null,1,null,null,4712.71]
[null,"GUANAJUATO","PEBG910930PM0","PEBG910930MQTRCD18","MARIA GUADALUPE PEREZ BECERRA","11DPT0012W",null,null,null,null,null,null,null,"X",null,null,null,null,null,null,null,1,null,null,4690.78]
[null,"GUANAJUATO","RONS740802CB3","RONS740802HGTCXL05","SALVADOR ROCHA NUÑEZ","11DPT0009I",null,null,null,null,null,null,null,"X",null,null,null,null,null,null,null,1,null,null,4690.78]
[null,"GUANAJUATO","EAMA860511UL8","EAMA860511MMNSRN08","ANA LUCIA ESCALANTE MARIN","11DPT0011X",null,null,null,null,null,null,null,"X",null,null,null,null,null,null,null,1,null,null,4656.25]
[null,"GUANAJUATO","AULG650807MX2","AULG650807MCLGPD08","MARIA GUADALUPE AGUILAR LOPEZ","11DPT0005M",null,null,null,null,null,null,null,"X",null,null,null,null,null,null,null,1,null,null,4656.25]
[null,"GUANAJUATO","BURL821104LM8","BURL821104MGTTMT09","LETICIA BUTANDA RAMIREZ","11DPT0013V",null,null,null,null,null,null,null,"X",null,null,null,null,null,null,null,1,null,null,4656.25]
[null,"GUANAJUATO","CEGE7106304G8","CEGE710630MGTBML09","MA ELIZABETH CEBALLOS GOMEZ","11DPT0001Q",null,null,null,null,null,null,null,"X",null,null,null,null,null,null,null,1,null,null,4656.25]
[null,"GUANAJUATO","SAMD841004000","SAMD841004MGTNLN03","DINORHA GEORGINA SANTIAGO MELCHOR","11DPT0010Y",null,null,null,null,null,null,null,"X",null,null,null,null,null,null,null,1,null,null,4647.16]
[null,"GUANAJUATO","HEAR7110051U4","HEAR711005HDFRRY04","RAYMUNDO HERNANDEZ ARRIAGA","11DPT0008J",null,null,null,null,null,null,null,"X",null,null,null,null,null,null,null,1,null,null,4647.16]
[null,"GUANAJUATO","MABR8302104V5","MABR830210HGTRRB02","ROBERTO  MARTINEZ  BARRERA ","11DPT0011X",null,null,null,null,null,null,null,"X",null,null,null,null,null,null,null,1,null,null,4640.3]
[null,"GUANAJUATO","GULG780404F75","GULG780404HGTRGR06","JORGE GUADALUPE GUERRERO LAGUNA","11DPT0002P",null,null,null,null,null,null,null,"X",null,null,null,null,null,null,null,1,null,null,4626.8600000000006]
[null,"GUANAJUATO","COCJ840424II1","COCJ840424HTLCNR00","JAIRO COCOLETZI CONDE","11DPT0008J",null,null,null,null,null,null,null,"X",null,null,null,null,null,null,null,1,null,null,4563.13]
[null,"GUANAJUATO","FEHE800724TQ5","FEHE800724HGTRRD06","EDUARDO FERNANDEZ HERNANDEZ","11DPT0001Q",null,null,null,null,null,null,null,"X",null,null,null,null,null,null,null,1,null,null,4562.5599999999995]
[null,"GUANAJUATO","ROGJ7510022G2","ROHJ751002HGTDNX00","JOEL  RODRIGUEZ  GONZALEZ","11DPT0012W",null,null,null,null,null,null,null,"X",null,null,null,null,null,null,null,1,null,null,4517.34]
[null,"GUANAJUATO","RAVM831112KP8","RAVM831112MGTMLN01","MONICA DE LA LUZ RAMIREZ VILLANUEVA","11DPT0007K",null,null,null,null,null,null,null,"X",null,null,null,null,null,null,null,1,null,null,4514.4800000000005]
[null,"GUANAJUATO","GUCM630109EJ1","GUCM630109MGTTSR00","MARIA MARTINA MARGARITA GUTIERREZ CASTRO","11DPT0001Q",null,null,null,null,null,null,null,"X",null,null,null,null,null,null,null,1,null,null,4514.4799999999996]
[null,"GUANAJUATO","ROVD750821HSA","ROVD750821MMNCLM06","DAMARY BERENICE ROCHA VILLAGOMEZ","11DPT0001Q",null,null,null,null,null,null,null,"X",null,null,null,null,null,null,null,1,null,null,4514.4799999999996]
[null,"GUANAJUATO","ROFA780327DH3","ROFA780327HGTDLL03","JOSE ALVARO RODRIGUEZ FLORES","11DPT0010Y",null,null,null,null,null,null,null,"X",null,null,null,null,null,null,null,1,null,null,4501.8600000000006]
[null,"GUANAJUATO","CASM6003305D3","CASM600330HGTMTL02","MELCHOR CAMPOS SOTO","11DPT0009I",null,null,null,null,null,null,null,"X",null,null,null,null,null,null,null,1,null,null,4446.96]
[null,"GUANAJUATO","GARG881113FV7","GARG881113HGTRDL05","GUILLERMO GARCIA RODRIGUEZ","11DPT0007K",null,null,null,null,null,null,null,"X",null,null,null,null,null,null,null,1,null,null,4446.96]
[null,"GUANAJUATO","SAVR640908IQA","SAVR640908HGTNGB09","ROBERTO SANTILLAN VEGA","11DPT0002P",null,null,null,null,null,null,null,"X",null,null,null,null,null,null,null,1,null,null,4345.8500000000004]
[null,"GUANAJUATO","BACL660127PY3","BACL660127HGTRNS02","JOSE LUIS BRAVO CANO","11DPT0005M",null,null,null,null,null,null,null,"X",null,null,null,null,null,null,null,1,null,null,4345.8500000000004]
[null,"GUANAJUATO","LEHB680515J91","LEHB680515MDFDRR01","BRENDA LEDESMA HERNANDEZ","11DPT0002P",null,null,null,null,null,null,null,"X",null,null,null,null,null,null,null,1,null,null,4345.8500000000004]
[null,"GUANAJUATO","PAGJ820614HB3","PAGJ820614MGTLRN07","JUANA ADRIANA PALOALTO GARCIA","11DPT0001Q",null,null,null,null,null,null,null,"X",null,null,null,null,null,null,null,1,null,null,4345.8500000000004]
[null,"GUANAJUATO","ROMR620310CS2","ROMR620310MDFMNC01","ROCÍO ROMERO MENA","11DPT0010Y",null,null,null,null,null,null,null,"X",null,null,null,null,null,null,null,1,null,null,4299.5]
[null,"GUANAJUATO","MATM690314EG4","MATM690314MGTRRT12","MATILDE MARTINEZ TORRES","11DPT0002P",null,null,null,null,null,null,null,"X",null,null,null,null,null,null,null,1,null,null,4263.68]
[null,"GUANAJUATO","CALA6404086Z8","CALA640408HGTDXL04","ALBERTO CAUDILLO LIÑÁN","11DPT0010Y",null,null,null,null,null,null,null,"X",null,null,null,null,null,null,null,1,null,null,4263.68]
[null,"GUANAJUATO","RASA6006139AA","RASA600613HGTMLN04","ANTONIO RAMÍREZ SOLÍS","11DPT0010Y",null,null,null,null,null,null,null,"X",null,null,null,null,null,null,null,1,null,null,4143.13]
[null,"GUANAJUATO","CAOL581027513","CAOL581027HGTMLS01","JOSE LUIS CAMPOS OLALDE","11DPT0001Q",null,null,null,null,null,null,null,"X",null,null,null,null,null,null,null,1,null,null,4143.13]
[null,"GUANAJUATO","MASE831216GZ4","MASE831216MGTNTL05","ELIA MANDUJANO SOTO","11DPT0006L",null,null,null,null,null,null,null,"X",null,null,null,null,null,null,null,1,null,null,4135.93]
[null,"GUANAJUATO","LELJ740926PK3","LELJ740926HJCNPN01","JUAN ANTONIO LEON LOPEZ","11DPT0007K",null,null,null,null,null,null,null,"X",null,null,null,null,null,null,null,1,null,null,4012.85]
[null,"GUANAJUATO","GAGA790221226","GAGA790221HGTSRR01","ARMANDO GASCA GUERRA","11DPT0010Y",null,null,null,null,null,null,null,"X",null,null,null,null,null,null,null,1,null,null,3961.1899999999996]
[null,"GUANAJUATO","RISM640319LE9","RISM640319HGTCRR02","JOSE MARTIN RICO SERRITEÑO","11DPT0002P",null,null,null,null,null,null,null,"X",null,null,null,null,null,null,null,1,null,null,3954.33]
[null,"GUANAJUATO","SAPJ7305052R5","SAPJ730505HGTNRN06","JUAN CARLOS SANCHEZ PEREZ","11DPT0013V",null,null,null,null,null,null,null,"X",null,null,null,null,null,null,null,1,null,null,3911.25]
[null,"GUANAJUATO","DABG810704HX9","DABG810704HGTMRR08","GERSON FALCAO DAMIAN BRAVO","11DPT0005M",null,null,null,null,null,null,null,"X",null,null,null,null,null,null,null,1,null,null,3911.25]
[null,"GUANAJUATO","PIVC670724KD8","PIVC670724MMNLCR01","CRISTINA PLIEGO VICTORIA","11DPT0006L",null,null,null,null,null,null,null,"X",null,null,null,null,null,null,null,1,null,null,3908.46]
[null,"GUANAJUATO","SOSP630208MC6","SOSP630208HGTTCD07","PEDRO SOTO SAUCEDO","11DPT0009I",null,null,null,null,null,null,null,"X",null,null,null,null,null,null,null,1,null,null,3903.58]
[null,"GUANAJUATO","AAGG8604281N4","AAGG860428MGTLRD04","MARIA GUADALUPE ALAMILLA GARCIA","11DPT0009I",null,null,null,null,null,null,null,"X",null,null,null,null,null,null,null,1,null,null,3866.93]
[null,"GUANAJUATO","RIHS8511232P3","RIHS851123MGTVRC00","MARIA SOCORRO RIVERA HERNANDEZ","11DPT0012W",null,null,null,null,null,null,null,"X",null,null,null,null,null,null,null,1,null,null,3866.93]
[null,"GUANAJUATO","GUSG880306VD5","GUSG880306HGTLNR09","GERARDO GUILLEN SANCHEZ","11DPT0006L",null,null,null,null,null,null,null,"X",null,null,null,null,null,null,null,1,null,null,3864.0299999999997]
[null,"GUANAJUATO","CACC741121MK3","CACC741121HGTSRR01","CARLOS ALBERTO CASTILLO CRUZ","11DPT0009I",null,null,null,null,null,null,null,"X",null,null,null,null,null,null,null,1,null,null,3829.44]
[null,"GUANAJUATO","OAVO8206077E6","OAVO820607HMNCZ08","OMAR ANTONIO  OCAMPO  VAZQUEZ","11DPT0012W",null,null,null,null,null,null,null,"X",null,null,null,null,null,null,null,1,null,null,3811.68]
[null,"GUANAJUATO","GACM6402137QA","GACM640213MGTRNR05","MARICELA GARCIA CHAVEZ","11DPT0007K",null,null,null,null,null,null,null,"X",null,null,null,null,null,null,null,1,null,null,3762.08]
[null,"GUANAJUATO","PESJ720529I40","PESJ720529HGTRNN06","JUAN JOSÉ PÉREZ SANTIAGO","11DPT0010Y",null,null,null,null,null,null,null,"X",null,null,null,null,null,null,null,1,null,null,3762.08]
[null,"GUANAJUATO","RENJ720507T83","RENJ720507HGTXVL04","JULIO REA NAVARRO","11DPT0002P",null,null,null,null,null,null,null,"X",null,null,null,null,null,null,null,1,null,null,3725]
[null,"GUANAJUATO","SOMJ5508087H2","SOMJ550808MGTTRN02","JUANA SOTO MORAN","11DPT0007K",null,null,null,null,null,null,null,"X",null,null,null,null,null,null,null,1,null,null,3725]
[null,"GUANAJUATO","BOSC820326R12","BOSC820326HGTLRR09","CARLOS MARTIN BOLAÑOS SERVIN","11DPT0001Q",null,null,null,null,null,null,null,"X",null,null,null,null,null,null,null,1,null,null,3725]
[null,"GUANAJUATO","CAAL690628AM6","CAAL690628MGTRLT08","MARIA LETICIA CARDENAS ALMANZA","11DPT0001Q",null,null,null,null,null,null,null,"X",null,null,null,null,null,null,null,1,null,null,3725]
[null,"GUANAJUATO","CARH670101MS3","CARH670101HGTRZC08","HECTOR  CARDENAS  RUIZ ","11DPT0011X",null,null,null,null,null,null,null,"X",null,null,null,null,null,null,null,1,null,null,3725]
[null,"GUANAJUATO","CIGM510313HX4","CIGM510313HVZSRG08","MIGUEL ANGEL CISNEROS GARCIA","11DPT0001Q",null,null,null,null,null,null,null,"X",null,null,null,null,null,null,null,1,null,null,3725]
[null,"GUANAJUATO","FABV830514ES9","FABV830514HGTRLC04","VICTOR ESTEBAN FRAUSTO BOLIO","11DPT0014U",null,null,null,null,null,null,null,"X",null,null,null,null,null,null,null,1,null,null,3725]
[null,"GUANAJUATO","GAAA750801K73","GAAA750801MGTYVN02","ANGELICA MARIA GAYTAN AVILA","11DPT0014U",null,null,null,null,null,null,null,"X",null,null,null,null,null,null,null,1,null,null,3725]
[null,"GUANAJUATO","GASR730617EQ9","GASR730619MGTRLS03","ROSA MARIA GARCIA  SILVA","11DPT0005M",null,null,null,null,null,null,null,"X",null,null,null,null,null,null,null,1,null,null,3725]
[null,"GUANAJUATO","MAZA690627N73","MAZA690627MGTTMN03","ANA ROSA MATA ZAMORA","11DPT0010Y",null,null,null,null,null,null,null,"X",null,null,null,null,null,null,null,1,null,null,3725]
[null,"GUANAJUATO","VAMG850109N64","VAMG850109MBSZNB01","GABRIELA VAZQUEZ MONJARAZ","11DPT0012W",null,null,null,null,null,null,null,"X",null,null,null,null,null,null,null,1,null,null,3725]
[null,"GUANAJUATO","VIBM750212ED8","VIBM750212MDFLRN06","MONICA VILCHIS BARCENAS","11DPT0013V",null,null,null,null,null,null,null,"X",null,null,null,null,null,null,null,1,null,null,3725]
[null,"GUANAJUATO","PEFD7301136V8","PEFD730113HGTRLV06","DAVID PEREZ FELIPE","11DPT0009I",null,null,null,null,null,null,null,"X",null,null,null,null,null,null,null,1,null,null,3553.23]
[null,"GUANAJUATO","BASC910503127","BASC910503MGTZNR03","MARIA CRUZ BAEZA SANCHEZ","11DPT0012W",null,null,null,null,null,null,null,"X",null,null,null,null,null,null,null,1,null,null,3553.23]
[null,"GUANAJUATO","CAER830626JA4","CAER830626MGTRSY00","REYNA LILIANA  CARDOSO  ESCUTIA ","11DPT0011X",null,null,null,null,null,null,null,"X",null,null,null,null,null,null,null,1,null,null,3538.75]
[null,"GUANAJUATO","VIMU840526EL5","VIMU840526HDFLRR00","URIEL ALEJANDRO VILLÁGOMEZ MARTÍNEZ","11DPT0010Y",null,null,null,null,null,null,null,"X",null,null,null,null,null,null,null,1,null,null,3538.75]
[null,"GUANAJUATO","HEAM501110PP1","HEAM501110MDFRRN05","MINERVA HERNANDEZ ARMENDARIZ","11DPT0001Q",null,null,null,null,null,null,null,"X",null,null,null,null,null,null,null,1,null,null,3480.23]
[null,"GUANAJUATO","ZAMJ740416EMO","ZAMJ740416HDFMXR00","JORGE  ZAMORA  NUÑEZ ","11DPT0011X",null,null,null,null,null,null,null,"X",null,null,null,null,null,null,null,1,null,null,3476.65]
[null,"GUANAJUATO","GUHG690324J87","GUHG690324HGTTRB00","GABRIEL GUTIERREZ HERNANDEZ","11DPT0007K",null,null,null,null,null,null,null,"X",null,null,null,null,null,null,null,1,null,null,3439.6]
[null,"GUANAJUATO","RIRS720206SN4","RIRS720206MGTVML08","SOLEDAD SUSANA RIVERA RAMÍREZ","11DPT0010Y",null,null,null,null,null,null,null,"X",null,null,null,null,null,null,null,1,null,null,3439.6]
[null,"GUANAJUATO","ROHO780227K98","ROXH780227MGTCXN02","HONORINA PAOLA * ROCHA","11DPT0007K",null,null,null,null,null,null,null,"X",null,null,null,null,null,null,null,1,null,null,3439.6]
[null,"GUANAJUATO","RIRG760502K16","RIRG760502MGTVDW04","GWENDOLYNE ERENDIRA RIVAS RODRIGUEZ","11DPT0009I",null,null,null,null,null,null,null,"X",null,null,null,null,null,null,null,1,null,null,3398.55]
[null,"GUANAJUATO","EIDR500307HY1","EIDR500307HGTNLN02","JOSE RENE ENRIQUEZ DELGADO","11DPT0005M",null,null,null,null,null,null,null,"X",null,null,null,null,null,null,null,1,null,null,3352.5]
[null,"GUANAJUATO","EIEA830501N66","EIEA830501MGTSSN05","ANDREA ESPITIA ESPITIA","11DPT0008J",null,null,null,null,null,null,null,"X",null,null,null,null,null,null,null,1,null,null,3352.5]
[null,"GUANAJUATO","SOAE851129KH7","SOAE851129MGTTCS09","ESPERANZA SOTO ACEVEDO","11DPT0006L",null,null,null,null,null,null,null,"X",null,null,null,null,null,null,null,1,null,null,3328.22]
[null,"GUANAJUATO","JULA7109296W5","JULA710929HGTRNL01","ALEJANDRO JUAREZ LEON","11DPT0008J",null,null,null,null,null,null,null,"X",null,null,null,null,null,null,null,1,null,null,3314.5]
[null,"GUANAJUATO","MATG681016SW7","MATG681016HGTGFR08","GERARDO MAGAÑA TAFOYA","11DPT0009I",null,null,null,null,null,null,null,"X",null,null,null,null,null,null,null,1,null,null,3314.5]
[null,"GUANAJUATO","PIZM740723DV9","PIZM740723MGTZMR06","MIRYAM PIZANO ZAMORA","11DPT0001Q",null,null,null,null,null,null,null,"X",null,null,null,null,null,null,null,1,null,null,3314.5]
[null,"GUANAJUATO","GAFF820410AV4","GAFF820410HGTRRR01","FERNANDO GARCIA FRIAS","11DPT0001Q",null,null,null,null,null,null,null,"X",null,null,null,null,null,null,null,1,null,null,3314.5]
[null,"GUANAJUATO","GODA691116ALA","GODA691116HDFMZL07","ALEJANDRO GOMEZ DIAZ","11DPT0001Q",null,null,null,null,null,null,null,"X",null,null,null,null,null,null,null,1,null,null,3314.5]
[null,"GUANAJUATO","LOSC860106KF2","LOSC860106HGTPRH07","CHRISTIAN EMMANUEL LOPEZ SUAREZ","11DPT0013V",null,null,null,null,null,null,null,"X",null,null,null,null,null,null,null,1,null,null,3314.5]
[null,"GUANAJUATO","TOVJ770823IY6","TOVJ770823HGTRRM05","JUAN MANUEL TORRES  VERA","11DPT0005M",null,null,null,null,null,null,null,"X",null,null,null,null,null,null,null,1,null,null,3314.5]
[null,"GUANAJUATO","VAPG660502A11","VAPG660502HMCZRR05","GERMAN VAZQUEZ PERALTA","11DPT0012W",null,null,null,null,null,null,null,"X",null,null,null,null,null,null,null,1,null,null,3314.5]
[null,"GUANAJUATO","DICI670401TA1","DICI670401MGTZMR00","IRENE DIAZ CAMPOS","11DPT0002P",null,null,null,null,null,null,null,"X",null,null,null,null,null,null,null,1,null,null,3224.63]
[null,"GUANAJUATO","GAMC720506I97","GAMC720506MGTRRN08","CONSTANZA GARCIA  MARTINEZ","11DPT0001Q",null,null,null,null,null,null,null,"X",null,null,null,null,null,null,null,1,null,null,3224.63]
[null,"GUANAJUATO","MORR630513CT2","MORR630513HGTSVD06","RODOLFO MOSQUEDA RUVALCABA","11DPT0010Y",null,null,null,null,null,null,null,"X",null,null,null,null,null,null,null,1,null,null,3224.63]
[null,"GUANAJUATO","GUCA621009A88","GUCA621009MGTTHR00","ARACELI GUTIERREZ CHACON","11DPT0001Q",null,null,null,null,null,null,null,"X",null,null,null,null,null,null,null,1,null,null,3166.25]
[null,"GUANAJUATO","HEMY820605MZ2","HEMY820605MGTRNL07","YOLANDA  HERNANDEZ  MONTOYA ","11DPT0011X",null,null,null,null,null,null,null,"X",null,null,null,null,null,null,null,1,null,null,3148.78]
[null,"GUANAJUATO","GOGJ8611097Z8","GOGJ861109HGTNMR07","JORGE ARTURO GONGORA GAMIÑO","11DPT0010Y",null,null,null,null,null,null,null,"X",null,null,null,null,null,null,null,1,null,null,3121.68]
[null,"GUANAJUATO","ROHA790902MQ8","ROHA790902HGTDRL09","ALEJANDRO RODRIGUEZ HERNANDEZ","11DPT0010Y",null,null,null,null,null,null,null,"X",null,null,null,null,null,null,null,1,null,null,2953.27]
[null,"GUANAJUATO","SACG751101985","SACG751101HDFNRR03","GERARDO JAVIER SANCHEZ CARRANZA","11DPT0014U",null,null,null,null,null,null,null,"X",null,null,null,null,null,null,null,1,null,null,2923.8]
[null,"GUANAJUATO","HERA4412086H0","HERA441208HGTRSL07","ALFREDO HERRERA ROSALES","11DPT0002P",null,null,null,null,null,null,null,"X",null,null,null,null,null,null,null,1,null,null,2915.37]
[null,"GUANAJUATO","GOAA670428AHA","GOAA670428MGTNLR05","ARACELI GONZÁLEZ ÁLVAREZ","11DPT0010Y",null,null,null,null,null,null,null,"X",null,null,null,null,null,null,null,1,null,null,2900.21]
[null,"GUANAJUATO","VAGN761014IF8","VAGN761014MGTLVD09","NADIA VALLEJO GUEVARA","11DPT0002P",null,null,null,null,null,null,null,"X",null,null,null,null,null,null,null,1,null,null,2817.33]
[null,"GUANAJUATO","GOPE721215MA1","GOPE721215HGTNSD00","EDISON OSWALDO GONZALEZ PESCADOR","11DPT0001Q",null,null,null,null,null,null,null,"X",null,null,null,null,null,null,null,1,null,null,2793.75]
[null,"GUANAJUATO","AAPM8304305FA","AAPM830430MGTLRY09","MAYRA DE GUADALUPE CELENE ALVAREZ PÉREZ","11DPT0010Y",null,null,null,null,null,null,null,"X",null,null,null,null,null,null,null,1,null,null,2793.75]
[null,"GUANAJUATO","RISA740722842","RISA740722MGTCNL08","ALEJANDRA  RICALDE  SANCHEZ ","11DPT0011X",null,null,null,null,null,null,null,"X",null,null,null,null,null,null,null,1,null,null,2699.08]
[null,"GUANAJUATO","LOMA9110192M9","LOMA911019MGTPNR09","AURORA LOPEZ MENDOZA","11DPT0010Y",null,null,null,null,null,null,null,"X",null,null,null,null,null,null,null,1,null,null,2595.6]
[null,"GUANAJUATO","LUCF7002115Q9","LUCF700211HGTLND05","FIDEL  LULE  CONTRERAS ","11DPT0011X",null,null,null,null,null,null,null,"X",null,null,null,null,null,null,null,1,null,null,2579.6999999999998]
[null,"GUANAJUATO","ZABA871015J40","ZABA871015HGTRCM04","AMANDO ZARAZUA BECERRA","11DPT0012W",null,null,null,null,null,null,null,"X",null,null,null,null,null,null,null,1,null,null,2520.7600000000002]
[null,"GUANAJUATO","MUDR701023BQ5","MUDR701023HGTXRN03","JOSE RENE MUÑOZ DURAN","11DPT0010Y",null,null,null,null,null,null,null,"X",null,null,null,null,null,null,null,1,null,null,2485.88]
[null,"GUANAJUATO","ROCC7912019U3","ROCC791201HGTDHS03","CESAR ADRIAN RODRIGUEZ CHAVEZ","11DPT0009I",null,null,null,null,null,null,null,"X",null,null,null,null,null,null,null,1,null,null,2485.88]
[null,"GUANAJUATO","SATE820405F51","SATE820405MGTNRV00","EVA MARIA DEL ROSARIO SANCHEZ TURRUBIARTES","11DPT0012W",null,null,null,null,null,null,null,"X",null,null,null,null,null,null,null,1,null,null,2485.88]
[null,"GUANAJUATO","CUTP650130E94","CUTP650130HGTRRB03","PABLO CRUZ TORRES","11DPT0002P",null,null,null,null,null,null,null,"X",null,null,null,null,null,null,null,1,null,null,2485.88]
[null,"GUANAJUATO","DOIB750304RM3","DOIB750304HGTRNN07","BENJAMIN DORANTES INFANTE","11DPT0013V",null,null,null,null,null,null,null,"X",null,null,null,null,null,null,null,1,null,null,2485.88]
[null,"GUANAJUATO","RIRJ8606049A1","RIRJ860604HGTSJN07","JUAN MANUEL RIOS ROJAS","11DPT0008J",null,null,null,null,null,null,null,"X",null,null,null,null,null,null,null,1,null,null,2485.88]
[null,"GUANAJUATO","TEAA800207442","TEAA800207MGTRGL00","ALEJANDRA ISABEL TREJO AGUILAR","11DPT0010Y",null,null,null,null,null,null,null,"X",null,null,null,null,null,null,null,1,null,null,2485.88]
[null,"GUANAJUATO","RARG930413MZ7","RARG930413HGTMCS09","GUSTAVO PAUL RAMÍREZ ROCHA","11DPT0013V",null,null,null,null,null,null,null,"X",null,null,null,null,null,null,null,1,null,null,2446.73]
[null,"GUANAJUATO","AETA681104M99","AETA681104MGTRPL00","ALEJANDRA ARREGUIN TAPIA","11DPT0008J",null,null,null,null,null,null,null,"X",null,null,null,null,null,null,null,1,null,null,2442.0500000000002]
[null,"GUANAJUATO","AALJ72112271A","AALJ721122MGTLZN08","JUANA CECILIA ALVAREZ LOZANO","11DPT0010Y",null,null,null,null,null,null,null,"X",null,null,null,null,null,null,null,1,null,null,2397.85]
[null,"GUANAJUATO","CAMJ890730SG6","CAMJ890730MDFSDZ09","JAZMIN CASASOLA MEDINA","11DPT0012W",null,null,null,null,null,null,null,"X",null,null,null,null,null,null,null,1,null,null,2397.85]
[null,"GUANAJUATO","CAGG841115NK6","CAGG841115MGTLNL08","GIULIANA CALDERON GONZALEZ","11DPT0006L",null,null,null,null,null,null,null,"X",null,null,null,null,null,null,null,1,null,null,2336.86]
[null,"GUANAJUATO","LOZE710604574","LOZE710604MGTZRG00","MA. EUGENIA LOZADA ZARAZUA ","11DPT0012W",null,null,null,null,null,null,null,"X",null,null,null,null,null,null,null,1,null,null,2283.61]
[null,"GUANAJUATO","MORJ631227S89","MORJ631227HGTTMN01","JUAN  MOTA RAMIREZ","11DPT0013V",null,null,null,null,null,null,null,"X",null,null,null,null,null,null,null,1,null,null,2278.09]
[null,"GUANAJUATO","EIHA7010296Z8","EIHA701029HGTSRL01","ALEJANDRO ESPINOSA HERNANDEZ","11DPT0012W",null,null,null,null,null,null,null,"X",null,null,null,null,null,null,null,1,null,null,2270.67]
[null,"GUANAJUATO","SEHJ520104JY1","SEHR520104HGTRRG15","RIGOBERTO SERVIN HERNANDEZ","11DPT0014U",null,null,null,null,null,null,null,"X",null,null,null,null,null,null,null,1,null,null,2270.67]
[null,"GUANAJUATO","CAHE761123B77","CAHE761123MGTRRL03","ELIZABETH  CARRILLO  HERNANDEZ ","11DPT0011X",null,null,null,null,null,null,null,"X",null,null,null,null,null,null,null,1,null,null,2265.2799999999997]
[null,"GUANAJUATO","BEMG751210DE6","BEMG751210MDFLRD00","GUADALUPE KARINA BELTRAN MARTINEZ","11DPT0006L",null,null,null,null,null,null,null,"X",null,null,null,null,null,null,null,1,null,null,2224.02]
[null,"GUANAJUATO","SAGE751202C27","SAGE751202HGTLLD01","EDGAR RICARDO SALINAS GUALITO","11DPT0012W",null,null,null,null,null,null,null,"X",null,null,null,null,null,null,null,1,null,null,2219.9700000000003]
[null,"GUANAJUATO","TOMS6212167K7","TOMS621216MGTRRS03","SUSANA  TORRES  MARTINEZ ","11DPT0011X",null,null,null,null,null,null,null,"X",null,null,null,null,null,null,null,1,null,null,2219.9700000000003]
[null,"GUANAJUATO","AUMA910826000","AUMA910826MGTGXL03","ALEJANDRA AGUILLON MUÑOZ","11DPT0012W",null,null,null,null,null,null,null,"X",null,null,null,null,null,null,null,1,null,null,2219.9700000000003]
[null,"GUANAJUATO","COGB581101LL6","COGB581101HGTRMN07","BENJAMIN CORONA GOMEZ","11DPT0009I",null,null,null,null,null,null,null,"X",null,null,null,null,null,null,null,1,null,null,2219.9700000000003]
[null,"GUANAJUATO","YAHL870917Q59","YAHL870917MDFXRR05","LAURA PATRICIA YAÑEZ HURTADO","11DPT0012W",null,null,null,null,null,null,null,"X",null,null,null,null,null,null,null,1,null,null,2219.9700000000003]
[null,"GUANAJUATO","MOHS911002127","MOHS911002HMCNRR00","SERGIO MONTES DE OCA","11DPT0012W",null,null,null,null,null,null,null,"X",null,null,null,null,null,null,null,1,null,null,2143.46]
[null,"GUANAJUATO","MOHS911002127","MOHS911002HMCNRR00","SERGIO MONTES DE OCA HURTADO","11DPT0012W",null,null,null,null,null,null,null,"X",null,null,null,null,null,null,null,1,null,null,2143.46]
[null,"GUANAJUATO","GOHM731017127","GOHM731017HGTMRG05","MIGUEL ANGEL GOMEZ HERNANDEZ","11DPT0008J",null,null,null,null,null,null,null,"X",null,null,null,null,null,null,null,1,null,null,1990.31]
[null,"GUANAJUATO","MEGM731204L93","MEGM731204MGTNZR02","MARISA MENDEZ GUZMAN","11DPT0009I",null,null,null,null,null,null,null,"X",null,null,null,null,null,null,null,1,null,null,1954.23]
[null,"GUANAJUATO","EANE770730ID6","EANE770730HMNSXD06","EDGAR CUAUHTEMOC ESTRADA NUÑEZ","11DPT0005M",null,null,null,null,null,null,null,"X",null,null,null,null,null,null,null,1,null,null,1664.11]
[null,"GUANAJUATO","GAGF8712258Z8","GAGF871225MGTRRR05","MARIA FERNANDA GARCIA GUERRERO","11DPT0008J",null,null,null,null,null,null,null,"X",null,null,null,null,null,null,null,1,null,null,1664.11]
[null,"GUANAJUATO","GURM680618F17","GURM680618MMNZSR03","MARTHA ELENA GUZMAN ROSALES","11DPT0004N",null,null,null,null,null,null,null,"X",null,null,null,null,null,null,null,1,null,null,1664.11]
[null,"GUANAJUATO","HEEF6801012R8","HEEF680101HHGRSL09","FELIPE HERNANDEZ ESTRADA","11DPT0008J",null,null,null,null,null,null,null,"X",null,null,null,null,null,null,null,1,null,null,1664.11]
[null,"GUANAJUATO","ROFA621121CRM","ROFA621121HMCDLR04","ARTURO RODRIGUEZ FLORES","11DPT0008J",null,null,null,null,null,null,null,"X",null,null,null,null,null,null,null,1,null,null,1664.11]
[null,"GUANAJUATO","ROGD8306177Y6","ROGD830617HGTDLG05","JOSE DIEGO RODRIGUEZ GALLEGOS","11DPT0008J",null,null,null,null,null,null,null,"X",null,null,null,null,null,null,null,1,null,null,1664.11]
[null,"GUANAJUATO","ROMC720828P54","ROMC720828HCLDTR00","CARLOS ENRIQUE RODRIGUEZ MATA","11DPT0008J",null,null,null,null,null,null,null,"X",null,null,null,null,null,null,null,1,null,null,1664.11]
[null,"GUANAJUATO","SOFM861120UC9","SOFM861120HGTLGR09","MARCOS ALBERTO SOLANO FIGUEROA","11DPT0008J",null,null,null,null,null,null,null,"X",null,null,null,null,null,null,null,1,null,null,1664.11]
[null,"GUANAJUATO","VAAE821122TKA","VAAE821122HDGLRR01","ERIK VALDEZ ARREGUIN","11DPT0008J",null,null,null,null,null,null,null,"X",null,null,null,null,null,null,null,1,null,null,1664.11]
[null,"GUANAJUATO","VAMA8207297V5","VAMA820729HGTZRR02","ARMANDO URIEL VAZQUEZ MARTINEZ","11DPT0008J",null,null,null,null,null,null,null,"X",null,null,null,null,null,null,null,1,null,null,1664.11]
[null,"GUANAJUATO","VECY870118BP9","VECY870118MGTRRS06","YESENIA IVON VERA CARACHEO","11DPT0008J",null,null,null,null,null,null,null,"X",null,null,null,null,null,null,null,1,null,null,1664.11]
[null,"GUANAJUATO","RAMG8412191Z8","RAMG841219HGTNNL07","GUILLERMO RANGEL MANCERA","11DPT0001Q",null,null,null,null,null,null,null,"X",null,null,null,null,null,null,null,1,null,null,1664.11]
[null,"GUANAJUATO","ROOF850730521","ROOF850730HGTMLR06","FRANCISCO ROMERO OLMOS","11DPT0007K",null,null,null,null,null,null,null,"X",null,null,null,null,null,null,null,1,null,null,1664.11]
[null,"GUANAJUATO","SERM760806ERA","SERM760806MGTRCH07","MAHELY ALEJANDRA SERRANO RICO","11DPT0006L",null,null,null,null,null,null,null,"X",null,null,null,null,null,null,null,1,null,null,1664.11]
[null,"GUANAJUATO","AAGL5509065W0","AAGL550906HGTRZS02","JOSE LUIS ARAIZA GUZMAN","11DPT0007K",null,null,null,null,null,null,null,"X",null,null,null,null,null,null,null,1,null,null,1664.11]
[null,"GUANAJUATO","AALJ750316LPA","AALJ750316HGTYLS05","JOSE  AYALA  LULE ","11DPT0011X",null,null,null,null,null,null,null,"X",null,null,null,null,null,null,null,1,null,null,1664.11]
[null,"GUANAJUATO","BACG700412ET2","BACG700412MGTRSD07","MA GUADALUPE BRAVO CASTRO","11DPT0006L",null,null,null,null,null,null,null,"X",null,null,null,null,null,null,null,1,null,null,1664.11]
[null,"GUANAJUATO","BARO871201333","BARO871201HGTRDM07","OMAR ALBERTO BARAJAS RODRIGUEZ","11DPT0007K",null,null,null,null,null,null,null,"X",null,null,null,null,null,null,null,1,null,null,1664.11]
[null,"GUANAJUATO","BEGR700112IU3","BEGR700112MGTRRB08","MA REBECA BERNAL GORDILLO","11DPT0006L",null,null,null,null,null,null,null,"X",null,null,null,null,null,null,null,1,null,null,1664.11]
[null,"GUANAJUATO","GALL871108","GALL871108MGTRPL08","LILIANA GARCIA LOPEZ","11DPT0011X",null,null,null,null,null,null,null,"X",null,null,null,null,null,null,null,1,null,null,1664.11]
[null,"GUANAJUATO","GOVE850725","GOVE850725HTSMLD03","EDUARDO GOMEZ VILLAGOMEZ","11DPT0011X",null,null,null,null,null,null,null,"X",null,null,null,null,null,null,null,1,null,null,1664.11]
[null,"GUANAJUATO","MACV8204295T9","MACV820429MGTNSR06","VIRGINIA MANDUJANO CASTRO","11DPT0006L",null,null,null,null,null,null,null,"X",null,null,null,null,null,null,null,1,null,null,1664.11]
[null,"GUANAJUATO","MAGO860529ID3","MAGO860529HGTRZS08","OSCAR NAZARET MARTINEZ GUZMAN","11DPT0006L",null,null,null,null,null,null,null,"X",null,null,null,null,null,null,null,1,null,null,1664.11]
[null,"GUANAJUATO","ROGE870702MF0","ROGE870702MDFSRL00","ELSA GABRIELA DE LA ROSA GARCIA","11DPT0006L",null,null,null,null,null,null,null,"X",null,null,null,null,null,null,null,1,null,null,1664.11]
[null,"GUANAJUATO","SAAM830517LU0","SAAM830517HDFNRG07","MIGUEL ANGEL SANCHEZ ARANDA","11DPT0007K",null,null,null,null,null,null,null,"X",null,null,null,null,null,null,null,1,null,null,1664.11]
[null,"GUANAJUATO","PATF850801UJA","PATF850801HGTLPR02","FRANCISCO EVERARDO  PLAZA  TAPIA ","11DPT0011X",null,null,null,null,null,null,null,"X",null,null,null,null,null,null,null,1,null,null,1661.11]
[null,"GUANAJUATO","CAFJ650317IR5","CAFJ650317HGTRLR04","JORGE CARRANCO FLORES","11DPT0008J",null,null,null,null,null,null,null,"X",null,null,null,null,null,null,null,1,null,null,1501.4900000000002]
[null,"GUANAJUATO","EISJ7601299X1","EISJ760129HGTSPS19","J JESUS ESPINOZA SEPULVEDA","11DPT0010Y",null,null,null,null,null,null,null,"X",null,null,null,null,null,null,null,1,null,null,1215.17]
[null,"GUANAJUATO","HEDT700419HG2","HEDT700419HGTRRR01","JOSÉ TERESO HERNÁNDEZ DURÁN","11DPT0010Y",null,null,null,null,null,null,null,"X",null,null,null,null,null,null,null,1,null,null,1088.99]
[null,"Total Personas : ",903,null,null,null,null,null,null,null,null,null,null,null,null,null,null,null,null,null,null,"Total Recursos Ejercidos:",null,null,{"$f":"SUBTOTAL(109,Tabla11[Total de recursos presupuestales ejercidos en servicios personales en el periodo\n(2)])","v":30807566.879999965}]
[]
[null,"Fuente : Información proporcionada por las Entidades Federativas."]

{"sheet":"II C y 1_","index":5,"n_rows":924,"n_cols":22,"rows_kept":924,"cut":false,"hidden":false,"merged":[[11,21,12,21],[11,8,12,8],[11,9,11,15],[11,16,12,16],[11,17,12,17],[8,1,8,8],[11,1,12,1],[11,2,12,2],[11,5,12,5],[11,20,12,20],[918,18,918,19],[11,6,12,6],[11,7,12,7],[11,18,11,19],[11,3,12,3],[11,4,12,4]]}
[]
[]
[]
[]
[]
[]
[]
[null,"Formato: Personal Federalizado por Registro Federal de Contribuyentes"]
[null,{"$f":"IF('Caratula Resumen'!D22=\"Elige el Periodo…\",\"\",'Caratula Resumen'!D22)","v":"Fondo de Aportaciones para la Educación Tecnológica y de Adultos/Colegio Nacional de Educación Profesional Técnica (FAETA/CONALEP)"},null,null,null,null,null,null,null,null,null,null,null,null,null,null,null,null,null,null,{"$f":"IF('Caratula Resumen'!D23=\"Elige el Periodo…\",\"\",'Caratula Resumen'!D23)","v":"1er. Trimestre"}]
[]
[]
[null,"Entidad Federativa","Clave CT","Turno","RFC","CURP","Nombre","Funcion Real","Horas que labora en el Centro de Trabajo","Clave Presupuestal",null,null,null,null,null,null,"Tipo de Categoría","Identificador de Contrato de Honorarios","Periodo de efecto de pago en el trimestre",null,"Percepciones pagadas en el Periodo de Comisión con Presupuesto Federal*","Percepciones pagadas en el Periodo de Comisión con Presupuesto de otra fuente*"]
[null,null,null,null,null,null,null,null,null,"Partida Presupuestal","Código de Pago","Clave de Unidad","Clave de Sub Unidad","Clave de Categoría","Horas Semana Mes ","Número de Plaza",null,null,"Inicial","Termino"]
[]
[null,"Entidad Federativa","Clave CT","Turno","RFC","CURP","Nombre","Funcion Real","Horas que labora en el Centro de Trabajo","Partida Presupuestal","Código de Pago","Clave de Unidad","Clave de Sub Unidad","Clave de Categoría","Horas semana mes","Número de plaza","Tipo de Categoría","Identificador de Contrato de Honorarios","Periodo de efecto de pago en el trimestre\nInicial","Periodo de efecto de pago en el trimestre\nTermino","Percepciones pagadas en el Periodo de Comisión con Presupuesto Federal*","Percepciones pagadas en el Periodo de Comisión con Presupuesto de otra fuente*"]
[null,"GUANAJUATO","11DPT0001Q",120,"BEEJ790327230","BEEJ790327HGTLSN06  ","JUAN GUSTAVO BELMAN ESPINOSA            ",2,0,1130,1003,"00",28,"S01202",0,2512,2,null,20150101,20150331,31067.719999999998,0]
[null,"GUANAJUATO","11DPT0004N",120,"DIJL7203079A3","DIJL720307MGTGCR01  ","MA. DE LOURDES DIEGO JACOBO             ",2,0,1130,1003,"01",28,"CF19201",0,6523,2,null,20150101,20150331,42757.960000000006,0]
[null,"GUANAJUATO","11DPT0005M",120,"FIRG871015PB5","FIRG871015MGTGMB07  ","GABRIELA FIGUEROA RAMIREZ               ",2,0,1130,1003,"00",72,"S01201",0,4419,2,null,20150101,20150331,27729.93,0]
[null,"GUANAJUATO","11DPT0004N",120,"GOGE730923ME8","GOGE730923MMNNNL00  ","ELIZABETH GONZALEZ GONZALEZ             ",2,0,1130,1003,"01",28,"A03202",0,6497,2,null,20150101,20150331,41260.39,0]
[null,"GUANAJUATO","11DPT0008J",120,"LAVA8108019Q9","LAVA810801MGTGRN09  ","MARIA DE LOS ANG LAGUNA VARGAS          ",2,0,1130,1003,"02",33,"CF33206",0,14313,2,null,20150101,20150331,100092.70999999999,0]
[null,"GUANAJUATO","11DPT0001Q",120,"LIRA890608KM8","LIRA890608MGTZZL06  ","ALMA ROSARIO LIZARRAGA RUIZ             ",2,0,1130,1003,"00",28,"S01201",0,2556,2,null,20150101,20150331,30585.730000000003,0]
[null,"GUANAJUATO","11DPT0008J",120,"MELJ7904219Z8","MELJ790421HGTLDN03  ","JUAN MAURICIO MELGOZA LEDESMA           ",2,0,1130,1003,"02",33,"CF19201",0,10190,2,null,20150101,20150331,32643.68,0]
[null,"GUANAJUATO","11DPT0008J",120,"NUCS580811UI9","NUCS580811MGTXRS04  ","SUSANA NUÑEZ CERRITOS                   ",2,0,1130,1003,"02",33,"A03202",0,5548,2,null,20150101,20150331,41595.17,0]
[null,"GUANAJUATO","11DPT0008J",120,"PACM941015U40","PACM941015MGTLRR06  ","MARIANA PALOMINO CARREñO                ",2,0,1130,1003,"02",33,"S01201",0,10189,2,null,20150101,20150331,26639.97,0]
[null,"GUANAJUATO","11DPT0001Q",120,"PIOP550618BT2","PIOP550618HGTCLB08  ","PABLO PICHARDO OLVERA                   ",2,0,1130,1003,"00",28,"A03202",0,2494,2,null,20150101,20150331,44229.41,0]
[null,"GUANAJUATO","11DPT0008J",120,"ROCS8704055G4","ROCS870405MMCDSL06  ","MARIA DEL SOL RODRIGUEZ CASTRO          ",2,0,1130,1003,"02",33,"CF33204",0,10188,2,null,20150101,20150331,38948.74,0]
[null,"GUANAJUATO","11DPT0008J",120,"ROVA500401GUA","ROVA500401HGTJLR05  ","ARTURO ROJAS VALENCIA                   ",2,0,1130,1003,"02",33,"S01202",0,8084,2,null,20150101,20150331,37296.209999999992,0]
[null,"GUANAJUATO","11DPT0008J",120,"ROZA560516SE3","ROZA560516HGTJPB08  ","ABEL ROJAS ZAPATERO                     ",2,0,1130,1003,"02",33,"CF33203",0,10178,2,null,20150101,20150331,49616.979999999996,0]
[null,"GUANAJUATO","11DPT0004N",120,"SAGN550328CW5","SAGN550328HGTNMC00  ","NICOLAS SANTOYO GOMEZ                   ",2,0,1130,1003,"01",28,"S01202",0,6509,2,null,20150101,20150331,41202.019999999997,0]
[null,"GUANAJUATO","11DPT0011X",120,"AABC680116196","AABC680116MMCBNL09  ","CLAUDIA CECILIA D ABDALA BUENDIA        ",2,0,1130,1003,"02",49,"S01202",0,7692,2,null,20150101,20150331,35566.9,0]
[null,"GUANAJUATO","11DPT0009I",120,"AABC720527RL6","AABC720527HGTLRR03  ","CARLOS ALVARADO BARRIOS                 ",2,0,1130,1003,"01",74,"S01201",0,8081,2,null,20150101,20150331,37682.68,0]
[null,"GUANAJUATO","11DPT0004N",120,"AACG691218L13","AACG691218MMNLSR08  ","GRACIELA ALVAREZ CASTRO                 ",2,0,1130,1003,"01",28,"A03202",0,6496,2,null,20150101,20150331,45168.479999999996,0]
[null,"GUANAJUATO","11DPT0002P",120,"AAGA521215AI7","AAGA521215HDFLRR19  ","ARTURO GERARDO ALVAREZ GARCIA           ",2,0,1130,1003,"00",29,"S01201",0,2567,2,null,20150101,20150331,36338.36,0]
[null,"GUANAJUATO","11DPT0014U",120,"AALA880119VB9","AALA880119MGTLPL06  ","ALESSA ALVARADO LOPEZ                   ",2,0,1130,1003,"03","03","A01801",0,18884,2,null,20150101,20150331,46773.85,0]
[null,"GUANAJUATO","11DPT0008J",120,"AALR590709UH6","AALR590709MGTNPC06  ","MARIA ROCIO ANAYA LOPEZ                 ",2,0,1130,1003,"02",33,"CF33206",0,14312,2,null,20150101,20150331,130319.81999999998,0]
[null,"GUANAJUATO","11DPT0006L",120,"AALS670904235","AALS670904MGTNPL09  ","SILVIA ANAYA LOPEZ                      ",2,0,1130,1003,"01",63,"CF33204",0,7715,2,null,20150101,20150331,79790.760000000009,0]
[null,"GUANAJUATO","11APT0001T",100,"AAMD810413AX8","AAMD810413MGTNRN03  ","DIANA LORENA ANAYA MARTINEZ             ",2,0,1130,1003,"07","05","CF04201",0,11092,2,null,20150101,20150331,39003.949999999997,0]
[null,"GUANAJUATO","11DPT0011X",120,"AAMR650620AB4","AAMR650620HGTLGB03  ","ROBERTO ALVARADO MAGAÑA                 ",2,0,1130,1003,"02",49,"CF19201",0,10606,2,null,20150101,20150331,44915.75,0]
[null,"GUANAJUATO","11DPT0011X",120,"AAMR671130JR0","AAMR671130HGTLGB00  ","RUBEN ALVARADO MAGANA                   ",2,0,1130,1003,"02",49,"S01201",0,10613,2,null,20150101,20150331,32800.200000000004,0]
[null,"GUANAJUATO","11DPT0006L",120,"AARL760126331","AARL760126HGTLMN06  ","LEONARDO ISRAEL ALVAREZ ROMO            ",2,0,1130,1003,"01",63,"CF04201",0,7691,2,null,20150101,20150331,41470.46,0]
[null,"GUANAJUATO","11DPT0002P",120,"AARM7802157H4","AARM780215MGTLDY03  ","MYRIAM DEL ROSAR ALVARADO RODRIGUEZ     ",2,0,1130,1003,"00",29,"CF18201",0,2573,2,null,20150101,20150331,28798.46,0]
[null,"GUANAJUATO","11DPT0001Q",120,"AATE760606N24","AATE760606MGTLNV03  ","EVA ALMANZA TINOCO                      ",2,0,1130,1003,"00",28,"S01202",0,9252,2,null,20150101,20150331,34528.67,0]
[null,"GUANAJUATO","11DPT0008J",120,"AEAC630530Q21","AEAC630530MGTLLN08  ","MA. CONCEPCION ALEJOS ALONSO            ",2,0,1130,1003,"02",33,"CF33204",0,10196,2,null,20150101,20150331,76988.259999999995,0]
[null,"GUANAJUATO","11DPT0011X",120,"AECJ7908035L8","AECJ790803HGTLRS03  ","JOSE JESUS ALEJO CARRENO                ",2,0,1130,1003,"02",49,"S01201",0,10594,2,null,20150101,20150331,34396.22,0]
[null,"GUANAJUATO","11APT0001T",100,"AECL710621SE4","AECL710621HGTRRS02  ","JOSE LUIS ARELLANO CRUZ                 ",2,0,1130,1003,"05",13,"A03202",0,10301,2,null,20150101,20150331,35725.96,0]
[null,"GUANAJUATO","11DPT0011X",120,"AECM720103NB9","AECM720103MGTLRR09  ","MARCELA ALEJO CARREÑO                   ",2,0,1130,1003,"02",49,"CF33206",0,14056,2,null,20150101,20150331,119697.22,0]
[null,"GUANAJUATO","11DPT0003O",120,"AEGJ5311191A4","AEGJ531119HGTSRR09  ","JORGE ASCENCIO GARCIA                   ",2,0,1130,1003,"00",30,"S01202",0,2650,2,null,20150101,20150331,40214.769999999997,0]
[null,"GUANAJUATO","11DPT0006L",120,"AERG571209NWA","AERG591209HGTRML03  ","GILBERTO ARREOLA ROMERO                 ",2,0,1130,1003,"01",63,"S01201",0,7712,2,null,20150101,20150331,34532.310000000005,0]
[null,"GUANAJUATO","11DPT0003O",120,"AETA880105TQ0","AETA880105HGTCNN01  ","ANTONIO ACEVEDO TINAJERO                ",2,0,1130,1003,"00",30,"CF33206",0,13322,2,null,20150101,20150331,93641.98000000001,0]
[null,"GUANAJUATO","11APT0001T",100,"AIGG6105048S8","AIGG610504HGTRZL05  ","GUILLERMO ARIAS GUZMAN                  ",5,0,1130,1003,"05",13,"CF02100",0,12460,5,null,20150101,20150331,118366.07,0]
[null,"GUANAJUATO","11APT0001T",100,"AIMK880805R10","AIMK880805MGTRXR05  ","KARLA GABRIELA ARIAS MUÑOZ              ",2,0,1130,1003,"05",13,"CF33206",0,14142,2,null,20150101,20150331,88525.709999999992,0]
[null,"GUANAJUATO","11DPT0011X",120,"AOFA670123A81","AOFA670123MGTBLD06  ","ADRIANA DEL CARM ABONCE FLORES          ",2,0,1130,1003,"02",49,"CF33206",0,14057,2,null,20150101,20150331,98829.959999999992,0]
[null,"GUANAJUATO","11APT0001T",100,"AOGI790809G38","AOGI790809MGTLRM04  ","IMELDA SUSANA ALONSO GARCIA             ",2,0,1130,1003,"05",13,"CF33204",0,4416,2,null,20150101,20150331,73019.38,0]
[null,"GUANAJUATO","11DPT0007K",120,"AOLJ820429DY4","AOLJ820429HGTCPL06  ","JOEL ADOLFO ACOSTA LOPEZ                ",2,0,1130,1003,"02","03","S01201",0,9192,2,null,20150101,20150331,30606.43,0]
[null,"GUANAJUATO","11APT0001T",100,"AORJ6109147M3","AORJ610914HDFMZR05  ","JORGE AMOR RUIZ                         ",5,0,1130,1003,"05",13,"CF02100",0,12459,5,null,20150101,20150331,118366.07,0]
[null,"GUANAJUATO","11DPT0003O",120,"AOVP751006KA9","AOVP751006MGTLLL04  ","MA. DEL PILAR ALMONACI VALADEZ          ",2,0,1130,1003,"00",30,"CF33204",0,2518,2,null,20150101,20150331,80260.500000000015,0]
[null,"GUANAJUATO","11DPT0001Q",120,"AUDM660425P52","AUDM660425MGTGRR18  ","MIRIAM AGUILAR DURON                    ",2,0,1130,1003,"00",28,"CF33206",0,12913,2,null,20150101,20150331,117880.48,0]
[null,"GUANAJUATO","11DPT0004N",120,"AUPM640422KR2","AUPM640422HGTGLR03  ","MARTIN AGUIRRE PALMERIN                 ",2,0,1130,1003,"01",28,"S01201",0,6502,2,null,20150101,20150331,39503.279999999999,0]
[null,"GUANAJUATO","11DPT0001Q",120,"BACM8402274W0","BACM840227HGTRNG03  ","MIGUEL ANGEL BARRON CONEJO              ",2,0,1130,1003,"00",28,"CF33206",0,12911,2,null,20150101,20150331,93161.760000000009,0]
[null,"GUANAJUATO","11DPT0011X",120,"BAGJ5004309G9","BAGJ500430HGTRRR03  ","JORGE BARRERA GARCIA                    ",2,0,1130,1003,"02",49,"CF18201",0,10593,2,null,20150101,20150331,40033.040000000001,0]
[null,"GUANAJUATO","11DPT0011X",120,"BAGS470901EG4","BAGS470901MGTRRL03  ","SILVIA BARRERA GARCIA                   ",2,0,1130,1003,"02",49,"S01202",0,10616,2,null,20150101,20150331,39729.600000000006,0]
[null,"GUANAJUATO","11DPT0008J",120,"BAJR800429CA7","BAJR800429MGTLRC00  ","ROCIO BALDERAS JUAREZ                   ",2,0,1130,1003,"02",33,"T08201",0,770,2,null,20150101,20150331,41231.009999999995,0]
[null,"GUANAJUATO","11APT0001T",100,"BAMJ6207121X4","BAMJ620712HGTRNN19  ","JUAN ANGEL BRAVO MONTOYA                ",2,0,1130,1003,"05",13,"CF33204",0,4390,2,null,20150101,20150331,62726.2,0]
[null,"GUANAJUATO","11DPT0007K",120,"BAPA711019KLA","BAPA711019MGTRRN03  ","ANA LOURDES BARAJAS PEREZ               ",2,0,1130,1003,"02","03","CF33204",0,3880,2,null,20150101,20150331,78402.03,0]
[null,"GUANAJUATO","11DPT0005M",120,"BAQL620315PN5","BAQL620315HGTRRS00  ","LUIS MANUEL BRAVO QUIROZ                ",2,0,1130,1003,"00",72,"CF33206",0,13773,2,null,20150101,20150331,118605.56,0]
[null,"GUANAJUATO","11DPT0008J",120,"BARJ8305267S1","BARJ830526HGTRYN02  ","REYES JUAN ANGEL BRAVO                  ",2,0,1130,1003,"02",33,"CF33206",0,13503,2,null,20150101,20150331,79530.91,0]
[null,"GUANAJUATO","11DPT0005M",120,"BASS600608U7A","BASS600608MGTRRL08  ","MARIA SOLEDAD ROS BRAVO SERRANO         ",2,0,1130,1003,"00",72,"A03202",0,4388,2,null,20150101,20150331,43691.039999999994,0]
[null,"GUANAJUATO","11DPT0010Y",120,"BAUM780104T8A","BAUM780104MGTRRC01  ","MICAELA BARCENAS URBINA                 ",2,0,1130,1003,"02","04","S01201",0,2514,2,null,20150101,20150331,32191.310000000005,0]
[null,"GUANAJUATO","11DPT0001Q",120,"BAUR7105213K8","BAUR710521MDFRRT02  ","RITA BARCENAS URBINA                    ",2,0,1130,1003,"00",28,"A03202",0,2495,2,null,20150101,20150331,40144.28,0]
[null,"GUANAJUATO","11DPT0002P",120,"BERC880813NK7","BERC880813MGTLMN05  ","CINDIA ELIZABETH BELTRAN RAMOS          ",2,0,1130,1003,"00",29,"CF04201",0,2561,2,null,20150101,20150331,38954.199999999997,0]
[null,"GUANAJUATO","11DPT0003O",120,"BUSG720302VE9","BUSG720302MGTLND02  ","MA. GUADALUPE BULLONS SANTIAGO          ",2,0,1130,1003,"00",30,"A03202",0,9164,2,null,20150101,20150331,38722.219999999994,0]
[null,"GUANAJUATO","11DPT0008J",120,"CAAO740517PC6","CAAO740517HGTMRC05  ","OCTAVIANO CAMPOS ARRIAGA                ",2,0,1130,1003,"02",33,"CF33204",0,2522,2,null,20150101,20150331,75960.340000000011,0]
[null,"GUANAJUATO","11DPT0003O",120,"CACF600221UD2","CACF600221HSPMSR07  ","FORTUNATO CAMACHO CASTILLO              ",2,0,1130,1003,"00",30,"S01201",0,2618,2,null,20150101,20150331,33484.42,0]
[null,"GUANAJUATO","11DPT0007K",120,"CACL650308V86","CACL650308MGTMLZ03  ","MA. DE LA LUZ CAMARILLO COLLAZO         ",2,0,1130,1003,"02","03","CF33206",0,10298,2,null,20150101,20150331,122111.44,0]
[null,"GUANAJUATO","11DPT0007K",120,"CADG5812029W6","CADG581202MGTHLR09  ","GRACIELA CHAVEZ DELGADO                 ",2,0,1130,1003,"02","03","CF21202",0,9211,2,null,20150101,20150331,47695.5,0]
[null,"GUANAJUATO","11DPT0003O",120,"CAGM670126RV9","CAGM670126MGTHNR09  ","MARTHA DELIA CHAVEZ GONZALEZ            ",2,0,1130,1003,"00",30,"CF33206",0,13682,2,null,20150101,20150331,109032.66,0]
[null,"GUANAJUATO","11DPT0005M",120,"CAGR660928KD7","CAGR660928MGTSNB07  ","RUBICELIA CASTRO GONZALEZ               ",2,0,1130,1003,"00",72,"CF33204",0,7424,2,null,20150101,20150331,85788.21,0]
[null,"GUANAJUATO","11DPT0001Q",120,"CAGT7903078F3","CAGT790307HGTMRM01  ","TOMAS ESTEBAN CAMACHO GARCIA            ",2,0,1130,1003,"00",28,"S01201",0,2533,2,null,20150101,20150331,28744.879999999997,0]
[null,"GUANAJUATO","11DPT0003O",120,"CALA611023U79","CALA611023MZSRZD15  ","ADRIANA CARDENAS LOZA                   ",2,0,1130,1003,"00",30,"CF33206",0,14317,2,null,20150101,20150331,111392.66,0]
[null,"GUANAJUATO","11APT0001T",100,"CALA7006204L0","CALA700620MGTMPL09  ","ALEJANDRA CAMACHO LOPEZ                 ",2,0,1130,1003,"05",13,"CF33204",0,11710,2,null,20150101,20150331,68601.200000000012,0]
[null,"GUANAJUATO","11DPT0011X",120,"CALA880830IGA","CALA880830MGTLPD08  ","ADRIANA CALDERON LOPEZ                  ",2,0,1130,1003,"02",49,"CF04201",0,10296,2,null,20150101,20150331,38193.949999999997,0]
[null,"GUANAJUATO","11DPT0005M",120,"CAML640420FH8","CAML640420HDFSRS06  ","JOSE LUIS CASILLAS MIRANDA              ",2,0,1130,1003,"00",72,"CF34201",0,4394,2,null,20150101,20150331,42334.31,0]
[null,"GUANAJUATO","11DPT0013V",120,"CAML820820U36","CAML820820HGTNNS09  ","LUIS MIGUEL CANO MENDOZA                ",2,0,1130,1003,"03","02","CF33204",0,18853,2,null,20150101,20150331,62726.2,0]
[null,"GUANAJUATO","11DPT0005M",120,"CANS730714K3A","CANS730714MGTSTR04  ","SARA CASTILLO NIETO                     ",2,0,1130,1003,"00",72,"CF04201",0,4386,2,null,20150101,20150331,43680.82,0]
[null,"GUANAJUATO","11DPT0007K",120,"CAPE530526869","CAPE530526MGTRRL07  "," M.ELENA CARDIEL PEREZ                  ",2,0,1130,1003,"02","03","CF33204",0,9174,2,null,20150101,20150331,84090.950000000012,0]
[null,"GUANAJUATO","11DPT0002P",120,"CAPR810416EKA","CAPR810416HGTLRB07  ","ROBERTO CALDERON PEREZ                  ",2,0,1130,1003,"00",29,"CF33204",0,2560,2,null,20150101,20150331,62916.84,0]
[null,"GUANAJUATO","11DPT0001Q",120,"CARM520206UK0","CARM520206HGTBCR09  ","MARIO CABRERA RICO                      ",5,0,1130,1003,"00",28,"CF02103",0,12566,5,null,20150101,20150331,96028.53,0]
[null,"GUANAJUATO","11DPT0002P",120,"CASI750121969","CASI750121HGTSNS13  ","ISAAC CASTRO SANTILLANES                ",2,0,1130,1003,"00",29,"CF18203",0,2576,2,null,20150101,20150331,43744.26,0]
[null,"GUANAJUATO","11DPT0007K",120,"CAUF560705QGA","CAUF560705HGTHRL05  ","FILOMENO CHAGOYA URRUTIA                ",2,0,1130,1003,"02","03","S01201",0,9177,2,null,20150101,20150331,38712.050000000003,0]
[null,"GUANAJUATO","11APT0001T",100,"CAJU780116N75","CAXJ780116HGTMXN05  ","JUAN JOSE CAMACHO                       ",2,0,1130,1003,"05",13,"CF33206",0,14140,2,null,20150101,20150331,93161.760000000009,0]
[null,"GUANAJUATO","11DPT0001Q",120,"CEFS680324L40","CEFS680324HJCRLL06  ","SAUL CERPA FLORES                       ",2,0,1130,1003,"00",28,"S01202",0,2544,2,null,20150101,20150331,33330.659999999996,0]
[null,"GUANAJUATO","11DPT0002P",120,"CEOS781213SN3","CEOS781213HGTBCL07  ","SALOMON CEBALLOS OCHOA                  ",5,0,1130,1003,"00",29,"CF02103",0,12628,5,null,20150101,20150331,94180.54,0]
[null,"GUANAJUATO","11APT0001T",100,"CESA870418K76","CESA870418MGTRMN08  ","ANA GABRIELA CERVERA SAMANO             ",2,0,1130,1003,"05",13,"CF34201",0,8065,2,null,20150101,20150331,36737.75,0]
[null,"GUANAJUATO","11DPT0014U",120,"CEVB731120C46","CEVB731120HGTDRR00  ","BERNARDO CEDILLO VERA                   ",2,0,1130,1003,"03","03","A01801",0,18872,2,null,20150101,20150331,42828.48000000001,0]
[null,"GUANAJUATO","11DPT0006L",120,"CIGP680809983","CIGP680809HGTDRB07  ","PABLO MARTIN CID GARCIA                 ",2,0,1130,1003,"01",63,"CF33206",0,13988,2,null,20150101,20150331,112433.58,0]
[null,"GUANAJUATO","11DPT0005M",120,"COAD7908184B7","COAD790818MGTVRN00  ","DENY COVARRUBIAS ARREGUIN               ",2,0,1130,1003,"00",72,"S01201",0,4398,2,null,20150101,20150331,31016.809999999998,0]
[null,"GUANAJUATO","11DPT0002P",120,"COCA760915JU4","COCA760915HGTRLL02  ","ALEJANDRO CORIA CALDERON                ",2,0,1130,1003,"00",29,"S01201",0,2594,2,null,20150101,20150331,29234.78,0]
[null,"GUANAJUATO","11DPT0009I",120,"COCM710215JF9","COCM710215HMNBMR04  ","MARIO COBIAN CAMACHO                    ",2,0,1130,1003,"01",74,"CF33206",0,13501,2,null,20150101,20150331,112433.58,0]
[null,"GUANAJUATO","11DPT0012W",120,"COMI671203D76","COMI671203MGTNLR18  ","MA. IRAIS CONTRERAS MALDONADO           ",5,0,1130,1003,"04","02","CF02105",0,12780,5,null,20150101,20150331,81406.77,0]
[null,"GUANAJUATO","11DPT0006L",120,"COMP630327QN2","COMP630327HGTNRB00  ","PABLO GERARDO CONTRERAS MARTINEZ        ",2,0,1130,1003,"01",63,"CF33206",0,13987,2,null,20150101,20150331,124525.68,0]
[null,"GUANAJUATO","11DPT0010Y",120,"CORJ890525619","CORJ890525HGTRMR07  ","JORGE ARMANDO CORONA RAMIREZ            ",2,0,1130,1003,"02","04","S01202",0,9228,2,null,20150101,20150331,36436.559999999998,0]
[null,"GUANAJUATO","11DPT0008J",120,"COVA700831PW6","COVA700831MGRNRM03  ","AMADA CONDE VERA                        ",2,0,1130,1003,"02",33,"T08201",0,760,2,null,20150101,20150331,46009.760000000002,0]
[null,"GUANAJUATO","11DPT0008J",120,"COVF720114623","COVF720114HGTNRR02  ","FRANCISCO JAVIER CONDE VERA             ",2,0,1130,1003,"02",33,"S01201",0,10181,2,null,20150101,20150331,33494.81,0]
[null,"GUANAJUATO","11DPT0007K",120,"CUAC760716LS6","CUAC760716HGTVCR00  ","JOSE CARMEN NOE CUEVAS ACOSTA           ",5,0,1130,1003,"02","03","CF02105",0,12840,5,null,20150101,20150331,81406.77,0]
[null,"GUANAJUATO","11DPT0002P",120,"CUHC5501119F9","CUHC550111HGTLNS08  ","CESAR CUELLAR HINOJOSA                  ",2,0,1130,1003,"00",29,"A03202",0,2565,2,null,20150101,20150331,43910.16,0]
[null,"GUANAJUATO","11DPT0010Y",120,"CUTR610723JC8","CUTR610723MGTLTS06  ","ROSA MARIA CUELLAR TETUAN               ",2,0,1130,1003,"02","04","CF33203",0,9216,2,null,20150101,20150331,51411.17,0]
[null,"GUANAJUATO","11DPT0010Y",120,"CUVL741004T6A","CUVL741004MGTRRR08  ","LAURA CRUZ VARGAS                       ",2,0,1130,1003,"02","04","CF33206",0,13545,2,null,20150101,20150331,116379.66,0]
[null,"GUANAJUATO","11DPT0002P",120,"CUVY830805JA3","CUVY830805MGTSRH00  ","YAHAIRA ALICIA E CUESTAS VARGAS         ",2,0,1130,1003,"00",29,"S01201",0,2595,2,null,20150101,20150331,28335.65,0]
[null,"GUANAJUATO","11DPT0009I",120,"CACX500817KXA","CXCA500817MGTBMN03  ","ANITA CABEZA CAMARGO                    ",2,0,1130,1003,"01",74,"S01202",0,8082,2,null,20150101,20150331,42285.72,0]
[null,"GUANAJUATO","11DPT0003O",120,"DAFT8701278E1","DAFT870127MZSVLN04  ","TANIA LIZETH DAVILA FLORES              ",2,0,1130,1003,"00",30,"S01201",0,2500,2,null,20150101,20150331,29666.78,0]
[null,"GUANAJUATO","11DPT0002P",120,"DEHM860518J96","DEHM860518HMCLRG02  ","MIGUEL ANGEL DELGADO HERNANDEZ          ",2,0,1130,1003,"00",29,"S01202",0,2593,2,null,20150101,20150331,34309.599999999999,0]
[null,"GUANAJUATO","11DPT0002P",120,"DEJA790116B16","DEJA790116HMCLMN00  ","JOSE ANTONIO DELGADO JIMENEZ            ",2,0,1130,1003,"00",29,"CF33206",0,13544,2,null,20150101,20150331,103868.32,0]
[null,"GUANAJUATO","11DPT0002P",120,"DONA780620F80","DONA780620HGTMTL04  ","ALEJANDRO DOMINGUEZ NIETO               ",2,0,1130,1003,"00",29,"S01201",0,2635,2,null,20150101,20150331,29727.72,0]
[null,"GUANAJUATO","11APT0001T",100,"DOZL761001RD2","DOZL761001HMNMNS18  ","LUIS ADRIAN DOMINGUEZ ZAVALA            ",5,0,1130,1003,"05",13,"CF02105",0,14598,5,null,20150101,20150331,81406.77,0]
[null,"GUANAJUATO","11DPT0004N",120,"DUAJ8704098Q4","DUAJ870409HGTRGR00","JORGE LUIS DURAN AGUILERA               ",2,0,1130,1003,"01",28,"S01201",0,6520,2,null,20150101,20150331,12761.81,0]
[null,"GUANAJUATO","11DPT0010Y",120,"DUFC8505038R7","DUFC850503MGTRLR04  ","MARIA CRUZ DURAN FLORES                 ",2,0,1130,1003,"02","04","CF19201",0,8513,2,null,20150101,20150331,37804.800000000003,0]
[null,"GUANAJUATO","11DPT0013V",120,"EACA751029DJ3","EACA751029MGTSRN06  ","MA DE LOS ANGELE ESPARZA CORONA         ",2,0,1130,1003,"03","02","S01201",0,18882,2,null,20150101,20150331,31540.619999999995,0]
[null,"GUANAJUATO","11DPT0011X",120,"EAFM570902GM4","EAFM570902HGTSLS06  ","MOISES ESTRADA FLORES                   ",2,0,1130,1003,"02",49,"CF18201",0,6504,2,null,20150101,20150331,39302.07,0]
[null,"GUANAJUATO","11DPT0006L",120,"EAMG8704104G8","EAMG870410MGTSRR00  ","GRECIA ROXANA ESPARZA MARES             ",2,0,1130,1003,"01",63,"S01201",0,7709,2,null,20150101,20150331,32188.620000000003,0]
[null,"GUANAJUATO","11APT0001T",100,"EAVG760111SA9","EAVG760111MGTSLD04  ","MA GUADALUPE ESPARZA VALENCIA           ",2,0,1130,1003,"07","05","CF33204",0,2605,2,null,20150101,20150331,67137.58,0]
[null,"GUANAJUATO","11DPT0009I",120,"EICA641219IS3","EICA641219MGTLRL01  ","ALTAGRACIA ELIZARRARAS CERVANTES        ",2,0,1130,1003,"01",74,"CF21202",0,8100,2,null,20150101,20150331,49872.800000000003,0]
[null,"GUANAJUATO","11DPT0001Q",120,"EICA780130NQ1","EICA780130MGTSRN03  ","ANA MARIA ESPINOZA CERVANTES            ",2,0,1130,1003,"00",28,"A03202",0,2492,2,null,20150101,20150331,35462.259999999995,0]
[null,"GUANAJUATO","11DPT0008J",120,"EICT8203073V8","EICT820307HGTSRM05  ","TOMAS ROGELIO ESPINOZA CERVANTES        ",2,0,1130,1003,"02",33,"ED01201",0,4430,2,null,20150101,20150331,34401.340000000004,0]
[null,"GUANAJUATO","11DPT0009I",120,"EIMJ620524ID9","EIMJ620524HGTLRS02  ","JOSE ELIAS MORENO                       ",2,0,1130,1003,"01",74,"CF33206",0,14311,2,null,20150101,20150331,127422.72000000002,0]
[null,"GUANAJUATO","11DPT0006L",120,"EIMJ880812BK0","EIMJ880812MGTLRH07  ","JHOANA IVON ELIZALDE MARTINEZ           ",2,0,1130,1003,"01",63,"CF18201",0,7699,2,null,20150101,20150331,30907.060000000005,0]
[null,"GUANAJUATO","11APT0001T",100,"EIPA861113S53","EIPA861113HGTSRB08  ","JOSE ABRAHAM ESPINOZA PORRAS            ",2,0,1130,1003,"07","05","CF34202",0,5581,2,null,20150101,20150331,35201.94,0]
[null,"GUANAJUATO","11DPT0002P",120,"EIPM591011QG5","EIPM591011MGTSRR09  ","MARTHA ALICIA ESPINOSA PEREZ            ",2,0,1130,1003,"00",29,"CF33206",0,13246,2,null,20150101,20150331,102230.82,0]
[null,"GUANAJUATO","11DPT0010Y",120,"EISB881118DD0","EISB881118MGTSPT05  ","BETSAIDA MAGDALE ESPINOZA SEPULVEDA     ",2,0,1130,1003,"02","04","CF18201",0,9223,2,null,20150101,20150331,31203.21,0]
[null,"GUANAJUATO","11DPT0009I",120,"EITG6112096F3","EITG611209MDFSBD05  ","MARIA GUADALUPE ESPINOSA TABLEROS       ",2,0,1130,1003,"01",74,"CF33204",0,2591,2,null,20150101,20150331,75193.320000000007,0]
[null,"GUANAJUATO","11DPT0009I",120,"EIVC851005GF2","EIVC851005HGTLRR07  ","CARLOS ELIZARRARAS VARGAS               ",2,0,1130,1003,"01",74,"S01201",0,8099,2,null,20150101,20150331,30606.43,0]
[null,"GUANAJUATO","11DPT0012W",120,"EUVA760924363","EUVA760924HGTSLN02  ","ANTONIO ESQUEDA VILLALON                ",2,0,1130,1003,"04","02","CF33204",0,1800,2,null,20150101,20150331,73754.62,0]
[null,"GUANAJUATO","11DPT0003O",120,"FAAF540219KI2","FAAF540219MGTRGX06  ","MARIA FE FRAUSTO AGUILAR                ",2,0,1130,1003,"00",30,"A03202",0,2613,2,null,20150101,20150331,45061.2,0]
[null,"GUANAJUATO","11DPT0001Q",120,"FABC530210FR5","FABC530210MDFRRR00  ","MARIA DEL CARMEN FRANCO BOURET          ",2,0,1130,1003,"00",28,"CF33202",0,2551,2,null,20150101,20150331,41890.740000000005,0]
[null,"GUANAJUATO","11DPT0005M",120,"FIGP640907QP7","FIGP640907HGTGRD01  ","PEDRO FIGUEROA GARCIA                   ",2,0,1130,1003,"00",72,"S01202",0,4404,2,null,20150101,20150331,42603.49,0]
[null,"GUANAJUATO","11DPT0010Y",120,"FOCJ7406233X9","FOCJ740623MGTLLS01  ","JOSEFINA FLORES CALVA                   ",2,0,1130,1003,"02","04","T08201",0,658,2,null,20150101,20150331,49952.680000000008,0]
[null,"GUANAJUATO","11APT0001T",100,"FOGA580527FU1","FOGA580527HGTLRL09  ","ALEJANDRO FLORES GARCIA                 ",5,0,1130,1003,"05",13,"CF01601",0,18847,5,null,20150101,20150331,94111.31,0]
[null,"GUANAJUATO","11DPT0012W",120,"FOGH740517223","FOGH740517HGTLTC07  ","HECTOR FLORES GUTIERREZ                 ",2,0,1130,1003,"04","02","CF33202",0,3394,2,null,20150101,20150331,44038.62,0]
[null,"GUANAJUATO","11DPT0003O",120,"FOSA610902SG9","FOSA610902MGTLNL09  ","ALEJANDRA PATRICI FLORES SANDOVAL       ",2,0,1130,1003,"00",30,"CF33204",0,2611,2,null,20150101,20150331,76523.070000000007,0]
[null,"GUANAJUATO","11APT0001T",100,"FOTE790312PL3","FOTE790312MGTLRR00  ","ERIKA DEL ROCIO FLORES TERRONES         ",5,0,1130,1003,"05",13,"CF02105",0,14599,5,null,20150101,20150331,81406.77,0]
[null,"GUANAJUATO","11DPT0008J",120,"FOJU6701074Z1","FOXJ670107HGTLXN09  ","JUAN ANTONIO FLORES                     ",2,0,1130,1003,"02",33,"CF33204",0,10193,2,null,20150101,20150331,76695.520000000004,0]
[null,"GUANAJUATO","11DPT0014U",120,"GAAE770204JK3","GAAE770204MDFYLL06  ","ELIA GAYTAN ALCARAZ                     ",5,0,1130,1003,"03","03","CF02104",0,18883,5,null,20150101,20150331,94036.760000000009,0]
[null,"GUANAJUATO","11DPT0001Q",120,"GAAR6310249B2","GAAR631024HGTLRF01  ","RAFAEL GALLEGOS ARELLANO                ",2,0,1130,1003,"00",28,"ED01201",0,2511,2,null,20150101,20150331,42413.96,0]
[null,"GUANAJUATO","11DPT0014U",120,"GABI850102NDA","GABI850102MGTRRS03  ","MARIA ISABEL GARCIA BARRIENTOS          ",2,0,1130,1003,"03","03","CF33206",0,18864,2,null,20150101,20150331,94781.760000000009,0]
[null,"GUANAJUATO","11DPT0004N",120,"GACR6704153I2","GACR670415MGTRRT06  ","MARIA RITA GARCIA CERRATO               ",2,0,1130,1003,"01",28,"CF19201",0,6506,2,null,20150101,20150331,42371.02,0]
[null,"GUANAJUATO","11APT0001T",100,"GAEL7112229A0","GAEL711222MGTLSLO8  ","LILIANA ESTHERLI GALLARDO ESCOBEDO      ",5,0,1130,1003,"05",13,"CF01601",0,11084,5,null,20150101,20150331,94111.31,0]
[null,"GUANAJUATO","11DPT0008J",120,"GAFV6609298F9","GAFV660929MGTRRR06  ","VERONICA ROCIO GRANADOS FRIAS           ",2,0,1130,1003,"02",33,"CF21202",0,10176,2,null,20150101,20150331,43195.539999999994,0]
[null,"GUANAJUATO","11DPT0012W",120,"GAGY700725MG2","GAGY700725MGTRNS04  ","YESENIA GRANADOS GONZALEZ               ",5,0,1130,1003,"04","02","CF02102",0,12518,5,null,20150101,20150331,96187.249999999985,0]
[null,"GUANAJUATO","11DPT0010Y",120,"GAHA7812159G2","GAHA781215MJCMRD07  ","ADRIANA CECILIA GAMA HERNANDEZ          ",2,0,1130,1003,"02","04","CF33206",0,13543,2,null,20150101,20150331,35626.410000000003,0]
[null,"GUANAJUATO","11DPT0002P",120,"GAHJ561230M55","GAHJ561230HGTRRN04  ","JUAN GRANADOS HERNANDEZ                 ",2,0,1130,1003,"00",29,"CF33206",0,13249,2,null,20150101,20150331,109032.66,0]
[null,"GUANAJUATO","11DPT0011X",120,"GAJJ660505P94","GAJJ660505HGTRMN06  ","JUAN GARCIA JIMENEZ                     ",2,0,1130,1003,"02",49,"CF19201",0,10602,2,null,20150101,20150331,42793.32,0]
[null,"GUANAJUATO","11DPT0001Q",120,"GALE770303QD2","GALE770303HGTRSD04","EDUARDO GARCIA LESSO                    ",2,0,1130,1003,"00",28,"CF33204",0,2545,2,null,20150101,20150331,7286.18,0]
[null,"GUANAJUATO","11DPT0003O",120,"GALJ930324KX8","GALJ930324HGTRPN06  ","JUAN CARLOS GARCIA LOPEZ                ",2,0,1130,1003,"00",30,"S01202",0,9200,2,null,20150101,20150331,30824.65,0]
[null,"GUANAJUATO","11DPT0001Q",120,"GAMM680220L32","GAMM680220MGTLRR01  ","MARTHA NORMA GALLEGOS MARISCAL          ",2,0,1130,1003,"00",28,"ED01201",0,2509,2,null,20150101,20150331,43791.67,0]
[null,"GUANAJUATO","11DPT0001Q",120,"GAOH8102061G0","GAOH810206HDFLLM04  ","HUMBERTO ISRAEL GALVAN OLVERA           ",2,0,1130,1003,"00",28,"S01202",0,2520,2,null,20150101,20150331,33109.300000000003,0]
[null,"GUANAJUATO","11DPT0009I",120,"GARG5704245R5","GARG570424HGTRZB08  ","GABRIEL GARCIA RAZO                     ",2,0,1130,1003,"01",74,"S01201",0,8085,2,null,20150101,20150331,40241,0]
[null,"GUANAJUATO","11DPT0007K",120,"GARJ840526678","GARJ840526HGTRMV04  ","JAVIER ARTURO GARCIA ROMERO             ",2,0,1130,1003,"02","03","S01202",0,9193,2,null,20150101,20150331,35693.9,0]
[null,"GUANAJUATO","11DPT0007K",120,"GARL720427FX0","GARL720427MGTRMZ12  ","LUZ MA. GARCIA ROMERO                   ",2,0,1130,1003,"02","03","ED01201",0,9180,2,null,20150101,20150331,42825.450000000004,0]
[null,"GUANAJUATO","11DPT0004N",120,"GARS670416A54","GARS670416MGTRYL05  ","SILVIA GARCIA REYES                     ",2,0,1130,1003,"01",28,"CF33204",0,10604,2,null,20150101,20150331,82645.459999999992,0]
[null,"GUANAJUATO","11DPT0013V",120,"GASM690929112","GASM690929HDFRLR02  ","MARIO MIGUEL GARCIA SALINAS             ",2,0,1130,1003,"03","02","CF33204",0,18854,2,null,20150101,20150331,66402.340000000011,0]
[null,"GUANAJUATO","11DPT0002P",120,"GATG451128UX1","GATG451128HDFYRS05  ","GUSTAVO GAYTAN TORRES                   ",2,0,1130,1003,"00",29,"CF33206",0,13248,2,null,20150101,20150331,93161.760000000009,0]
[null,"GUANAJUATO","11DPT0004N",120,"GAZE690718GX3","GAZE690718MGTRVL07  ","ELIZABETH GARCIA ZAVALA                 ",2,0,1130,1003,"01",28,"CF04201",0,6498,2,null,20150101,20150331,44733.66,0]
[null,"GUANAJUATO","11DPT0001Q",120,"GIAJ670517N7A","GIAJ670517HGTRLN07  ","JUAN MANUEL GRIMALDO ALFARO             ",2,0,1130,1003,"00",28,"CF34201",0,10177,2,null,20150101,20150331,43637.9,0]
[null,"GUANAJUATO","11DPT0005M",120,"GOAA770911HT1","GOAA770911MGTMLN09  ","ANA ROSA GOMEZ ALBA                     ",2,0,1130,1003,"00",72,"CF33204",0,4409,2,null,20150101,20150331,63536.2,0]
[null,"GUANAJUATO","11DPT0008J",120,"GOCH8410237R3","GOCH841023HGTNBC04","HECTOR HUGO GONZALEZ CABRERA            ",2,0,1130,1003,"02",33,"CF18201",0,10175,2,null,20150101,20150331,10183.74,0]
[null,"GUANAJUATO","11DPT0012W",120,"GOGI750427GM1","GOGI750427HMCMYS02  ","ISRAEL GOMEZ GAYTAN                     ",2,0,1130,1003,"04","02","CF33206",0,14068,2,null,20150101,20150331,111299.94,0]
[null,"GUANAJUATO","11DPT0001Q",120,"GOGK890902JT3","GOGK890902MGTNLR04  ","KARLA RAFAELA GONZALEZ GALLARDO         ",2,0,1130,1003,"00",28,"CF33204",0,2526,2,null,20150101,20150331,62158.880000000005,0]
[null,"GUANAJUATO","11DPT0007K",120,"GOGL6009014D1","GOGL600901MGTNLN08  ","LINA ENGRACIA GONZALEZ GALLARDO         ",2,0,1130,1003,"02","03","CF18203",0,9181,2,null,20150101,20150331,47177.790000000008,0]
[null,"GUANAJUATO","11APT0001T",100,"GOLA7812182KA","GOLA781218MQTMPN05  ","ANA GLORIA GOMEZ LOPEZ                  ",2,0,1130,1003,"07","05","CF33204",0,11094,2,null,20150101,20150331,72824.2,0]
[null,"GUANAJUATO","11DPT0005M",120,"GOLR590503HDA","GOLR590503HGTNDB04  ","ROBERTO GONZALEZ LEDESMA                ",5,0,1130,1003,"00",72,"CF02105",0,14597,5,null,20150101,20150331,81406.77,0]
[null,"GUANAJUATO","11DPT0001Q",120,"GOMG8812289D6","GOMG881228HQTMLB01  ","GABRIEL GOMEZ MOLINERO                  ",2,0,1130,1003,"00",28,"CF33204",0,2530,2,null,20150101,20150331,58984.240000000005,0]
[null,"GUANAJUATO","11DPT0003O",120,"GOML690426EW2","GOML690426MGTNDZ08  ","LUZ ESTELA GONZALEZ MEDINA              ",2,0,1130,1003,"00",30,"CF33204",0,2666,2,null,20150101,20150331,78370.240000000005,0]
[null,"GUANAJUATO","11APT0001T",100,"GONM790924B46","GONM790924HGTNVG00  ","MIGUEL ANGEL GONZALEZ NAVARRO           ",2,0,1130,1003,"07","05","CF33204",0,2578,2,null,20150101,20150331,72284.2,0]
[null,"GUANAJUATO","11DPT0013V",120,"GOSA530514210","GOSA530514HGTMTN06  ","JOSE ANTONIO GOMEZ SOTO                 ",5,0,1130,1003,"03","02","CF02104",0,18848,5,null,20150101,20150331,29695.82,0]
[null,"GUANAJUATO","11DPT0011X",120,"GOSA4507257Y0","GOXS450725HGTNXN07  ","SANTIAGO GONZALEZ                       ",2,0,1130,1003,"02",49,"S01202",0,10294,2,null,20150101,20150331,38384.359999999993,0]
[null,"GUANAJUATO","11DPT0002P",120,"GUAA600320L51","GUAA600320MGTTLL03  ","ALEJANDRA GUTIERREZ ALVAREZ             ",2,0,1130,1003,"00",29,"ED01201",0,2571,2,null,20150101,20150331,40252.61,0]
[null,"GUANAJUATO","11DPT0002P",120,"GUAT581022UC2","GUAT581022HGTRLD00  ","TEODORO GUERRERO ALFARO                 ",2,0,1130,1003,"00",29,"S01202",0,2604,2,null,20150101,20150331,42013.329999999994,0]
[null,"GUANAJUATO","11DPT0006L",120,"GUFO930509HR3","GUFO930509MGTVRL06  ","OLIVIA GUEVARA FARFAN                   ",2,0,1130,1003,"01",63,"S01201",0,7716,2,null,20150101,20150331,30193.309999999998,0]
[null,"GUANAJUATO","11DPT0003O",120,"GUFV820306TSA","GUFV820306HGRZLC04  ","VICTOR MANUEL GUZMAN FLORES             ",2,0,1130,1003,"00",30,"CF33206",0,13684,2,null,20150101,20150331,98829.959999999992,0]
[null,"GUANAJUATO","11DPT0013V",120,"GUGA7312084M6","GUGA731208HGTTZL01  ","ALFREDO GUTIERREZ GUZMAN                ",2,0,1130,1003,"03","02","CF21202",0,18881,2,null,20150101,20150331,37474.550000000003,0]
[null,"GUANAJUATO","11DPT0007K",120,"GUGE730901EC4","GUGE730901MGTTNS07  ","ESPERANZA GUTIERREZ GONZALEZ            ",2,0,1130,1003,"02","03","CF04201",0,2612,2,null,20150101,20150331,44654.94,0]
[null,"GUANAJUATO","11DPT0007K",120,"GUGM650603GP3","GUGM650603MJCTZR08  ","MA. MARTINA GUTIERREZ GUZMAN            ",2,0,1130,1003,"02","03","CF33206",0,13321,2,null,20150101,20150331,128920.26999999999,0]
[null,"GUANAJUATO","11APT0001T",100,"GUJE870107661","GUJE870107MGTTRL01  ","ELIZABETH VERONI GUTIERREZ JUAREZ       ",2,0,1130,1003,"07","05","CF33204",0,2546,2,null,20150101,20150331,65494.650000000009,0]
[null,"GUANAJUATO","11DPT0005M",120,"GULH680121BP6","GULH680121HDFTPR01  ","HORACIO GUTIERREZ LOPEZ                 ",2,0,1130,1003,"00",72,"CF34202",0,9195,2,null,20150101,20150331,31513.920000000002,0]
[null,"GUANAJUATO","11DPT0002P",120,"GULM790929U80","GULM790929HGTRGG04  ","MIGUEL ANGEL GUERRERO LAGUNA            ",2,0,1130,1003,"00",29,"S01202",0,2582,2,null,20150101,20150331,35320.99,0]
[null,"GUANAJUATO","11DPT0010Y",120,"GUMB860612B77","GUMB860612MGTTRL01  ","BLANCA EDITH GUTIERREZ MORENO           ",2,0,1130,1003,"02","04","CF19201",0,9226,2,null,20150101,20150331,37254.130000000005,0]
[null,"GUANAJUATO","11DPT0010Y",120,"GUPD810705I4A","GUPD810705HQTRDM04  ","DOMINGO DANIEL GUERRERO PADILLA         ",5,0,1130,1003,"02","04","CF02104",0,12744,5,null,20150101,20150331,94036.760000000009,0]
[null,"GUANAJUATO","11DPT0013V",120,"GURG711212BH3","GURG711212MGTRXD01  ","MA GUADALUPE GUARDADO REA               ",2,0,1130,1003,"03","02","A03202",0,18859,2,null,20150101,20150331,34183.64,0]
[null,"GUANAJUATO","11DPT0008J",120,"GUTR690427DSA","GUTR690427MDFPRC02  ","ROCIO GUAPO TORRECILLAS                 ",2,0,1130,1003,"02",33,"T08201",0,514,2,null,20150101,20150331,44567.01,0]
[null,"GUANAJUATO","11DPT0009I",120,"GUZA720514FG4","GUZA720514MDFTVL06  ","ALEJANDRA GUTIERREZ ZAVALA              ",2,0,1130,1003,"01",74,"A03202",0,8076,2,null,20150101,20150331,42625.36,0]
[null,"GUANAJUATO","11DPT0007K",120,"HEBL680226MH6","HEBL680226HDFRNS05  ","LUIS FELIPE HERRERA BUENDIA             ",2,0,1130,1003,"02","03","S01202",0,9206,2,null,20150101,20150331,37366.44,0]
[null,"GUANAJUATO","11APT0001T",100,"HECH720907NC1","HECH720907MDFRNL01  ","HILDA HERNANDEZ CANCHOLA                ",2,0,1130,1003,"07","05","S01201",0,2653,2,null,20150101,20150331,32170.279999999995,0]
[null,"GUANAJUATO","11DPT0010Y",120,"HECL500618L95","HECL500618HGTRRS04  ","JOSE LUIS HERNANDEZ CORTES              ",2,0,1130,1003,"02","04","CF21202",0,9210,2,null,20150101,20150331,43360.08,0]
[null,"GUANAJUATO","11DPT0003O",120,"HECL6401228X2","HECL640122MDFRLT03  ","LETICIA HERNANDEZ CALVILLO              ",2,0,1130,1003,"00",30,"CF21202",0,2663,2,null,20150101,20150331,44240.039999999994,0]
[null,"GUANAJUATO","11DPT0005M",120,"HECS621213HZ5","HECS621213HGTRLR02  ","SERGIO HERNANDEZ CALDERON               ",2,0,1130,1003,"00",72,"CF18203",0,4411,2,null,20150101,20150331,49853.53,0]
[null,"GUANAJUATO","11DPT0003O",120,"HEFM781229PE6","HEFM781229MGTRRL06  ","MARIA MILAGROS HERNANDEZ FRAUSTO        ",2,0,1130,1003,"00",30,"S01202",0,2659,2,null,20150101,20150331,32731.3,0]
[null,"GUANAJUATO","11DPT0012W",120,"HEGC870427C96","HEGC840727HCSRNR00  ","CRISTOBAL DE JES HERNANDEZ GONZALEZ     ",2,0,1130,1003,"04","02","CF18201",0,9301,2,null,20150101,20150331,30606.43,0]
[null,"GUANAJUATO","11DPT0006L",120,"HEGN8708165Y4","HEGN870816MGTRRY05  ","NAYELI HERREJON GUERRERO                ",2,0,1130,1003,"01",63,"CF18201",0,7705,2,null,20150101,20150331,31343.510000000002,0]
[null,"GUANAJUATO","11DPT0003O",120,"HEGS590916A12","HEGS590916HGTRMR05  ","SERAFIN HERNANDEZ GAMIÑO                ",2,0,1130,1003,"00",30,"CF34201",0,2622,2,null,20150101,20150331,43767.579999999994,0]
[null,"GUANAJUATO","11DPT0010Y",120,"HEHA830216PP3","HEHA830216MGTRRL04  ","ALMA DELIA HERNANDEZ HERNANDEZ          ",2,0,1130,1003,"02","04","CF18201",0,9229,2,null,20150101,20150331,27884.75,0]
[null,"GUANAJUATO","11DPT0003O",120,"HEHA900701UB1","HEHA900701MGTRRN03  ","ANA LETICIA HERNANDEZ HERRERA           ",2,0,1130,1003,"00",30,"S01202",0,2630,2,null,20150101,20150331,30824.65,0]
[null,"GUANAJUATO","11DPT0010Y",120,"HELB7109192T6","HELB710919MGTRNT04  ","BEATRIZ HERNANDEZ LONA                  ",2,0,1130,1003,"02","04","A03202",0,9213,2,null,20150101,20150331,42468.959999999999,0]
[null,"GUANAJUATO","11DPT0013V",120,"HELJ790519GT9","HELJ790519HGTRPN03  ","JUAN MANUEL HERNANDEZ LOPEZ             ",2,0,1130,1003,"03","02","CF18203",0,18857,2,null,20150101,20150331,44551.850000000006,0]
[null,"GUANAJUATO","11DPT0013V",120,"HEMG620422565","HEMG620422MGTRRR08  ","GRACIELA HERNANDEZ MARTINEZ             ",2,0,1130,1003,"03","02","CF33203",0,18858,2,null,20150101,20150331,39817.300000000003,0]
[null,"GUANAJUATO","11DPT0001Q",120,"HEMM6706104M9","HEMM670610MGTRNR09  ","MA. MERCEDES HERRERA MANCERA            ",2,0,1130,1003,"00",28,"CF33206",0,12912,2,null,20150101,20150331,117888.27999999998,0]
[null,"GUANAJUATO","11APT0001T",100,"HEOS630818TT9","HEOS630818MDFRRN00  ","SONIA GUADALUPE HERNANDEZ OROZCO        ",2,0,1130,1003,"05",13,"CF33206",0,13318,2,null,20150101,20150331,110544.18,0]
[null,"GUANAJUATO","11DPT0014U",120,"HEPU760412GG8","HEPU760412HPLRRZ03  ","UZIEL HERNANDEZ PEREZ                   ",2,0,1130,1003,"03","03","S01201",0,18885,2,null,20150101,20150331,33567.93,0]
[null,"GUANAJUATO","11DPT0010Y",120,"HEVL6006012YA","HEVL600601HGTRLZ00  ","J.LUZ HERNANDEZ VELAZQUEZ               ",2,0,1130,1003,"02","04","CF19201",0,9217,2,null,20150101,20150331,37708.509999999995,0]
[null,"GUANAJUATO","11DPT0007K",120,"HELU501011H62","HEXL501011HGTRXZ04  ","DE LA LUZ HERNANDEZ JOSE                ",2,0,1130,1003,"02","03","S01201",0,9184,2,null,20150101,20150331,36546.35,0]
[null,"GUANAJUATO","11DPT0010Y",120,"HIMK800908LB0","HIMK800908HGTNNR04  ","KRISTIAN MANUEL HINOJOSA MONROY         ",2,0,1130,1003,"02","04","S01202",0,10600,2,null,20150101,20150331,32563.96,0]
[null,"GUANAJUATO","11DPT0010Y",120,"IAGY780906K26","IAGY780906MGTBMD00  ","YADIRA ADRIANA IBARRA GOMEZ             ",2,0,1130,1003,"02","04","CF33206",0,14315,2,null,20150101,20150331,81615.45,0]
[null,"GUANAJUATO","11DPT0007K",120,"IAVC761114FE1","IAVC761114MNTBLL00  ","CLAUDIA ELIZABET IBARRA VILLANUEVA      ",2,0,1130,1003,"02","03","CF33206",0,13320,2,null,20150101,20150331,107521.13999999998,0]
[null,"GUANAJUATO","11DPT0008J",120,"JACF700609GI1","JACF700609HGTRML07  ","FELIPE JARAMILLO CAMPOS                 ",2,0,1130,1003,"02",33,"S01201",0,2532,2,null,20150101,20150331,28593.949999999997,0]
[null,"GUANAJUATO","11DPT0006L",120,"JALS470121DUA","JALS470121HMNMPR04  ","SERGIO JAIMES LOPEZ                     ",5,0,1130,1003,"01",63,"CF02103",0,12618,5,null,20150101,20150331,96028.53,0]
[null,"GUANAJUATO","11DPT0007K",120,"JAMC821119QK9","JAMC821119MGTMSL07  ","CLAUDIA MARCELA JAIME MOSQUEDA          ",2,0,1130,1003,"02","03","S01201",0,9173,2,null,20150101,20150331,32809.009999999995,0]
[null,"GUANAJUATO","11DPT0001Q",120,"JAMJ591122Q73","JAMJ591122HGTRNV07  ","JAVIER JARALEÑO MANCERA                 ",2,0,1130,1003,"00",28,"A03202",0,9832,2,null,20150101,20150331,38842.100000000006,0]
[null,"GUANAJUATO","11DPT0011X",120,"JILD710426DB9","JILD710426HGTMPR06  ","DARIO DAMIAN JIMENEZ LOPEZ              ",5,0,1130,1003,"02",49,"CF02103",0,12685,5,null,20150101,20150331,96028.53,0]
[null,"GUANAJUATO","11DPT0003O",120,"JIOL8008248F7","JIOL800824MGTMRZ11  ","LIZETH ARIADNA JIMENEZ ORTEGA           ",2,0,1130,1003,"00",30,"CF33204",0,2510,2,null,20150101,20150331,74024.62,0]
[null,"GUANAJUATO","11DPT0001Q",120,"JOOM700802BM5","JOOM700802HGTYRG06  ","MIGUEL ANGEL JOYA ORTIZ                 ",2,0,1130,1003,"00",28,"CF33206",0,12916,2,null,20150101,20150331,109536.51999999999,0]
[null,"GUANAJUATO","11DPT0002P",120,"JUHF791105831","JUHF791105HDFRLR06  ","FERNANDO JUAREZ HELGUERA                ",2,0,1130,1003,"00",29,"S01201",0,2579,2,null,20150101,20150331,29186.17,0]
[null,"GUANAJUATO","11DPT0005M",120,"JUMH681213NW0","JUMH681213HGTRGL00  ","JOSE HILARIO JUAREZ MAGAÑA              ",2,0,1130,1003,"00",72,"CF33206",0,13770,2,null,20150101,20150331,118731.53999999998,0]
[null,"GUANAJUATO","11DPT0006L",120,"JUPA730712HA3","JUPA730712MGTRRN04  ","ANA LAURA JUAREZ PEREZ                  ",2,0,1130,1003,"01",63,"CF18203",0,7703,2,null,20150101,20150331,46054.32,0]
[null,"GUANAJUATO","11DPT0014U",120,"JUSD780922L87","JUSD780922MQTRRL03  ","DULCE MARIA JUAREZ SORIA                ",2,0,1130,1003,"03","03","A01801",0,18870,2,null,20150101,20150331,42357.53,0]
[null,"GUANAJUATO","11DPT0002P",120,"LAMA800707D83","LAMA800707HGTRRL05  ","JOSE ALEJANDRO LARA MERCADO             ",2,0,1130,1003,"00",29,"S01202",0,2570,2,null,20150101,20150331,33261.85,0]
[null,"GUANAJUATO","11DPT0002P",120,"LARV631103246","LARV631103MGTRCR01  ","VERONICA LARA RICO                      ",2,0,1130,1003,"00",29,"CF18203",0,11914,2,null,20150101,20150331,48852.709999999992,0]
[null,"GUANAJUATO","11DPT0008J",120,"LAVD841123J58","LAVD841123HGTGRN02  ","DANIEL LAGUNA VARGAS                    ",2,0,1130,1003,"02",33,"S01201",0,10179,2,null,20150101,20150331,30149.21,0]
[null,"GUANAJUATO","11DPT0005M",120,"LEAC581017M56","LEAC581017MGTDLN17  ","MARIA CONSEPCION LEDESMA ALMANZA        ",2,0,1130,1003,"00",72,"CF21202",0,4412,2,null,20150101,20150331,45976.11,0]
[null,"GUANAJUATO","11DPT0008J",120,"LEGJ5709056L3","LEGJ570905HGTRNS01  ","JOSE LERA GONZALEZ                      ",2,0,1130,1003,"02",33,"S01202",0,10195,2,null,20150101,20150331,39352.530000000006,0]
[null,"GUANAJUATO","11DPT0005M",120,"LELE610112FLA","LELE610112MGTMRL09  ","ELSA GUADALUPE LEMUS LIRA               ",2,0,1130,1003,"00",72,"CF33206",0,14321,2,null,20150101,20150331,105930.03,0]
[null,"GUANAJUATO","11DPT0013V",120,"LERD770827UM0","LERD770827HGTNDM00  ","JOSE DOMINGO DE LEON RODRIGUEZ          ",2,0,1130,1003,"03","02","CF33206",0,18850,2,null,20150101,20150331,93161.760000000009,0]
[null,"GUANAJUATO","11DPT0009I",120,"LILB720207HV3","LILB720207MGTNML02  ","BLANCA ESTELA LINARES LOMELI            ",2,0,1130,1003,"01",74,"CF33202",0,8087,2,null,20150101,20150331,48755.21,0]
[null,"GUANAJUATO","11DPT0006L",120,"LOAP6711257L7","LOAP671125HGTPGB09  ","JOSE PABLO LOPEZ AGUIRRE                ",2,0,1130,1003,"01",63,"S01202",0,7707,2,null,20150101,20150331,36198.1,0]
[null,"GUANAJUATO","11DPT0002P",120,"LOBM750809KY1","LOBM750809HGTPRG01  ","MIGUEL LOPEZ BARRAGAN                   ",2,0,1130,1003,"00",29,"S01202",0,2568,2,null,20150101,20150331,35949.300000000003,0]
[null,"GUANAJUATO","11DPT0003O",120,"LOCR480518KR8","LOCR480518HDFPRG01  ","ROGELIO LOPEZ CERVANTES                 ",2,0,1130,1003,"00",30,"CF18203",0,9186,2,null,20150101,20150331,50623.369999999995,0]
[null,"GUANAJUATO","11DPT0011X",120,"LOCV8505084R9","LOCV850508MGTPRR07  ","VERONICA LOPEZ CARDOSO                  ",2,0,1130,1003,"02",49,"S01201",0,2557,2,null,20150101,20150331,31828.17,0]
[null,"GUANAJUATO","11DPT0004N",120,"LOGM731124S65","LOGM731124MMNPZN04  ","MONICA IVETT LOPEZ GUZMAN               ",2,0,1130,1003,"01",28,"CF33206",0,13686,2,null,20150101,20150331,99263.82,0]
[null,"GUANAJUATO","11DPT0004N",120,"LOGY890331RG1","LOGY890331MGTPZN04  ","YANNET LOPEZ GUZMAN                     ",2,0,1130,1003,"01",28,"S01201",0,6511,2,null,20150101,20150331,30080.45,0]
[null,"GUANAJUATO","11DPT0009I",120,"LOLA590613UN8","LOLA590613HGTPPN00  ","ANTONIO LOPEZ LOPEZ                     ",2,0,1130,1003,"01",74,"CF33206",0,13500,2,null,20150101,20150331,126481.52,0]
[null,"GUANAJUATO","11DPT0001Q",120,"LOLA870110SJ9","LOLA870110MGTPPL02  ","ALMA ALEJANDRA LOPEZ LOPEZ              ",2,0,1130,1003,"00",28,"CF33204",0,2553,2,null,20150101,20150331,62907.73000000001,0]
[null,"GUANAJUATO","11DPT0012W",120,"LOSG55020446A","LOSG550204HGTPTL09  ","GUILLERMO LOPEZ SOTO                    ",2,0,1130,1003,"04","02","ED01201",0,11525,2,null,20150101,20150331,42132.3,0]
[null,"GUANAJUATO","11APT0001T",100,"LOVL610419CF3","LOVL610419MDFPCR09  ","MARIA DE LOURDES LOPEZ VICTORIA         ",5,0,1130,1003,"05",13,"CF02105",0,14596,5,null,20150101,20150331,81406.77,0]
[null,"GUANAJUATO","11DPT0007K",120,"LOMA701120ND4","LOXM701120HGTPXR04  ","MARTIN EDUARDO LOPEZ                    ",2,0,1130,1003,"02","03","CF33206",0,13319,2,null,20150101,20150331,110166.29999999999,0]
[null,"GUANAJUATO","11DPT0010Y",120,"LOZE620109TAO","LOZE620109MGTPMV07  ","MA.EVERILDA LOPEZ ZAMORA                ",2,0,1130,1003,"02","04","CF04201",0,9214,2,null,20150101,20150331,38144.67,0]
[null,"GUANAJUATO","11APT0001T",100,"LUBJ6301122R7","LUBJ630112HJCNCR04  ","JORGE IGNACIO LUNA BECERRA              ",5,0,1130,1003,"05",13,"CF11100",0,10304,5,null,20150101,20150331,239628.6,0]
[null,"GUANAJUATO","11DPT0003O",120,"LUPG840320SN8","LUPG840320HGTNRD08  ","JOSE GUADALUPE LUNA PEREZ               ",2,0,1130,1003,"00",30,"S01202",0,2623,2,null,20150101,20150331,37968.25,0]
[null,"GUANAJUATO","11DPT0004N",120,"LURR5303156L3","LURR530315HGTNMY04  ","RAYMUNDO LUNA RAMIREZ                   ",2,0,1130,1003,"01",28,"CF33206",0,14055,2,null,20150101,20150331,112433.58,0]
[null,"GUANAJUATO","11DPT0002P",120,"MABH800524BY7","MABH800524HMNRRG02  ","HUGO MARTINEZ BARRERA                   ",2,0,1130,1003,"00",29,"CF33206",0,13247,2,null,20150101,20150331,93161.760000000009,0]
[null,"GUANAJUATO","11APT0001T",100,"MABM8602122N2","MABM860212MGTRRL21","MELISSA MARISELA MARTINEZ BARRIOS       ",2,0,1130,1003,"07","05","S01201",0,2647,2,null,20150101,20150331,20367.480000000003,0]
[null,"GUANAJUATO","11DPT0009I",120,"MACE390728NC3","MACE390713HJCQLV03  ","EVERARDO MAQUEDA CUELLAR                ",2,0,1130,1003,"01",74,"S01201",0,8089,2,null,20150101,20150331,41307.31,0]
[null,"GUANAJUATO","11DPT0002P",120,"MACP790228577","MACP790228MGTRSL06  ","MARIA DEL PILAR MARTINEZ CASTRO         ",2,0,1130,1003,"00",29,"S01201",0,2607,2,null,20150101,20150331,29234.78,0]
[null,"GUANAJUATO","11DPT0010Y",120,"MADB860405V48","MADB860405MGTLZL02  ","MARIA BLANCA MALAGON DIAZ               ",2,0,1130,1003,"02","04","S01202",0,9221,2,null,20150101,20150331,50746.82,0]
[null,"GUANAJUATO","11DPT0002P",120,"MADJ760413GFA","MADJ760413HGTTZQ01  ","JOAQUIN MATA DIAZ                       ",2,0,1130,1003,"00",29,"S01202",0,2597,2,null,20150101,20150331,38505.130000000005,0]
[null,"GUANAJUATO","11DPT0006L",120,"MAFJ5906036T8","MAFJ590603HGTRRN00  ","JUAN MANUEL MARTINEZ FRIAS              ",2,0,1130,1003,"01",63,"ED01201",0,18886,2,null,20150101,20150331,44596.56,0]
[null,"GUANAJUATO","11DPT0001Q",120,"MAGB8208194P2","MAGB820819MGTLRL08  ","BLANCA ELIA MALDONADO GARCIA            ",2,0,1130,1003,"00",28,"CF33204",0,2524,2,null,20150101,20150331,62272.350000000006,0]
[null,"GUANAJUATO","11DPT0001Q",120,"MAGC661126AJ5","MAGC661126MGTLNR18  ","MA.CARMEN MALDONADO GONZALEZ            ",2,0,1130,1003,"00",28,"CF33206",0,12910,2,null,20150101,20150331,107797.55999999998,0]
[null,"GUANAJUATO","11DPT0014U",120,"MAGE8309219C9","MAGE830921HSPLRD08  ","EDUARDO MALDONADO GARCIA                ",2,0,1130,1003,"03","03","CF33206",0,18862,2,null,20150101,20150331,95418.539999999979,0]
[null,"GUANAJUATO","11DPT0007K",120,"MAGF780719PC1","MAGF780719MGTRNT03  ","FATIMA MARTINEZ GONZALEZ                ",2,0,1130,1003,"02","03","S01201",0,9171,2,null,20150101,20150331,28856.78,0]
[null,"GUANAJUATO","11DPT0013V",120,"MAHM7308144V2","MAHM730814MGTRRR07  ","MARCELA DEL PILA MARTINEZ HERNANDEZ     ",2,0,1130,1003,"03","02","CF33206",0,18852,2,null,20150101,20150331,83364.899999999994,0]
[null,"GUANAJUATO","11DPT0011X",120,"MAJG650413GMA","MAJG650413HGTLRS08  ","GUSTAVO MALAGON JUAREZ                  ",2,0,1130,1003,"02",49,"CF33206",0,13689,2,null,20150101,20150331,117283.01999999999,0]
[null,"GUANAJUATO","11DPT0003O",120,"MALR690904B5A","MALR690904MGTRPS03  ","ROSA EUGENIA MARTINEZ LOPEZ             ",2,0,1130,1003,"00",30,"CF34201",0,2649,2,null,20150101,20150331,43268.4,0]
[null,"GUANAJUATO","11DPT0011X",120,"MAMJ550416EN3","MAMJ550416HMNRNS07  ","JOSE MARROQUIN MENDOZA                  ",2,0,1130,1003,"02",49,"CF33206",0,14319,2,null,20150101,20150331,85724.9,0]
[null,"GUANAJUATO","11DPT0003O",120,"MAMJ620217DW9","MAMJ620217HGTRNN03  ","JUAN ANTONIO MARTINEZ MONCIBAIS         ",2,0,1130,1003,"00",30,"CF33204",0,2638,2,null,20150101,20150331,85572.760000000009,0]
[null,"GUANAJUATO","11DPT0011X",120,"MAMM8504029T1","MAMM850402MGTLLS09  ","MASSIEL MALDONADO MALDONADO             ",2,0,1130,1003,"02",49,"S01201",0,10610,2,null,20150101,20150331,33254.07,0]
[null,"GUANAJUATO","11APT0001T",100,"MANR8209073S1","MANR820907HGTCGT04  ","RITO MACIAS NEGRETE                     ",5,0,1130,1003,"07","05","CF01601",0,11035,5,null,20150101,20150331,94111.31,0]
[null,"GUANAJUATO","11APT0001T",100,"MAOJ7405168FA","MAOJ740516MGTRCN05  ","JUANA MARTINEZ OCHOA                    ",2,0,1130,1003,"05",13,"CF33206",0,14141,2,null,20150101,20150331,103850.82,0]
[null,"GUANAJUATO","11DPT0013V",120,"MAPU730620D62","MAPU730620HGTRRL07  ","ULISES MARQUEZ DE LA PARRA              ",5,0,1130,1003,"03","02","CF02104",0,18848,5,null,20150101,20150331,58340.119999999995,0]
[null,"GUANAJUATO","11DPT0009I",120,"MARM6405079G7","MARM640507HGTGVR02  ","MARTIN MAGAÑA RIVERA                    ",2,0,1130,1003,"01",74,"CF33206",0,14310,2,null,20150101,20150331,111111,0]
[null,"GUANAJUATO","11DPT0009I",120,"MATF6010095M3","MATF601009HGTGFR00  ","FRANCISCO MAGAÑA TAFOYA                 ",2,0,1130,1003,"01",74,"CF19201",0,8090,2,null,20150101,20150331,46380.520000000004,0]
[null,"GUANAJUATO","11DPT0009I",120,"MATM660127FH7","MATM660127MGTGFN01  ","MONICA MAGAÑA TAFOYA                    ",2,0,1130,1003,"01",74,"CF33203",0,8091,2,null,20150101,20150331,52865.73000000001,0]
[null,"GUANAJUATO","11DPT0010Y",120,"MAVR700118TS6","MAVR700118HGTRRB08  ","RUBEN MARTINEZ VARELA                   ",2,0,1130,1003,"02","04","CF33206",0,13251,2,null,20150101,20150331,121628.58,0]
[null,"GUANAJUATO","11DPT0009I",120,"MAZC650708TU1","MAZC650708MGTQRR01  ","MARIA CARMEN MAQUEDA ZARATE             ",2,0,1130,1003,"01",74,"S01202",0,8092,2,null,20150101,20150331,39146.109999999993,0]
[null,"GUANAJUATO","11DPT0006L",120,"MAZR720405LB8","MAZR720405HMNRTC01  ","RICARDO MARTINEZ ZETINA                 ",2,0,1130,1003,"01",63,"CF33204",0,7693,2,null,20150101,20150331,56372.36,0]
[null,"GUANAJUATO","11DPT0002P",120,"MEAE910606I30","MEAE910606HGTJGD01  ","EDGAR EMMANUEL MEJIA AGUILA             ",2,0,1130,1003,"00",29,"S01201",0,2574,2,null,20150101,20150331,28797.369999999995,0]
[null,"GUANAJUATO","11APT0001T",100,"MEEA7012162L2","MEEA701216HZSZSR04  ","ARTURO MEZA ESPARZA                     ",5,0,1130,1003,"07","05","CF11102",0,14556,5,null,20150101,20150331,119341.85,0]
[null,"GUANAJUATO","11DPT0013V",120,"MEES880125B67","MEES880125MGTZSN02  ","SANDRA MARGARITA MEZA ESTRADA           ",2,0,1130,1003,"03","02","S01201",0,18860,2,null,20150101,20150331,35515.909999999996,0]
[null,"GUANAJUATO","11DPT0005M",120,"MEGG6410124T0","MEGG641012MGTDRL06  ","GLORIA MEDINA GARCIA                    ",2,0,1130,1003,"00",72,"S01202",0,4415,2,null,20150101,20150331,40048.619999999995,0]
[null,"GUANAJUATO","11DPT0004N",120,"MEGR631011V43","MEGR631011MGTNRS04  ","ROSA MENDEZ GARCIA                      ",2,0,1130,1003,"01",28,"S01202",0,6514,2,null,20150101,20150331,38868.589999999997,0]
[null,"GUANAJUATO","11DPT0001Q",120,"MELN680719F21","MELN680719MGTLDR00  ","NORMA LETICIA MELGOZA LEDESMA           ",2,0,1130,1003,"00",28,"CF34201",0,2504,2,null,20150101,20150331,42759.09,0]
[null,"GUANAJUATO","11DPT0014U",120,"MEME901101QT3","MEME901101MGTNRL08  ","MARIA ELENA MENDOZA MARTINEZ            ",2,0,1130,1003,"03","03","CF18203",0,18871,2,null,20150101,20150331,36834.14,0]
[null,"GUANAJUATO","11DPT0005M",120,"MEMM670521N64","MEMM670521MDFDJR03  ","MARTHA PATRICIA MEDEL MEJIA             ",2,0,1130,1003,"00",72,"CF33202",0,4420,2,null,20150101,20150331,52779.989999999991,0]
[null,"GUANAJUATO","11DPT0001Q",120,"MEMM740704297","MEMM740704MDFDRR03  ","MIRNA MEDINA MARIN                      ",2,0,1130,1003,"00",28,"S01202",0,2542,2,null,20150101,20150331,33061.65,0]
[null,"GUANAJUATO","11DPT0009I",120,"MERA680725T53","MERA680725MGTJML04  ","ALMA DELIA MEJIA RAMOS                  ",2,0,1130,1003,"01",74,"A03202",0,8078,2,null,20150101,20150331,42275.64,0]
[null,"GUANAJUATO","11APT0001T",100,"MERE680309FN1","MERE680309HDFDVD07  ","EDGAR RUBEN MEDINA RIVERO               ",5,0,1130,1003,"05",13,"CF02100",0,12458,5,null,20150101,20150331,37378.76,0]
[null,"GUANAJUATO","11DPT0002P",120,"MEVJ760816A58","MEVJ760816HGTJLL19  ","JULIO ENRIQUE MEJIA VILLANUEVA          ",2,0,1130,1003,"00",29,"CF33206",0,13252,2,null,20150101,20150331,111069.03,0]
[null,"GUANAJUATO","11DPT0001Q",120,"MIAO8312189C2","MIAO831218HDFLPM04  ","OMAR MILLAN APUD                        ",2,0,1130,1003,"00",28,"CF33204",0,2519,2,null,20150101,20150331,59935.039999999994,0]
[null,"GUANAJUATO","11DPT0014U",120,"MIHG8606185P2","MIHG860618MDFRRB06  ","GABRIELA MIRAMONTES HERNANDEZ           ",2,0,1130,1003,"03","03","S01201",0,18875,2,null,20150101,20150331,27387.93,0]
[null,"GUANAJUATO","11DPT0002P",120,"MIRA590513QB0","MIRA590513HGTRMR01  ","JOSE ARMANDO MIRANDA RAMOS              ",2,0,1130,1003,"00",29,"CF34201",0,2587,2,null,20150101,20150331,43174.29,0]
[null,"GUANAJUATO","11DPT0008J",120,"MOFD480314HT2","MOFD480314HGTRLL00  ","JOSE DOLORES MORALES FLORES             ",2,0,1130,1003,"02",33,"S01202",0,10194,2,null,20150101,20150331,41690.269999999997,0]
[null,"GUANAJUATO","11DPT0014U",120,"MOFD741006FM4","MOFD741006HGTSLV05  ","DAVID MOSQUEDA FLORES                   ",2,0,1130,1003,"03","03","CF18203",0,18873,2,null,20150101,20150331,38085.15,0]
[null,"GUANAJUATO","11DPT0002P",120,"MOFY680125UV7","MOFY680125MGTSLL00  ","YOLANDA MOSQUEDA FLORES                 ",2,0,1130,1003,"00",29,"T08201",0,690,2,null,20150101,20150331,43919.82,0]
[null,"GUANAJUATO","11APT0001T",100,"MOGM581228P96","MOGM581228MGTRNR09  ","MARTHA DEL CARME MORENO GONZALEZ        ",2,0,1130,1003,"05",13,"A01801",0,18843,2,null,20150101,20150331,46840.320000000007,0]
[null,"GUANAJUATO","11DPT0001Q",120,"MOHA6909151AA","MOHA690915MGTRRN03  ","ANDREA MORALES HERNANDEZ                ",2,0,1130,1003,"00",28,"S01202",0,2548,2,null,20150101,20150331,34630.400000000001,0]
[null,"GUANAJUATO","11DPT0014U",120,"MOJC851117J2A","MOJC851117MGTRST08  ","CITLALLI TONANCI MORA JASSO             ",2,0,1130,1003,"03","03","CF33206",0,18863,2,null,20150101,20150331,99465.010000000009,0]
[null,"GUANAJUATO","11DPT0013V",120,"MOLJ6908066K2","MOLJ690806HGTNRN01  ","JUAN ANTONIO MONTALVO LIRA              ",2,0,1130,1003,"03","02","CF33204",0,18855,2,null,20150101,20150331,65040.800000000003,0]
[null,"GUANAJUATO","11DPT0011X",120,"MOMA590424218","MOMA590424HGTNLN04  ","JOSE ANTONIO MONCADA MALDONADO          ",2,0,1130,1003,"02",49,"CF34201",0,10609,2,null,20150101,20150331,43268.4,0]
[null,"GUANAJUATO","11DPT0007K",120,"MORA580316U78","MORA580316HGTJML06  ","ALEJANDRO MOJICA RAMIREZ                ",2,0,1130,1003,"02","03","CF18203",0,2641,2,null,20150101,20150331,45029.15,0]
[null,"GUANAJUATO","11DPT0005M",120,"MORM6501066X7","MORM650106HGTRSL00  ","MELCHOR BENITO MORENO ROSALES           ",2,0,1130,1003,"00",72,"CF33206",0,14320,2,null,20150101,20150331,118221.59999999999,0]
[null,"GUANAJUATO","11DPT0004N",120,"MORM731010QZ9","MORM731010MVZLZR03  ","MIRSA MARICELA MOLGORA RAZO             ",5,0,1130,1003,"01",28,"CF02104",0,12767,5,null,20150101,20150331,94036.760000000009,0]
[null,"GUANAJUATO","11DPT0005M",120,"MORM8011214B7","MORM801121HDFRMN03","MANUEL EFRAIN MORENO ROMERO             ",2,0,1130,1003,"00",72,"CF18201",0,4429,2,null,20150101,20150331,16972.900000000001,0]
[null,"GUANAJUATO","11DPT0006L",120,"MOSJ790615LD6","MOSJ790615HGTLNN00  ","JUAN MOLINA SANCHEZ                     ",2,0,1130,1003,"01",63,"A03202",0,7688,2,null,20150101,20150331,33801.96,0]
[null,"GUANAJUATO","11DPT0006L",120,"MOSP780508DF7","MOSP780508HGTLND02  ","PEDRO MOLINA SANCHEZ                    ",2,0,1130,1003,"01",63,"CF18203",0,7713,2,null,20150101,20150331,42473.27,0]
[null,"GUANAJUATO","11DPT0012W",120,"MUHA861028V94","MUHA861028HGTXRD02  ","JOSE ADAN MUÑOZ HERNANDEZ               ",2,0,1130,1003,"04","02","S01201",0,2516,2,null,20150101,20150331,27884.75,0]
[null,"GUANAJUATO","11DPT0007K",120,"MUPT600105IQ9","MUPT600105MGTRRR07  ","MA. TRINIDAD MURILLO PEREZ              ",2,0,1130,1003,"02","03","CF34201",0,9205,2,null,20150101,20150331,38244.46,0]
[null,"GUANAJUATO","11DPT0001Q",120,"MUSF920131CIA","MUSF920131MGTXCR06  ","MARIA FERNANDA MUÑOZ SAUCILLO           ",2,0,1130,1003,"00",28,"S01201",0,2558,2,null,20150101,20150331,30401.21,0]
[null,"GUANAJUATO","11DPT0011X",120,"MUVA591117ID0","MUVA591117HGTRGN01  ","ANTONIO MURILLO VEGA                    ",2,0,1130,1003,"02",49,"CF18201",0,6515,2,null,20150101,20150331,41240.239999999998,0]
[null,"GUANAJUATO","11APT0001T",100,"NAAA9105064C6","NAAA910506MGTCRN09  ","ANDREA BERENICE NACHEZ ARREDONDO        ",2,0,1130,1003,"05",13,"CF33204",0,2660,2,null,20150101,20150331,67633.900000000009,0]
[null,"GUANAJUATO","11DPT0003O",120,"NAME6411037H1","NAME641103MDFVDV03  ","EVA NAVARRO MADRIGAL                    ",2,0,1130,1003,"00",30,"A03202",0,9169,2,null,20150101,20150331,34338.840000000004,0]
[null,"GUANAJUATO","11DPT0014U",120,"NAQI780206S92","NAQI780206HDFVXV07  ","IVAN AGUSTIN NAVARRETE QUIÑONES         ",2,0,1130,1003,"03","03","A03202",0,18868,2,null,20150101,20150331,35498.26,0]
[null,"GUANAJUATO","11DPT0006L",120,"NAVS621206356","NAVS621206MGTVLN00  ","SANDRA JUANA NAVA VELAZQUEZ             ",2,0,1130,1003,"01",63,"CF33204",0,7704,2,null,20150101,20150331,78431.520000000004,0]
[null,"GUANAJUATO","11DPT0009I",120,"NECL411005F85","NECL411005HGTGRS08  ","LUIS NEGRETE CRUZ                       ",2,0,1130,1003,"01",74,"CF18201",0,8093,2,null,20150101,20150331,39735.659999999996,0]
[null,"GUANAJUATO","11DPT0001Q",120,"NIHE721201VC3","NIHE721201HGTTRS04  ","EUSEBIO MIGUEL A NIETO HERNANDEZ        ",2,0,1130,1003,"00",28,"S01202",0,2541,2,null,20150101,20150331,33302.259999999995,0]
[null,"GUANAJUATO","11DPT0005M",120,"NIMA711025LJ1","NIMA711025MGTTRL07  ","ALICIA NIETO MARTINEZ                   ",2,0,1130,1003,"00",72,"A03202",0,4384,2,null,20150101,20150331,41098.799999999996,0]
[null,"GUANAJUATO","11DPT0011X",120,"NIMT691014GT1","NIMT691014MGTTRR05  ","TERESITA NIETO MARTINEZ                 ",2,0,1130,1003,"02",49,"S01201",0,10614,2,null,20150101,20150331,33954.78,0]
[null,"GUANAJUATO","11DPT0003O",120,"NIPD811108TF1","NIPD811108HBCTSN09  ","DANIEL NIETO PASCALIS                   ",5,0,1130,1003,"00",30,"CF02103",0,12664,5,null,20150101,20150331,96028.53,0]
[null,"GUANAJUATO","11DPT0003O",120,"NIRA700123GK9","NIRA700123MGTTVN01  ","ANA LAURA NIETO RIVERA                  ",2,0,1130,1003,"00",30,"CF33206",0,14316,2,null,20150101,20150331,117195.53999999998,0]
[null,"GUANAJUATO","11DPT0007K",120,"NIRG591215T84","NIRG591215MGTTVR06  ","GEORGINA DE LOURD NIETO RIVERA          ",5,0,1130,1003,"02","03","CF02103",0,12576,5,null,20150101,20150331,96028.53,0]
[null,"GUANAJUATO","11DPT0001Q",120,"NUBS660923MR4","NUBS660923MGTXRL07  ","MA.SILVIA NUÑEZ BARRERA                 ",2,0,1130,1003,"00",28,"CF21202",0,2547,2,null,20150101,20150331,46200.6,0]
[null,"GUANAJUATO","11DPT0010Y",120,"OAGS860412RP6","OAGS860412MGTRTR05  ","SARA DEL ROSARIO ORRANTI GUTIERREZ      ",2,0,1130,1003,"02","04","S01201",0,9224,2,null,20150101,20150331,35130.340000000004,0]
[null,"GUANAJUATO","11DPT0001Q",120,"OAMC600520F43","OAMC600520HSLLLR01  ","CARLOS JAVIER OLAVEZ MELESIO            ",2,0,1130,1003,"00",28,"CF19201",0,2543,2,null,20150101,20150331,44759.53,0]
[null,"GUANAJUATO","11DPT0012W",120,"OELW670610C88","OELW670610HGTLDN06  ","WENSESLAO OLVERA LEDESMA                ",2,0,1130,1003,"04","02","CF18203",0,11932,2,null,20150101,20150331,43602.37,0]
[null,"GUANAJUATO","11DPT0012W",120,"OERM770419UD7","OERM770419HGTLSG03  ","MIGUEL ANGEL OLVERA RESENDIZ            ",2,0,1130,1003,"04","02","A03202",0,10293,2,null,20150101,20150331,37411.619999999995,0]
[null,"GUANAJUATO","11DPT0012W",120,"OESM7609303HA","OESM760930MQTLTR09  ","MARIBEL OLVERA SOTO                     ",2,0,1130,1003,"04","02","CF33206",0,14067,2,null,20150101,20150331,83364.899999999994,0]
[null,"GUANAJUATO","11DPT0008J",120,"OETL661122IZ6","OETL661122MGTRRZ06  ","LUZ CECILIA ORTEGA TORRES               ",2,0,1130,1003,"02",33,"CF04201",0,2491,2,null,20150101,20150331,36191.58,0]
[null,"GUANAJUATO","11DPT0004N",120,"OEVL65021376A","OEVL650213MGTRLR01  ","LAURA INES ORTEGA VALADEZ               ",2,0,1130,1003,"01",28,"CF33206",0,14314,2,null,20150101,20150331,125372.42000000001,0]
[null,"GUANAJUATO","11DPT0007K",120,"OIHA541221R95","OIHA541221HGTRRL04  ","ALFONSO ORTIZ HERNANDEZ                 ",2,0,1130,1003,"02","03","A03202",0,2609,2,null,20150101,20150331,45517.920000000006,0]
[null,"GUANAJUATO","11DPT0007K",120,"OILP6802156K9","OILP680215MDFVGL09  ","MARIA DEL PILAR OVIEDO LUGO             ",2,0,1130,1003,"02","03","A03202",0,9168,2,null,20150101,20150331,40329.600000000006,0]
[null,"GUANAJUATO","11APT0001T",100,"OING5906128T6","OING590612HGTRCS02  ","GUSTAVO ORTIZ NICASIO                   ",2,0,1130,1003,"05",13,"CF18203",0,7719,2,null,20150101,20150331,47436.23,0]
[null,"GUANAJUATO","11DPT0003O",120,"OIOM621117BE8","OIOM621117HGTLLN02  ","MANUEL MARTIN OLIVA OLIVA               ",2,0,1130,1003,"00",30,"CF18203",0,2648,2,null,20150101,20150331,55800.929999999993,0]
[null,"GUANAJUATO","11DPT0014U",120,"OOCM7903122F9","OOCM790312MGTRRR03  ","MARCELA OROZCO CORNEJO                  ",2,0,1130,1003,"03","03","CF33204",0,18865,2,null,20150101,20150331,71181.34,0]
[null,"GUANAJUATO","11DPT0005M",120,"OUGM7012272G3","OUGM701227MGTRRN03  ","MONICA ORDUNA GARCIA                    ",2,0,1130,1003,"00",72,"S01202",0,4418,2,null,20150101,20150331,32731.3,0]
[null,"GUANAJUATO","11DPT0005M",120,"PACM840215MT1","PACM840215MGTLRR00  ","MAURA ANGELICA PALOMINO CARREÑO         ",2,0,1130,1003,"00",72,"S01201",0,4417,2,null,20150101,20150331,25278.630000000005,0]
[null,"GUANAJUATO","11DPT0001Q",120,"PACS8101228Y0","PACS810122MGTLRR02  ","SARA PALOMINO CARREÑO                   ",2,0,1130,1003,"00",28,"S01202",0,2525,2,null,20150101,20150331,30686.300000000003,0]
[null,"GUANAJUATO","11DPT0013V",120,"PAGA670111I35","PAGA670111HNTLRR03  ","ARMANDO PALOMARES GARCIA                ",2,0,1130,1003,"03","02","CF33206",0,18851,2,null,20150101,20150331,110166.29999999999,0]
[null,"GUANAJUATO","11DPT0005M",120,"PAGM5802105H5","PAGM580210HNTLRT06  ","MATIAS PALOMARES GARCIA                 ",2,0,1130,1003,"00",72,"S01202",0,4408,2,null,20150101,20150331,31672.05,0]
[null,"GUANAJUATO","11DPT0004N",120,"PAGR7307144R1","PAGR730714MGTNMF00  ","MARIA DEL REFUGIO PANTOJA GOMEZ         ",2,0,1130,1003,"01",28,"CF21202",0,6518,2,null,20150101,20150331,42408.539999999994,0]
[null,"GUANAJUATO","11DPT0006L",120,"PAHM630123LJ6","PAHM630123HGTNRN05  ","MANUEL PANTOJA HERRERA                  ",2,0,1130,1003,"01",63,"CF33206",0,13986,2,null,20150101,20150331,124042.84,0]
[null,"GUANAJUATO","11DPT0008J",120,"PAJJ830708SK1","PAJJ830708HQTTMR06  ","JORGE ADALBERTO PATINO JIMENEZ          ",2,0,1130,1003,"02",33,"CF34202",0,12051,2,null,20150101,20150331,36137.42,0]
[null,"GUANAJUATO","11DPT0002P",120,"PALM711130LV9","PALM711130HGTRGG02  ","MIGUEL ANGEL PARAMO LAGUNA              ",2,0,1130,1003,"00",29,"CF34201",0,2596,2,null,20150101,20150331,38269.69,0]
[null,"GUANAJUATO","11DPT0003O",120,"PAPA810618AR6","PAPA810618HGTLLB03","ABRAHAM PALACIOS PALACIOS               ",2,0,1130,1003,"00",30,"CF18202",0,11099,2,null,20150101,20150331,20367.480000000003,0]
[null,"GUANAJUATO","11DPT0006L",120,"PAPM510404DG5","PAPM510404MGTNCR08  ","MARIA PANIAGUA PICAZO                   ",2,0,1130,1003,"01",63,"A03202",0,7687,2,null,20150101,20150331,31629.079999999994,0]
[null,"GUANAJUATO","11DPT0007K",120,"PAZR620620HP0","PAZR620620MGTCPQ07  ","RAQUEL PACHECO ZAPIEN                   ",2,0,1130,1003,"02","03","CF33204",0,9194,2,null,20150101,20150331,85572.760000000009,0]
[null,"GUANAJUATO","11DPT0012W",120,"PECE671111QE4","PECE671111HDFRSL09  ","ELOY MARTIN PEREZ CASTILLO              ",2,0,1130,1003,"04","02","CF33206",0,14253,2,null,20150101,20150331,114700.85999999999,0]
[null,"GUANAJUATO","11APT0001T",100,"PEGL590326TB4","PEGL590326MGTRMZ05  ","LUZ ELENA PERALES GOMEZ                 ",2,0,1130,1003,"05",13,"CF33203",0,2575,2,null,20150101,20150331,41226.11,0]
[null,"GUANAJUATO","11APT0001T",100,"PELI680925LM6","PELI680925MGTDPV03  ","IVONNE YOLANDA PEDROZA LOPEZ            ",2,0,1130,1003,"05",13,"CF33206",0,10303,2,null,20150101,20150331,118731.53999999998,0]
[null,"GUANAJUATO","11DPT0010Y",120,"PELL790204HW5","PELL790204MNTRRC05  ","LUCIA PEREZ LARA                        ",2,0,1130,1003,"02","04","S01201",0,2513,2,null,20150101,20150331,40699.980000000003,0]
[null,"GUANAJUATO","11APT0001T",100,"PESE6410262J8","PESE641026HTSRNR02  ","ERNESTO PEREZ SANCHEZ                   ",5,0,1130,1003,"07","05","CF01601",0,11098,5,null,20150101,20150331,94111.31,0]
[null,"GUANAJUATO","11DPT0002P",120,"PEVG640422LA3","PEVG640422MGTRRR00  ","GEORGINA SOLEDAD PEREZ VERA             ",2,0,1130,1003,"00",29,"CF33202",0,2592,2,null,20150101,20150331,49101.62999999999,0]
[null,"GUANAJUATO","11DPT0005M",120,"PIAR680730PSA","PIAR680730MGTRGG01  ","MARIA REGINA PRIETO AGUILAR             ",2,0,1130,1003,"00",72,"CF33204",0,2202,2,null,20150101,20150331,84946.48000000001,0]
[null,"GUANAJUATO","11DPT0002P",120,"POGA630408KE8","POGA630408MGTNRD08  ","MARIA ADRIANA PONCE GARCIA              ",2,0,1130,1003,"00",29,"CF19201",0,2583,2,null,20150101,20150331,44787.74,0]
[null,"GUANAJUATO","11DPT0012W",120,"POGA790726B24","POGA790726MGTNZL05  ","ALMA DELIA PONCE GUZMAN                 ",2,0,1130,1003,"04","02","CF04201",0,1440,2,null,20150101,20150331,41503.929999999993,0]
[null,"GUANAJUATO","11DPT0007K",120,"POMR6708302N1","POMR670830MGTRNS05  ","ROSA MARIA PORRAS MANRIQUE              ",2,0,1130,1003,"02","03","CF33204",0,2642,2,null,20150101,20150331,80167.47,0]
[null,"GUANAJUATO","11APT0001T",100,"POPG430527TB7","POPG430527HGTRDD09  ","J. GUADALUPE PORRAS PADILLA             ",2,0,1130,1003,"05",13,"S01202",0,2636,2,null,20150101,20150331,40784.629999999997,0]
[null,"GUANAJUATO","11APT0001T",100,"PUAJ821120LU8","PUAJ821120MJCGLN05  ","JUANA PUGA ALDANA                       ",2,0,1130,1003,"05",13,"S01201",0,2502,2,null,20150101,20150331,32611.62,0]
[null,"GUANAJUATO","11DPT0006L",120,"QUDW870430HH4","QUDW870430MGTNMN07  ","WENDY YAZMIN QUINTANA DOMINGUEZ         ",2,0,1130,1003,"01",63,"CF21202",0,7721,2,null,20150101,20150331,38272.61,0]
[null,"GUANAJUATO","11DPT0001Q",120,"QUGE620101NK4","QUGE620101HGTNRF01  ","EFRAIN QUINTANA GARCIA                  ",2,0,1130,1003,"00",28,"S01202",0,2552,2,null,20150101,20150331,33897.4,0]
[null,"GUANAJUATO","11APT0001T",100,"QUZJ6303282J5","QUZJ630328HSRLNN05  ","JUAN QUILES ZUNO                        ",2,0,1130,1003,"05",13,"A01801",0,18844,2,null,20150101,20150331,44165.760000000002,0]
[null,"GUANAJUATO","11DPT0007K",120,"RAAE850827HM7","RAAE850827MGTMNL05  ","ELVIA RAMIREZ ANDRADE                   ",2,0,1130,1003,"02","03","S01201",0,9183,2,null,20150101,20150331,42154.43,0]
[null,"GUANAJUATO","11DPT0001Q",120,"RAAG5908278S6","RAAG590827HMNNBL08  ","GUILLERMO RANGEL ABURTO                 ",2,0,1130,1003,"00",28,"CF18203",0,4397,2,null,20150101,20150331,50240.989999999991,0]
[null,"GUANAJUATO","11DPT0014U",120,"RAAI811229BW5","RAAI811229MMCMNS05  ","MARIA ISABEL RAMIREZ ANDRADE            ",2,0,1130,1003,"03","03","CF33203",0,18876,2,null,20150101,20150331,47614.69,0]
[null,"GUANAJUATO","11APT0001T",100,"RABF730512PD1","RABF730512HGTMLD04  ","JOSE FIDEL RAMIREZ BELMAN               ",5,0,1130,1003,"05",13,"CF01601",0,11095,5,null,20150101,20150331,94111.31,0]
[null,"GUANAJUATO","11DPT0010Y",120,"RABR820601BH9","RABR820601HGTMND08  ","RODOLFO OSVALDO RAMIREZ BUENO           ",2,0,1130,1003,"02","04","CF33206",0,13543,2,null,20150101,20150331,40961.459999999992,0]
[null,"GUANAJUATO","11DPT0008J",120,"RACA8011159T0","RACA801115MGTMRD05  ","ADELA RAMIREZ CERRITOS                  ",2,0,1130,1003,"02",33,"S01202",0,10174,2,null,20150101,20150331,34664.300000000003,0]
[null,"GUANAJUATO","11DPT0011X",120,"RACB5510265G3","RACB551026HGTMSN05  ","BENITO RAMIREZ CASTILLO                 ",2,0,1130,1003,"02",49,"A03202",0,10292,2,null,20150101,20150331,43643.199999999997,0]
[null,"GUANAJUATO","11APT0001T",100,"RAEL8409015U2","RAEL840901MGTMSR07  ","LAURA PATRICIA RAMOS ESTRADA            ",2,0,1130,1003,"05",13,"CF33206",0,10307,2,null,20150101,20150331,94727.459999999992,0]
[null,"GUANAJUATO","11DPT0005M",120,"RAFA620326696","RAFA620326HGTMNN00  ","JOSE ANTONIO RAMIREZ FUENTES            ",2,0,1130,1003,"00",72,"CF33206",0,13772,2,null,20150101,20150331,123077.16,0]
[null,"GUANAJUATO","11DPT0008J",120,"RAFG691106392","RAFG691106HGTMRR04  ","GERARDO RAMIREZ FERNANDEZ               ",5,0,1130,1003,"02",33,"CF02104",0,12749,5,null,20150101,20150331,94036.760000000009,0]
[null,"GUANAJUATO","11DPT0009I",120,"RAGC520726TJ0","RAGC520726MGTYNR12  ","MARIA CARMEN RAYA GONZALEZ              ",2,0,1130,1003,"01",74,"CF04201",0,8079,2,null,20150101,20150331,47967.380000000005,0]
[null,"GUANAJUATO","11DPT0010Y",120,"RAGJ8207054L2","RAGJ820705HGTNMN05  ","JUAN ANTONIO RANGEL GOMEZ               ",2,0,1130,1003,"02","04","CF21202",0,9232,2,null,20150101,20150331,38244.81,0]
[null,"GUANAJUATO","11DPT0012W",120,"RAGT730306AI0","RAGT730306HGTNRR07  ","JOSE TRINIDAD RANGEL GUERRERO           ",2,0,1130,1003,"04","02","A01801",0,18845,2,null,20150101,20150331,46565.16,0]
[null,"GUANAJUATO","11DPT0007K",120,"RAHJ6410105C3","RAHJ641010MGTMRS04  ","MA. DE JESUS RAMIREZ HORTA              ",2,0,1130,1003,"02","03","CF33206",0,13317,2,null,20150101,20150331,120180.06,0]
[null,"GUANAJUATO","11APT0001T",100,"RAMA640606AQ0","RAMA640606HGTNXL06  ","ALBERTO RANGEL MUÑOZ                    ",2,0,1130,1003,"07","05","ED01201",0,2619,2,null,20150101,20150331,41580.779999999992,0]
[null,"GUANAJUATO","11APT0001T",100,"RAMD6103291R4","RAMD610329HGTMNV10  ","DAVID RAMIREZ MONJARAZ                  ",2,0,1130,1003,"07","05","CF21202",0,1687,2,null,20150101,20150331,40655.760000000002,0]
[null,"GUANAJUATO","11DPT0003O",120,"RARE590716V64","RARE590716MJCMMV05  ","EVELIA DEL CARMEN RAMIREZ RAMIREZ       ",2,0,1130,1003,"00",30,"CF33203",0,9197,2,null,20150101,20150331,50128.09,0]
[null,"GUANAJUATO","11DPT0007K",120,"RARP630605NP2","RARP630605HJCMMD06  ","PEDRO RAMIREZ RAMIREZ                   ",2,0,1130,1003,"02","03","S01202",0,2621,2,null,20150101,20150331,37894.99,0]
[null,"GUANAJUATO","11DPT0003O",120,"RARR701207IA9","RARR701207MDFMMT08  ","RITA RAMIREZ RAMIREZ                    ",2,0,1130,1003,"00",30,"CF04201",0,9170,2,null,20150101,20150331,42891.75,0]
[null,"GUANAJUATO","11DPT0010Y",120,"RARR710422AB6","RARR710422HGTMDM09  ","RAMON RAMIREZ RODRIGUEZ                 ",2,0,1130,1003,"02","04","CF33204",0,10192,2,null,20150101,20150331,73754.62,0]
[null,"GUANAJUATO","11DPT0008J",120,"RASE540830U28","RASE540830HGTYLL02  ","ELEAZAR RAYAS SILVA                     ",2,0,1130,1003,"02",33,"CF18203",0,10187,2,null,20150101,20150331,46689.430000000008,0]
[null,"GUANAJUATO","11APT0001T",100,"RALU580110A37","RAXL580110HGTMXS01  ","LUIS FERNANDO RAMOS                     ",5,0,1130,1003,"07","05","CF02105",0,14601,5,null,20150101,20150331,81406.77,0]
[null,"GUANAJUATO","11DPT0009I",120,"RELR6206286CA","RELR620628HGTYPG09  ","ROGELIO REYES LOPEZ                     ",2,0,1130,1003,"01",74,"CF18203",0,8094,2,null,20150101,20150331,50762.709999999992,0]
[null,"GUANAJUATO","11DPT0013V",120,"RELS650704P63","RELS650704MGTXZL00  ","MA. SOLEDAD REA LOZANO                  ",2,0,1130,1003,"03","02","A01801",0,18877,2,null,20150101,20150331,58342.930000000008,0]
[null,"GUANAJUATO","11DPT0001Q",120,"RERE8505068T2","RERE850506HMNYMD04  ","EDUARDO REYES RAMIREZ                   ",2,0,1130,1003,"00",28,"S01202",0,2508,2,null,20150101,20150331,29740.880000000001,0]
[null,"GUANAJUATO","11DPT0014U",120,"RESO730809AI4","RESO730809MGTYNF03  ","OFELIA REYES SANDOVAL                   ",2,0,1130,1003,"03","03","CF21202",0,18874,2,null,20150101,20150331,40044.410000000003,0]
[null,"GUANAJUATO","11DPT0001Q",120,"RIAA790529868","RIAA790529MMNSGN11  ","ANA KATHERINE RIOS AGUILAR              ",5,0,1130,1003,"00",28,"CF02105",0,14595,5,null,20150101,20150331,81406.77,0]
[null,"GUANAJUATO","11DPT0010Y",120,"RIAC7102242N8","RIAC710224HMNSGR00  ","JOSE CARLOS RIOS AGUILAR                ",2,0,1130,1003,"02","04","CF33206",0,13683,2,null,20150101,20150331,83364.899999999994,0]
[null,"GUANAJUATO","11DPT0011X",120,"RIGA780625KX0","RIGA780625HGTVMG07  ","JOSE AUGUSTO RIVERA GOMEZ               ",2,0,1130,1003,"02",49,"S01202",0,10597,2,null,20150101,20150331,35948.06,0]
[null,"GUANAJUATO","11DPT0007K",120,"RIGJ550502E94","RIGJ550502HCLVRN04  ","JOSE JUAN RIVERA GARCIA                 ",2,0,1130,1003,"02","03","CF33206",0,13316,2,null,20150101,20150331,114679.82,0]
[null,"GUANAJUATO","11DPT0008J",120,"RIHM610919TU2","RIHM610919MGTCRR07  ","MARICELA RICO HERNANDEZ                 ",2,0,1130,1003,"02",33,"CF33204",0,10188,2,null,20150101,20150331,31745.260000000002,0]
[null,"GUANAJUATO","11DPT0014U",120,"RIHR880331D30","RIHR880331HGTSRC09  ","RICARDO RIOS HERNANDEZ                  ",2,0,1130,1003,"03","03","CF33204",0,18867,2,null,20150101,20150331,63452.350000000006,0]
[null,"GUANAJUATO","11DPT0007K",120,"RIOS5803272M4","RIOS580327MZSVLC03  ","MA. DEL SOCORRO RIVERA OLVERA           ",2,0,1130,1003,"02","03","CF33204",0,9199,2,null,20150101,20150331,79096.390000000014,0]
[null,"GUANAJUATO","11DPT0002P",120,"ROBA710226BG0","ROBA710226MGTBRL07  ","ALMA ROBLES BRAVO                       ",2,0,1130,1003,"00",29,"CF34202",0,2600,2,null,20150101,20150331,36868.459999999992,0]
[null,"GUANAJUATO","11DPT0002P",120,"ROBB6412029G0","ROBB641202MGTBRL04  ","BLANCA ESTELA ROBLES BRAVO              ",2,0,1130,1003,"00",29,"CF21202",0,2588,2,null,20150101,20150331,46476.92,0]
[null,"GUANAJUATO","11DPT0001Q",120,"ROBY7612249Q3","ROBY761224MMCDCN00  ","YUNUEN RODRIGUEZ BECERRA                ",2,0,1130,1003,"00",28,"CF34202",0,2537,2,null,20150101,20150331,37299.120000000003,0]
[null,"GUANAJUATO","11DPT0002P",120,"RODY660703MQ8","RODY660703MGTXLL07  ","YOLANDA ROA DELGADO                     ",2,0,1130,1003,"00",29,"CF33204",0,2598,2,null,20150101,20150331,76538.97,0]
[null,"GUANAJUATO","11DPT0001Q",120,"ROEJ700824751","ROEJ700824HVZMSL05  ","JULIO CESAR ROMERO ESCOBAR              ",2,0,1130,1003,"00",28,"S01201",0,2506,2,null,20150101,20150331,31724.75,0]
[null,"GUANAJUATO","11DPT0011X",120,"ROGA640613DQ5","ROGA640613MDFJTN05  ","ANTONIA ESTELA ROJAS GUTIERREZ          ",2,0,1130,1003,"02",49,"CF33206",0,14318,2,null,20150101,20150331,108843.72,0]
[null,"GUANAJUATO","11DPT0002P",120,"ROGC891121D58","ROGC891121MGTJRR05","MARIA DEL CARMEN ROJAS GRANADOS         ",2,0,1130,1003,"00",29,"S01201",0,11909,2,null,20150101,20150331,20367.480000000003,0]
[null,"GUANAJUATO","11DPT0003O",120,"ROGJ631018GD6","ROGJ631018HGTMRN04  ","JUAN JOSE ROMERO GARCIA                 ",2,0,1130,1003,"00",30,"CF19201",0,2620,2,null,20150101,20150331,44693.64,0]
[null,"GUANAJUATO","11APT0001T",100,"ROGJ6708253EA","ROGJ670825HJCMTS04","JOSE DE JESUS ROMO GUTIERREZ            ",5,0,1130,1003,"05",13,"CF02100",0,12458,5,null,20150101,20150331,33880.15,0]
[null,"GUANAJUATO","11DPT0007K",120,"ROGJ720412CD2","ROGJ720412HGTCNL01  ","JULIO BERNARDO ROCHA GONZALEZ           ",2,0,1130,1003,"02","03","CF33202",0,2652,2,null,20150101,20150331,44219.55,0]
[null,"GUANAJUATO","11DPT0008J",120,"ROGJ7905253Y5","ROGJ790525HPLJDN05  ","JOSE JUAN ROJAS GODOY                   ",2,0,1130,1003,"02",33,"CF33206",0,13502,2,null,20150101,20150331,109295.06999999998,0]
[null,"GUANAJUATO","11DPT0007K",120,"ROGL591003DS4","ROGL591003MGTMNN05  ","MA.LINA TERESA ROMERO GONZALEZ          ",2,0,1130,1003,"02","03","CF34202",0,4402,2,null,20150101,20150331,37685.24,0]
[null,"GUANAJUATO","11DPT0001Q",120,"ROHR681221N53","ROHR681221MGTJRB00  ","RUBISELA ROJAS HUARACHA                 ",2,0,1130,1003,"00",28,"CF33204",0,10599,2,null,20150101,20150331,78386.13,0]
[null,"GUANAJUATO","11DPT0007K",120,"ROMI501119KW9","ROMI501119HGTCZS06  ","J. ISABEL ROCHA MEZA                    ",2,0,1130,1003,"02","03","S01201",0,9202,2,null,20150101,20150331,38309.629999999997,0]
[null,"GUANAJUATO","11DPT0001Q",120,"ROMR681004UF2","ROMR681004HGTDRM02  ","RAMIRO RODRIGUEZ MARTINEZ               ",2,0,1130,1003,"00",28,"CF18203",0,2507,2,null,20150101,20150331,49335.58,0]
[null,"GUANAJUATO","11DPT0013V",120,"ROMR861218274","ROMR861218HGTDGC00","RICARDO RODRIGUEZ MAGDALENO             ",2,0,1130,1003,"03","02","CF33206",0,18849,2,null,20150101,20150331,65850.78,0]
[null,"GUANAJUATO","11DPT0007K",120,"ROMV410405227","ROMV410306HGTCZC05  ","VICENTE ROCHA MEZA                      ",2,0,1130,1003,"02","03","S01201",0,9203,2,null,20150101,20150331,37504.79,0]
[null,"GUANAJUATO","11APT0001T",100,"ROPA921225ML5","ROPA921225MGTMRB01  ","ABRIL ANDREA ROMERO PEREZ               ",2,0,1130,1003,"05",13,"S01201",0,4414,2,null,20150101,20150331,29720.799999999996,0]
[null,"GUANAJUATO","11DPT0009I",120,"ROPJ630922717","ROPJ630922MGTDRS08  ","JOSEFINA RODRIGUEZ PEREZ                ",2,0,1130,1003,"01",74,"A03202",0,8080,2,null,20150101,20150331,39578.32,0]
[null,"GUANAJUATO","11DPT0001Q",120,"ROPR4911033YA","ROPR491103HGTDTF04  ","RAFAEL RODRIGUEZ PATINO                 ",2,0,1130,1003,"00",28,"S01202",0,2539,2,null,20150101,20150331,33990.729999999996,0]
[null,"GUANAJUATO","11DPT0011X",120,"ROPR8607125H9","ROPR860712MGTDNS08  ","ROSA AIDE RODRIGUEZ PANIAGUA            ",2,0,1130,1003,"02",49,"CF33206",0,12915,2,null,20150101,20150331,83364.899999999994,0]
[null,"GUANAJUATO","11DPT0013V",120,"RORC850223K78","RORC850223HGTDMR02  ","CARLOS ALBERTO RODRIGUEZ RAMIREZ        ",2,0,1130,1003,"03","02","CF18203",0,18879,2,null,20150101,20150331,40097.81,0]
[null,"GUANAJUATO","11DPT0005M",120,"RORF650224FV1","RORF650224HDFDDR03  ","FERNANDO RODRIGUEZ RODRIGUEZ            ",2,0,1130,1003,"00",72,"S01202",0,4395,2,null,20150101,20150331,32169.9,0]
[null,"GUANAJUATO","11DPT0003O",120,"RORJ800328CB1","RORJ800328HGTDMN01  ","JUAN PABLO RODRIGUEZ RAMIREZ            ",2,0,1130,1003,"00",30,"S01202",0,2633,2,null,20150101,20150331,34447.300000000003,0]
[null,"GUANAJUATO","11DPT0002P",120,"ROSA621019UW4","ROSA621019HGTDNG01  ","AGAPITO RODRIGUEZ SANCHEZ               ",2,0,1130,1003,"00",29,"CF34202",0,305,2,null,20150101,20150331,40791.840000000004,0]
[null,"GUANAJUATO","11DPT0013V",120,"ROSJ840320PL5","ROSJ840320MMCMGL06  ","JULIA OYUKI ROMERO SEGURA               ",2,0,1130,1003,"03","02","A03202",0,18880,2,null,20150101,20150331,33742.36,0]
[null,"GUANAJUATO","11DPT0010Y",120,"ROTF640526L74","ROTF640526HGTDVL07  ","FELIPE RODRIGUEZ TOVAR                  ",2,0,1130,1003,"02","04","CF34202",0,12050,2,null,20150101,20150331,36304.019999999997,0]
[null,"GUANAJUATO","11DPT0010Y",120,"ROVL470314635","ROVL470314HGTXGS09  ","LUIS RUBEN ROA VEGA                     ",2,0,1130,1003,"02","04","CF34202",0,2655,2,null,20150101,20150331,37649.9,0]
[null,"GUANAJUATO","11DPT0012W",120,"ROVR751027UW3","ROVR751027MGTBRS09  ","MARIA DEL ROSARI ROBLES VARGAS          ",2,0,1130,1003,"04","02","S01201",0,2662,2,null,20150101,20150331,32811.01,0]
[null,"GUANAJUATO","11DPT0003O",120,"ROVS5612313Z0","ROVS561231HGTBNL05  ","J. SILVESTRE ROBLEDO VENEGAS            ",2,0,1130,1003,"00",30,"ED01201",0,2656,2,null,20150101,20150331,45808.36,0]
[null,"GUANAJUATO","11DPT0007K",120,"ROMA570516SW1","ROXM570516HGTJXR04  ","MARIO ROJAS                             ",2,0,1130,1003,"02","03","CF33204",0,9201,2,null,20150101,20150331,85432.050000000017,0]
[null,"GUANAJUATO","11DPT0013V",120,"RUER840817TJ2","RUER840817HGTZSN07  ","RENE RUIZ ESPINOZA                      ",2,0,1130,1003,"03","02","A01801",0,18856,2,null,20150101,20150331,42553.62000000001,0]
[null,"GUANAJUATO","11DPT0001Q",120,"RURO710818A13","RURO710818MGTZFL04  ","OLGA AMALIA RUIZ RUFINO                 ",2,0,1130,1003,"00",28,"CF33202",0,2517,2,null,20150101,20150331,46666.39,0]
[null,"GUANAJUATO","11DPT0009I",120,"SAAA790117M77","SAAA790117HGTNRL19  ","JOSE ALFREDO SANCHEZ ARREDONDO          ",2,0,1130,1003,"01",74,"CF33206",0,13499,2,null,20150101,20150331,99963.6,0]
[null,"GUANAJUATO","11APT0001T",100,"SAAK880407FL7","SAAK880407MJCNNR03  ","KARLA ANGELINA SANDOVAL DE ANDA         ",5,0,1130,1003,"05",13,"CF02105",0,12830,5,null,20150101,20150331,81406.77,0]
[null,"GUANAJUATO","11DPT0003O",120,"SAAL680317PF6","SAAL680317MGTLRR00  ","LAURA PATRICIA SALDAÑA ARELLANO         ",2,0,1130,1003,"00",30,"CF33206",0,13685,2,null,20150101,20150331,93161.760000000009,0]
[null,"GUANAJUATO","11DPT0008J",120,"SABA620417HF9","SABA620417HVZNTN05  ","ANICETO SANTIAGO BAUTISTA               ",2,0,1130,1003,"02",33,"CF33206",0,13504,2,null,20150101,20150331,123101.63999999998,0]
[null,"GUANAJUATO","11DPT0005M",120,"SABM631225F45","SABM631225HGTVRR06  ","MARTIN SALVADOR SAAVEDRA BRAVO          ",2,0,1130,1003,"00",72,"S01201",0,4389,2,null,20150101,20150331,30984.43,0]
[null,"GUANAJUATO","11APT0001T",100,"SACA791207U75","SACA791207MGTLSL02  ","MARIA ALEJANDRA SALAZAR CASTANEDA       ",2,0,1130,1003,"05",13,"CF33206",0,14322,2,null,20150101,20150331,99396.78,0]
[null,"GUANAJUATO","11DPT0002P",120,"SACM851223UV7","SACM851223MDFNSN01  ","MONSERRAT SANCHEZ CISNEROS              ",2,0,1130,1003,"00",29,"S01201",0,2601,2,null,20150101,20150331,30186.14,0]
[null,"GUANAJUATO","11DPT0007K",120,"SAGG7304218VA","SAGG730421MGTNLL02  ","GLORIA SANCHEZ GALVAN                   ",2,0,1130,1003,"02","03","CF19201",0,9188,2,null,20150101,20150331,40829.899999999994,0]
[null,"GUANAJUATO","11DPT0001Q",120,"SAGM730131V93","SAGM730131MDFNRR07  ","MARCELA SANCHEZ GARCIA                  ",2,0,1130,1003,"00",28,"CF33206",0,12914,2,null,20150101,20150331,94214.93,0]
[null,"GUANAJUATO","11DPT0002P",120,"SAGS78112652A","SAGS781126HGTLTS16  ","SASHA EMMANUEL SALINAS GUTIERREZ        ",2,0,1130,1003,"00",29,"S01201",0,11702,2,null,20150101,20150331,28593.229999999996,0]
[null,"GUANAJUATO","11DPT0012W",120,"SAHA7408317B1","SAHA740831MDFNRR01  ","AURELIA SANDOVAL HERNANDEZ              ",2,0,1130,1003,"04","02","S01201",0,11167,2,null,20150101,20150331,31792.319999999996,0]
[null,"GUANAJUATO","11APT0001T",100,"SAHE741012DCA","SAHE741012MGTNRS04  ","MA. ESTHER SANCHEZ HERNANDEZ            ",5,0,1130,1003,"05",13,"CF01601",0,11097,5,null,20150101,20150331,94111.31,0]
[null,"GUANAJUATO","11DPT0002P",120,"SAHI670121KQ3","SAHI670121MGTNRN07  ","MA. INES SANDOVAL HERNANDEZ             ",2,0,1130,1003,"00",29,"ED01201",0,2602,2,null,20150101,20150331,42793.32,0]
[null,"GUANAJUATO","11DPT0002P",120,"SAHL6309234X5","SAHL630923HGTNRS00  ","LUIS MIGUEL SANCHEZ HERNANDEZ           ",2,0,1130,1003,"00",29,"CF33204",0,2603,2,null,20150101,20150331,83725.63,0]
[null,"GUANAJUATO","11DPT0004N",120,"SAHO620602LB0","SAHO620602HSRLRS06  ","OSMAN SALAZAR HERNANDEZ                 ",2,0,1130,1003,"01",28,"S01201",0,6507,2,null,20150101,20150331,30595.619999999995,0]
[null,"GUANAJUATO","11DPT0002P",120,"SALM811102IP0","SALG811102MGTNGD00  ","MA. GUADALUPE SANCHEZ LAGUNA            ",2,0,1130,1003,"00",29,"CF33204",0,2599,2,null,20150101,20150331,58641.59,0]
[null,"GUANAJUATO","11DPT0008J",120,"SALS651213I40","SALS651213MGTNNN03  ","SANJUANA SANCHEZ LUNA                   ",2,0,1130,1003,"02",33,"CF04201",0,10172,2,null,20150101,20150331,47530.960000000006,0]
[null,"GUANAJUATO","11DPT0006L",120,"SAMG651113CLA","SAMG651113MGTVDD08  ","MARIA GUADALUPE SAAVEDRA MEDRANO        ",2,0,1130,1003,"01",63,"CF34201",0,7700,2,null,20150101,20150331,41372.61,0]
[null,"GUANAJUATO","11APT0001T",100,"SAML830406CC2","SAML830406HDFNNS01  ","LUIS ENRIQUE SANCHEZ MENDOZA            ",2,0,1130,1003,"05",13,"CF33204",0,3181,2,null,20150101,20150331,60456.94,0]
[null,"GUANAJUATO","11APT0001T",100,"SAMN650727TS7","SAMN650727MGTNJT03  ","MA. NATALIA SANCHEZ MOJICA              ",2,0,1130,1003,"05",13,"S01201",0,9230,2,null,20150101,20150331,32018.68,0]
[null,"GUANAJUATO","11DPT0010Y",120,"SAOC521104BAA","SAOC521104HGTNLR02  ","CARLOS SANCHEZ OLIVA                    ",2,0,1130,1003,"02","04","S01202",0,9227,2,null,20150101,20150331,42230.67,0]
[null,"GUANAJUATO","11DPT0002P",120,"SARA881017KA5","SARA811017HGTNXL07  ","ALBERTO ALEXANDR SANTILLAN REA          ",2,0,1130,1003,"00",29,"S01201",0,2590,2,null,20150101,20150331,30414.78,0]
[null,"GUANAJUATO","11DPT0011X",120,"SARF810815QJ5","SARF810815MDFNCB12  ","MARIA FABIOLA SANCHEZ RICO              ",2,0,1130,1003,"02",49,"S01201",0,10589,2,null,20150101,20150331,32667.23,0]
[null,"GUANAJUATO","11DPT0001Q",120,"SARR700714SU4","SARR700714MGTCMS06  ","MARIA DEL ROSARI SAUCILLO RAMIREZ       ",2,0,1130,1003,"00",28,"CF33204",0,2540,2,null,20150101,20150331,66316.11,0]
[null,"GUANAJUATO","11DPT0002P",120,"SASJ650121CF2","SAST650121HGTNMR00  ","J. TRINIDAD SANCHEZ SAMANO              ",2,0,1130,1003,"00",29,"CF33204",0,9176,2,null,20150101,20150331,70114.77,0]
[null,"GUANAJUATO","11DPT0005M",120,"SATR640529JN3","SATR640529HGTLRB08  ","RUBEN SALAZAR TORRES                    ",2,0,1130,1003,"00",72,"CF19201",0,4426,2,null,20150101,20150331,46831.500000000007,0]
[null,"GUANAJUATO","11DPT0002P",120,"SAVJ890118LK2","SAVJ890118HGTNZS05  ","JOSE DE JESUS SANCHEZ VAZQUEZ           ",2,0,1130,1003,"00",29,"A03202",0,2563,2,null,20150101,20150331,34219.68,0]
[null,"GUANAJUATO","11DPT0011X",120,"SEES881205VA7","SEES881205MGTRSR08  ","SARA SERRANO ESTRADA                    ",2,0,1130,1003,"02",49,"CF33203",0,10611,2,null,20150101,20150331,39943.03,0]
[null,"GUANAJUATO","11DPT0005M",120,"SIFB790507EM8","SIFB790507HGTRRR00  ","BRAULIO ISAAC SIERRA FERREYRA           ",2,0,1130,1003,"00",72,"CF33206",0,13771,2,null,20150101,20150331,93161.760000000009,0]
[null,"GUANAJUATO","11DPT0014U",120,"SIRI830722KG2","SIRI830722HGTXCG04  ","IGNACIO MANUEL SIXTOS RICO              ",2,0,1130,1003,"03","03","CF33204",0,18866,2,null,20150101,20150331,66266.17,0]
[null,"GUANAJUATO","11DPT0006L",120,"SIRO600318LE2","SIRO600318HGTRDC04  ","JOSE OCTAVIO SIERRA RODRIGUEZ           ",2,0,1130,1003,"01",63,"CF33204",0,7708,2,null,20150101,20150331,78313.5,0]
[null,"GUANAJUATO","11DPT0014U",120,"SOMC8307243E3","SOMC830724HGTTNH06  ","CHRISTIAN SOTO MENDOZA                  ",2,0,1130,1003,"03","03","CF33206",0,18861,2,null,20150101,20150331,92378.010000000009,0]
[null,"GUANAJUATO","11DPT0009I",120,"SOMJ580901N40","SOMJ580901HMNLRS02  ","JESUS SOLIS MARIN                       ",2,0,1130,1003,"01",74,"S01202",0,8097,2,null,20150101,20150331,43408.41,0]
[null,"GUANAJUATO","11DPT0004N",120,"SOPA800206QN0","SOPA800206HMCRRB02  ","ABNER ISAI SORIA PEREZ                  ",2,0,1130,1003,"01",28,"CF33204",0,10615,2,null,20150101,20150331,65176.960000000006,0]
[null,"GUANAJUATO","11DPT0012W",120,"SOPL831024T56","SOPL831024MGTTRR09  ","LAURA ANGELICA SOTO PEREZ               ",2,0,1130,1003,"04","02","CF33204",0,363,2,null,20150101,20150331,69570.179999999993,0]
[null,"GUANAJUATO","11DPT0012W",120,"SUFR660516C81","SUFR660516MDFRLQ08  ","RAQUEL SUAREZ FALCON                    ",2,0,1130,1003,"04","02","CF33204",0,10959,2,null,20150101,20150331,74489.86,0]
[null,"GUANAJUATO","11DPT0004N",120,"TAAS6205308FA","TAAS620530MJCPLR01  ","SARA TAPIA ALCANTARA                    ",2,0,1130,1003,"01",28,"CF34201",0,6522,2,null,20150101,20150331,40565.96,0]
[null,"GUANAJUATO","11DPT0003O",120,"TAPM7310026U1","TAPM731002HDFRSG06  ","MIGUEL ANGEL TAURINO PASTEN             ",2,0,1130,1003,"00",30,"S01202",0,2637,2,null,20150101,20150331,36005.300000000003,0]
[null,"GUANAJUATO","11DPT0001Q",120,"TEHM7408294G1","TEHM740829HGTLRR02  ","MARCO ANTONIO TELLEZ HERRERA            ",2,0,1130,1003,"00",28,"S01201",0,2501,2,null,20150101,20150331,28262.739999999998,0]
[null,"GUANAJUATO","11DPT0005M",120,"TOCB650526UK9","TOCB650526MGTRVR00  ","BERTHA TORRES COVARRUBIAS               ",5,0,1130,1003,"00",72,"CF02103",0,12617,5,null,20150101,20150331,96028.53,0]
[null,"GUANAJUATO","11DPT0001Q",120,"TOCF910415931","TOCF910415MGTRRT00  ","FATIMA DEL ROSAR TORRES CERVANTES       ",2,0,1130,1003,"00",28,"CF18201",0,2535,2,null,20150101,20150331,27884.75,0]
[null,"GUANAJUATO","11DPT0006L",120,"TOMP701231IUA","TOMP701231MGTRJT08  ","PATRICIA TORRES MEJIA                   ",2,0,1130,1003,"01",63,"CF33203",0,7702,2,null,20150101,20150331,44551.850000000006,0]
[null,"GUANAJUATO","11DPT0014U",120,"TORM8008155Q9","TORM800815HGTRVR02  ","MARIO TORRES RIVERA                     ",2,0,1130,1003,"03","03","A03202",0,18869,2,null,20150101,20150331,32058.879999999997,0]
[null,"GUANAJUATO","11DPT0001Q",120,"TOSS530312KL6","TOSS530312HDFRMM05  ","SAMUEL TORRES SUMOZA                    ",2,0,1130,1003,"00",28,"S01202",0,2555,2,null,20150101,20150331,31248.35,0]
[null,"GUANAJUATO","11DPT0001Q",120,"VAAM631105TU4","VAAM631105HGTLYR06  ","MARTIN VALENTE AYALA                    ",2,0,1130,1003,"00",28,"A03202",0,2497,2,null,20150101,20150331,40210.46,0]
[null,"GUANAJUATO","11DPT0009I",120,"VACM560124H46","VACM560124HGTZRR03  ","MAURILIO VAZQUEZ CERVANTES              ",2,0,1130,1003,"01",74,"CF18201",0,8098,2,null,20150101,20150331,39930.06,0]
[null,"GUANAJUATO","11DPT0005M",120,"VACY6607278R7","VACY660727MGTRSL08  ","YOLANDA VARGAS CASTILLO                 ",2,0,1130,1003,"00",72,"CF33204",0,4428,2,null,20150101,20150331,85885.900000000009,0]
[null,"GUANAJUATO","11DPT0002P",120,"VAEA7904041V2","VAEA790404HGTLLL05  ","ALEJANDRO VALADEZ ELIAS                 ",2,0,1130,1003,"00",29,"S01201",0,2585,2,null,20150101,20150331,29234.78,0]
[null,"GUANAJUATO","11DPT0005M",120,"VAGC6606185V3","VAGC660618MGTRRN09  ","CANDELARIA VARGAS GARCIA                ",2,0,1130,1003,"00",72,"S01201",0,4413,2,null,20150101,20150331,30790.019999999997,0]
[null,"GUANAJUATO","11DPT0005M",120,"VALN7508285U9","VALN750828MGTZMR00  ","NORMA ADRIANA VAZQUEZ LOMELI            ",2,0,1130,1003,"00",72,"ED01201",0,4403,2,null,20150101,20150331,41875.29,0]
[null,"GUANAJUATO","11DPT0012W",120,"VAMF590309CY5","VAMF590309HGTLNR07  ","FERNANDO VALDES MONTES                  ",2,0,1130,1003,"04","02","CF33206",0,13687,2,null,20150101,20150331,107899.01999999999,0]
[null,"GUANAJUATO","11APT0001T",100,"VARG660927MXA","VARG660927MDFLSL01  ","GLORIA GUADALUPE VALENZUELA RIOS        ",5,0,1130,1003,"07","05","CF01601",0,11090,5,null,20150101,20150331,94111.31,0]
[null,"GUANAJUATO","11DPT0004N",120,"VASO730804UX2","VASO730804HGTRTC00  ","OCTAVIO VARGAS SOTO                     ",2,0,1130,1003,"01",28,"CF33206",0,13688,2,null,20150101,20150331,107623.48,0]
[null,"GUANAJUATO","11DPT0002P",120,"VEGG461124SB3","VEGG461124HGTLLD01  ","J. GUADALUPE VELAZQUEZ GALLARDO         ",2,0,1130,1003,"00",29,"A03202",0,2564,2,null,20150101,20150331,42616.12,0]
[null,"GUANAJUATO","11DPT0001Q",120,"VEGR631014AK5","VEGR631014HGTLRB01  ","RUBEN VELAZQUEZ GARCIA                  ",2,0,1130,1003,"00",28,"S01202",0,2527,2,null,20150101,20150331,35269.090000000004,0]
[null,"GUANAJUATO","11DPT0001Q",120,"VEHP610906SJ2","VEHP610906HGTRRT04  ","PETRONILO VERA HERNANDEZ                ",2,0,1130,1003,"00",28,"CF19201",0,2496,2,null,20150101,20150331,46758.520000000004,0]
[null,"GUANAJUATO","11DPT0001Q",120,"VEMM86100222D","VEMM861022MGTRNR00","MIRIAM SOLEDAD VERA MENDIETA            ",2,0,1130,1003,"00",28,"CF18201",0,2515,2,null,20150101,20150331,10183.74,0]
[null,"GUANAJUATO","11DPT0010Y",120,"VEMR6104101A1","VEMR610410HGTLRM02  ","JOSE RAMON VELEZ MORENO                 ",2,0,1130,1003,"02","04","CF33206",0,13542,2,null,20150101,20150331,93161.760000000009,0]
[null,"GUANAJUATO","11DPT0012W",120,"VIRS630902SUA","VIRS630902HMNLYL09  ","SALVADOR VILLANUEVA REYNOSO             ",2,0,1130,1003,"04","02","CF33206",0,14252,2,null,20150101,20150331,105540.78,0]
[null,"GUANAJUATO","11DPT0008J",120,"VIVM841025NR4","VIVM841025MGTLRL07  ","MELINA VILLARREAL VARGAS                ",2,0,1130,1003,"02",33,"CF33206",0,13505,2,null,20150101,20150331,80044.44,0]
[null,"GUANAJUATO","11APT0001T",100,"ZAAF7902055E9","ZAAF790205HGTMLR09  ","FERNANDO ZAMARRIPA ALDAPE               ",2,0,1130,1003,"05",13,"CF33206",0,13250,2,null,20150101,20150331,101097.18,0]
[null,"GUANAJUATO","11DPT0012W",120,"ZABS740117LZ8","ZABS740117MGRMLS00  ","SUSY ROCIO ZAMUDIO BALVUENA             ",2,0,1130,1003,"04","02","CF33204",0,2531,2,null,20150101,20150331,75960.340000000011,0]
[null,"GUANAJUATO","11DPT0012W",120,"ZABS850402N68","ZABS850402HGTMLR06  ","SERGIO LUIS ZAMUDIO BELTRAN             ",2,0,1130,1003,"04","02","CF04201",0,11168,2,null,20150101,20150331,39110.46,0]
[null,"GUANAJUATO","11APT0001T",100,"ZAHE711130S69","ZAHE711130MDFMRR03  ","ERIKA DE LOS ANGE ZAMORA HERNANDEZ      ",2,0,1130,1003,"07","05","CF33206",0,13498,2,null,20150101,20150331,110976.29999999999,0]
[null,"GUANAJUATO","11DPT0001Q",120,"ZALC5604237Q2","ZALC560423HGTVPR01  ","CARLOS ZAVALA LOPEZ                     ",2,0,1130,1003,"00",28,"S01202",0,2534,2,null,20150101,20150331,39955.25,0]
[null,"GUANAJUATO","11APT0001T",100,"ZALE620903MK9","ZALE620903HGTVND01  ","EDUARDO ZAVALA LEON                     ",2,0,1130,1003,"07","05","CF33204",0,11089,2,null,20150101,20150331,72284.2,0]
[null,"GUANAJUATO","11DPT0013V",120,"ZERV770303SS4","ZERV770303MGTNCN07  ","MARIA  VANESSA ZENDEJAS ROCHA           ",2,0,1130,1003,"03","02","A01801",0,18878,2,null,20150101,20150331,46274.53,0]
[null,"GUANAJUATO","11APT0001T",100,"ZERY820116NN8","ZERY820116MGTNCD08  ","YADIRA BERENICE ZENDEJAS ROCHA          ",2,0,1130,1003,"07","05","A01801",0,18846,2,null,20150101,20150331,47204.58,0]
[null,"GUANAJUATO","11DPT0009I",120,"ZUGJ5210227C5","ZUGJ521022HGTXRV02  ","JAVIER ZUÑIGA GARCIA                    ",5,0,1130,1003,"01",74,"CF02103",0,12663,5,null,20150101,20150331,96028.53,0]
[null,"GUANAJUATO","11DPT0001Q",100,"MASJ651012DZ4","MASJ651012HVZRNN09","JUAN CARLOS MARTINEZ SANTOS",3,19,1130,3102,"00",28,"PB",19,280053,3,null,20150101,20150331,53629.22,0]
[null,"GUANAJUATO","11DPT0010Y",100,"MORA600920UJ0","MORA600920MGTSVN08","MARÍA DE LOS ÁNGELES MOSQUEDA RUVALCABA",3,20,1130,3102,"02","04","PC",20,204041,3,null,20150101,20150331,50121.520000000004,0]
[null,"GUANAJUATO","11DPT0001Q",100,"LOBA7910123P2","LOBA791012HJCPRL00","ALEJANDRO LOPEZ BRIONES",3,17,1130,3102,"00",28,"PB",17,280045,3,null,20150101,20150331,41957.619999999995,0]
[null,"GUANAJUATO","11DPT0007K",120,"ZARG760122LM0","ZARG760122MGTRDR05","  GRACIELA ZARAGOZA RODRIGUEZ ",3,20,1130,3102,"02","03","PC",20,203096,3,null,20150101,20150331,41131.909999999996,0]
[null,"GUANAJUATO","11DPT0010Y",100,"PATD7212262V2","PATD721226MGTCRL02","DULCE CONCEPCIÓN PACHECO TORRES",3,20,1130,3102,"02","04","PC",20,204048,3,null,20150101,20150331,37513.180000000008,0]
[null,"GUANAJUATO","11DPT0006L",100,"LUWR540208FX7","LUWR540208MDFNRB04","REBECA LUNA WIARCO",3,17,1130,3102,"01",63,"PB",17,163024,3,null,20150101,20150331,33835.46,0]
[null,"GUANAJUATO","11DPT0001Q",100,"MAMA711017CPA","MAMA711017HGTRNR02","ARTURO MARTINEZ MONCADA",3,15,1130,3102,"00",28,"PB",15,280051,3,null,20150101,20150331,33265.919999999998,0]
[null,"GUANAJUATO","11DPT0006L",100,"MOSR800811KH0","MOSR800811HGTLNC05","RICARDO MOLINA SANCHEZ",3,15,1130,3102,"01",63,"PB",15,163030,3,null,20150101,20150331,28868.760000000002,0]
[null,"GUANAJUATO","11DPT0012W",120,"SOZC590907935","SOZC590907HQTRXN08","JOSE CONRADO SORIA  ZUÑIGA ",3,20,1130,3102,"04","02","PC",20,27049,3,null,20150101,20150331,25976.17,0]
[null,"GUANAJUATO","11DPT0008J",120,"VAME680312QT2","VAME680312MGTZLR00","ELISA VAZQUEZ MARTINEZ",3,26,1130,3102,"02",33,"PC",26,523352,3,null,20150101,20150331,23718.93,0]
[null,"GUANAJUATO","11DPT0006L",100,"SAGI850902B58","SAGI850902MJCNNS03","ISAURA SANCHEZ GONZALEZ",3,18,1130,3102,"01",63,"PA",18,163044,3,null,20150101,20150331,21916.86,0]
[null,"GUANAJUATO","11DPT0001Q",100,"MAJO8201113IA","MAJO820111HOCRMS09","OSIRIS MARTINEZ JIMENEZ",3,20,1130,3102,"00",28,"PC",20,280049,3,null,20150101,20150331,21497.52,0]
[null,"GUANAJUATO","11DPT0005M",120,"CABA581007J13","CABA581007MMNRZN16","MARIA DE LOS ANGELES CARDENAS BAEZA",3,20,1130,3102,"00",72,"PC",20,1130,3,null,20150101,20150331,21031.75,0]
[null,"GUANAJUATO","11DPT0002P",120,"AOVI670402NJA","AOVI670402HGTCZS07","ISMAEL ACOSTA VAZQUEZ",3,19,1130,3102,"00",29,"PB",19,29001,3,null,20150101,20150331,20860,0]
[null,"GUANAJUATO","11DPT0001Q",100,"HEPM8111294E4","HEPM811129HGTRRG03","MIGUEL ANGEL HERNANDEZ PEREZ",3,15,1130,3102,"00",28,"PB",15,280040,3,null,20150101,20150331,20517.37,0]
[null,"GUANAJUATO","11DPT0014U",100,"SAPG841029F61","SAPG841029HGTNRD01","JOSE GUADALUPE SANDOVAL PEREZ",3,30,1130,3102,"03","03","TA",30,303027,3,null,20150101,20150331,19857.48,0]
[null,"GUANAJUATO","11DPT0001Q",100,"MARR660925MG9","MARR660925MGTRDC04","ROCIO MARTINEZ RODRIGUEZ",3,17,1130,3102,"00",28,"PB",17,280052,3,null,20150101,20150331,18185.059999999998,0]
[null,"GUANAJUATO","11DPT0010Y",100,"NIGC7311229F4","NIGC731122HGTLSC01","CECILIO NILA GASCA",3,10,1130,3102,"02","04","PC",10,204046,3,null,20150101,20150331,18153.72,0]
[null,"GUANAJUATO","11DPT0006L",100,"GASM760821854","GASS760821MGTRTC10","MA. DEL SOCORRO GARCIA SOTELO",3,15,1130,3102,"01",63,"PB",15,163017,3,null,20150101,20150331,17693.760000000002,0]
[null,"GUANAJUATO","11DPT0013V",120,"AAAL5409208IA","AAXA540920HDFLXL04","JOSE ALEJANDRO ALVAREZ ",3,20,1130,3102,"03","02","PA",20,100002,3,null,20150101,20150331,17649.739999999998,0]
[null,"GUANAJUATO","11DPT0010Y",120,"AASR710311P25","AASR710311MGTLNC02","ROCÍO DEL CARMEN ALMANZA SANDOVAL",3,20,1130,3102,"02","04","PC",20,204003,3,null,20150101,20150331,17460.89,0]
[null,"GUANAJUATO","11DPT0009I",100,"IACC631023AI2","IACC631023HGTBNH06","CUAUHTEMOC IBARRA CANO",3,15,1130,3102,"01",74,"PB",15,740016,3,null,20150101,20150331,17228.13,0]
[null,"GUANAJUATO","11DPT0006L",100,"MAGM780331EF7","MAGM780331MGTRZR08","MARIANA MARIN GUZMAN",3,15,1130,3102,"01",63,"PA",15,163027,3,null,20150101,20150331,16945.12,0]
[null,"GUANAJUATO","11DPT0001Q",100,"MOHD5903208E0","MOHD590320HMCCRL05","JOSE DOLORES GUADALUPE MOCTEZUMA HERNANDEZ",3,20,1130,3102,"00",28,"PB",20,280054,3,null,20150101,20150331,16762.5,0]
[null,"GUANAJUATO","11DPT0006L",100,"JAMJ8502091S3","JAMJ850209HDFSRL04","JULIO CESAR JASSO MARTINEZ",3,20,1130,3102,"01",63,"PB",20,163021,3,null,20150101,20150331,16141.7,0]
[null,"GUANAJUATO","11DPT0013V",120,"DULJ8108233XA","DULJ810823HGTQPN02","JUAN IGNACIO DUQUE LOPEZ",3,12,1130,3102,"03","02","PC",12,10008,3,null,20150101,20150331,16015.67,0]
[null,"GUANAJUATO","11DPT0012W",120,"RORE431022TB0","RORE431022HGTDMD08","EDILBERTO RODRIGUEZ ROMERO",3,20,1130,3102,"04","02","PC",20,270130,3,null,20150101,20150331,15657.37,0]
[null,"GUANAJUATO","11DPT0007K",120,"MAMD780104125","MAMD780104MGTTRL05","MARIA DOLORES MATA MARTINEZ",3,20,1130,3102,"02","03","PC",20,203054,3,null,20150101,20150331,15657.37,0]
[null,"GUANAJUATO","11DPT0010Y",100,"HIBA631027337","HIBA631027HGTNLN08","ANTONIO HINOJOSA BALANDRÁN",3,24,1130,3102,"02","04","PB",24,204026,3,null,20150101,20150331,15608.58,0]
[null,"GUANAJUATO","11DPT0002P",100,"CAEL721019IZ9","CAEL721019MGTSLL08","LILIA ISELA CASTILLO ELIZARRARAZ",3,20,1130,3102,"00",29,"PB",20,290009,3,null,20150101,20150331,15489.779999999999,0]
[null,"GUANAJUATO","11DPT0007K",120,"LORF540804250","LORF540804HJCPLR09","FRANCISCO JAVIER LOPEZ RUELAS",3,20,1130,3102,"02","03","PC",20,203047,3,null,20150101,20150331,15478.199999999999,0]
[null,"GUANAJUATO","11DPT0001Q",100,"COVE740314GR2","COVE740314HGTRZN07","ENRIQUE CORTEZ VAZQUEZ",3,17,1130,3102,"00",28,"TA",17,280132,3,null,20150101,20150331,15370.240000000002,0]
[null,"GUANAJUATO","11DPT0011X",100,"SAPG631009QMA","SAPG631009MGTNRD02","MA GUADALUPE  SANCHEZ  PARRA ",3,15,1130,3102,"02",49,"PA",15,249051,3,null,20150101,20150331,15081.02,0]
[null,"GUANAJUATO","11DPT0007K",120,"MOVM841118881","MOVM841118MGTNRR09","MARIELA MONTIEL  VERA",3,16,1130,3102,"02","03","PC",16,203143,3,null,20150101,20150331,14952.86,0]
[null,"GUANAJUATO","11DPT0011X",100,"HECM670422CC4","HECM670422MDFRBR02","MARIA MARCELA  HERRERA  CEBALLOS ",3,21,1130,3102,"02",49,"PC",21,249026,3,null,20150101,20150331,14940.789999999999,0]
[null,"GUANAJUATO","11DPT0007K",120,"ROZA8409121VA","ROZA840912MGTDXL02","ALMA ROSARIO RODRIGUEZ ZUÑIGA",3,9,1130,3102,"02","03","PC",9,203202,3,null,20150101,20150331,14918.650000000001,0]
[null,"GUANAJUATO","11DPT0013V",20,"LORM590406948","LORM590406MGTPDD05","MA GUADALUPE LOPEZ RODRIGUEZ",3,20,1130,3102,"03","02","PB",20,100010,3,null,20150101,20150331,14900,0]
[null,"GUANAJUATO","11DPT0008J",120,"HEMR760314HY6","HEMR760314HGTRRL06","RAUL HERNANDEZ MARTINEZ",3,15,1130,3102,"02",33,"PB",15,523361,3,null,20150101,20150331,14434.380000000001,0]
[null,"GUANAJUATO","11DPT0002P",120,"NAVG770820NG1","NAVG770820MGTVGB02","GABRIELA NAVA VIGIL",3,15,1130,3102,"00",29,"PB",15,290056,3,null,20150101,20150331,14434.380000000001,0]
[null,"GUANAJUATO","11DPT0006L",100,"JAPM610407F53","JAPM610407HGTSRR00","MARCELINO JASSO PEREZ",3,20,1130,3102,"01",63,"PA",20,163022,3,null,20150101,20150331,14362.86,0]
[null,"GUANAJUATO","11DPT0010Y",120,"ROMO790623E30","ROMO790623HGTSRL08","OLIMPO ROSILLO MORENO",3,15,1130,3102,"02","04","PB",15,204066,3,null,20150101,20150331,14304.83,0]
[null,"GUANAJUATO","11DPT0002P",120,"AAGC731126M29","AAGC731126HDFLNN07","CONRRADO ARTURO ALVAREZ GONZALEZ",3,20,1130,3102,"00",29,"PB",20,290005,3,null,20150101,20150331,14155,0]
[null,"GUANAJUATO","11DPT0001Q",100,"AOOS720925113","AOOS720925MGTBRN08","SANDRA ABOYTES OROZCO",3,20,1130,3102,"00",28,"PB",20,28001,3,null,20150101,20150331,14110.4,0]
[null,"GUANAJUATO","11DPT0010Y",120,"PEGS750625V73","PEGS750625HGTRRR05","SERGIO JAVIER  PEREZ GUERRERO",3,15,1130,3102,"02","04","PC",15,204050,3,null,20150101,20150331,14026.25,0]
[null,"GUANAJUATO","11DPT0009I",100,"TEAR801024C6A","TEAR801024MGTJDS18","ROSA BEATRIZ TEJEDA ADAME",3,15,1130,3102,"01",74,"PB",15,740038,3,null,20150101,20150331,13969.75,0]
[null,"GUANAJUATO","11DPT0009I",100,"PESA790927U25","PESA790927MGTRTN06","ANDREA MAGDALENA PEREZ SOTO",3,20,1130,3102,"01",74,"PB",20,740028,3,null,20150101,20150331,13968.75,0]
[null,"GUANAJUATO","11DPT0005M",120,"VITF791111L77","VITF791111HGTLVR01","FRANCISCO VILLAFAÑA  TAVERA",3,16,1130,3102,"00",72,"PB",16,1130,3,null,20150101,20150331,13782.5,0]
[null,"GUANAJUATO","11DPT0012W",100,"ROEL820326QF8","ROEL820326MGTCSZ05","MARIA DE LA LUZ ROCHA  ESCOBAR ",3,15,1130,3102,"04","02","PB",15,27040,3,null,20150101,20150331,13503.130000000001,0]
[null,"GUANAJUATO","11DPT0001Q",100,"MACM811125AAA","MACM811125MGTSRR00","MARLENE SELENE MASCOTTE CRUZ",3,15,1130,3102,"00",28,"PB",15,280115,3,null,20150101,20150331,13472.1,0]
[null,"GUANAJUATO","11DPT0002P",100,"DOMN670802UR9","DOMN670802MGTMNT03","NATALIA DE LOS ANGELES DOMINGUEZ MANZANO",3,20,1130,3102,"00",29,"PB",20,290024,3,null,20150101,20150331,13410,0]
[null,"GUANAJUATO","11DPT0001Q",100,"LOGJ711211E25","LOGJ711211HGTMVN07","JUAN LOMAS GUEVARA",3,16,1130,3102,"00",28,"PB",16,280098,3,null,20150101,20150331,13192.73,0]
[null,"GUANAJUATO","11DPT0013V",120,"AAMT550321C79","AAMT550321MGTLRR02","MARIA TERESA ALVAREZ MARES",3,19,1130,3102,"03","02","PB",19,100003,3,null,20150101,20150331,13192.73,0]
[null,"GUANAJUATO","11DPT0002P",100,"HERD520203ADO","HERD520203MSLRSB04","DEBORA HERN RUSSEL",3,18,1130,3102,"00",29,"PA",18,290038,3,null,20150101,20150331,13009.439999999999,0]
[null,"GUANAJUATO","11DPT0012W",100,"PEQP6003137R3","PEQP600313MQTRNT01","PATRICIA ANTONIA PEREZ  QUINTERO ",3,20,1130,3102,"04","02","PC",20,27030,3,null,20150101,20150331,12898.5,0]
[null,"GUANAJUATO","11DPT0007K",120,"GUHR661007QW0","GUHR661007MGTTRC18","ROCIO DEL ROSARIO GUTIERREZ HERNANDEZ",3,20,1130,3102,"02","03","PC",20,203038,3,null,20150101,20150331,12898.5,0]
[null,"GUANAJUATO","11DPT0005M",120,"RAAL791208PR9","RAAL791208MGTZNL07","LILIA CONCEPCION RAZO ANGELES",3,12,1130,3102,"00",72,"PC",12,1130,3,null,20150101,20150331,12842.810000000001,0]
[null,"GUANAJUATO","11DPT0007K",120,"MESM670501FH5","MESM670501HDFNGR03","MARCO ALFREDO MENDOZA SEGURA",3,20,1130,3102,"02","03","PA",20,203057,3,null,20150101,20150331,12753.79,0]
[null,"GUANAJUATO","11DPT0012W",100,"ZARI821025R29","ZARI821025MGTRBG09","MARIA IGNACIA ZARAZUA  RUBIO ",3,20,1130,3102,"04","02","PB",20,27054,3,null,20150101,20150331,12571.880000000001,0]
[null,"GUANAJUATO","11DPT0006L",100,"COPG691022N6A","COPG691022MGTNRD08","MA GUADALUPE CONTRERAS PEREZ",3,16,11163,3102,"01",63,"PC",16,163011,3,null,20150101,20150331,12556.16,0]
[null,"GUANAJUATO","11DPT0007K",120,"IAMJ700913223","IAMJ700913HGTBLS01","JOSE DE JESUS IBARRA MELENDEZ",3,16,1130,3102,"02","03","PC",16,203130,3,null,20150101,20150331,12556.16,0]
[null,"GUANAJUATO","11DPT0002P",120,"CARS710511U36","CARS710511HGTMNR10","SERGIO ARTURO CAMPOS RANGEL",3,18,1130,3102,"00",29,"PA",18,290006,3,null,20150101,20150331,12490.51,0]
[null,"GUANAJUATO","11DPT0010Y",120,"QUOG780110GB9","QUOG780110HGTNRN00","GONZALO  QUINTANA  ORTEGA ",3,19,1130,3102,"02","04","PA",19,204005,3,null,20150101,20150331,12160.04,0]
[null,"GUANAJUATO","11DPT0010Y",100,"FIOM790619I13","FIOM790619HDFLRH07","MAHY ROLANDO FILOMENO ORTIZ",3,15,1130,3102,"02","04","PB",15,204017,3,null,20150101,20150331,12106.26,0]
[null,"GUANAJUATO","11DPT0001Q",100,"MOPL8106219G5","MOPL810621MGTRLD07","LIDIA MORENO PALOALTO",3,15,1130,3102,"00",28,"PB",15,280055,3,null,20150101,20150331,12106.25,0]
[null,"GUANAJUATO","11DPT0006L",100,"VAAJ751004U60","VAAJ751004MGTLRN04","JUANA YANET VALDEZ ARGUELLO",3,14,1130,3102,"01",63,"PC",14,163048,3,null,20150101,20150331,12038.6,0]
[null,"GUANAJUATO","11DPT0008J",120,"DEGJ790106AH3","DEGJ790106HGTLRR08","JORGE ALBERTO DELGADO GUERRERO",3,20,1130,3102,"02",33,"PC",20,523310,3,null,20150101,20150331,11644.490000000002,0]
[null,"GUANAJUATO","11DPT0008J",120,"GOPA710319IB0","GOPA710319HGTNRD02","ADAN ALEJANDRO GONZALEZ PRESA",3,25,1130,3102,"02",33,"PC",25,523320,3,null,20150101,20150331,11644.490000000002,0]
[null,"GUANAJUATO","11DPT0008J",120,"OOSJ630117DK1","OOSJ630117HGTRNN00","JUAN MANUEL OROPEZA SANCHEZ",3,25,1130,3102,"02",33,"PC",25,523339,3,null,20150101,20150331,11644.490000000002,0]
[null,"GUANAJUATO","11DPT0002P",120,"MAPP7311016D0","MAPP731101MJCRRR02","PERLA ANDREA MARTINEZ PEREZ",3,15,1130,3102,"00",29,"PB",15,290050,3,null,20150101,20150331,11640.630000000001,0]
[null,"GUANAJUATO","11DPT0007K",120,"GUHM640516HF8","GUHM640516MGTTRR04","MARTHA GUTIERREZ HERNANDEZ",3,20,1130,3102,"02","03","PC",20,203037,3,null,20150101,20150331,11608.66,0]
[null,"GUANAJUATO","11DPT0008J",120,"HEFJ700120711","HEFG700120HGTRSD12","J. GUADALUPE HERNANDEZ FISCAL",3,24,1130,3102,"02",33,"PC",24,523324,3,null,20150101,20150331,11429.51,0]
[null,"GUANAJUATO","11DPT0008J",120,"RONE740321QJ6","RONE740321MGTJTS01","MARIA ESTHER ROJAS NIETO",3,24,1130,3102,"02",33,"PC",24,523348,3,null,20150101,20150331,11429.51,0]
[null,"GUANAJUATO","11DPT0002P",100,"AUGJ550312251","AUJG550312HGTGTR07","JORGE AGUILERA GUTIERREZ",3,20,1130,3102,"00",29,"PB",20,290002,3,null,20150101,20150331,11423.35,0]
[null,"GUANAJUATO","11DPT0012W",120,"COVI910507TA9","COVI910507MQTNRT08","ITZMALSI GUADALUPE CONTRERAS VARGAS",3,28,1130,3102,"04","02","PA",28,270115,3,null,20150101,20150331,11347,0]
[null,"GUANAJUATO","11DPT0001Q",100,"COMM610831NKA","COMM610831HDFRRG06","MIGUEL CORTES MORALES",3,20,1130,3102,"00",28,"PB",20,280016,3,null,20150101,20150331,11324.83,0]
[null,"GUANAJUATO","11DPT0002P",100,"GUPG670506661","GUPG670506HGTTLS06","GUSTAVO GUTIERREZ PELAGIO",3,18,1130,3102,"00",29,"PB",18,290037,3,null,20150101,20150331,11206.029999999999,0]
[null,"GUANAJUATO","11DPT0001Q",120,"NUHG820619JC1","NUHG820619MGTXRR08","GRACIELA GUADALUPE NUÑEZ HERNANDEZ",3,15,1130,3102,"00",28,"PA",15,280146,3,null,20150101,20150331,11186.470000000001,0]
[null,"GUANAJUATO","11DPT0002P",100,"EUGC810902JNA","EUGC810902HGTSZS09","CESAR JAVIER ESQUIVEL GUZMAN",3,15,1130,3102,"00",29,"PB",15,290027,3,null,20150101,20150331,11175,0]
[null,"GUANAJUATO","11DPT0002P",100,"HEGV820527FN1","HEGV820527MGTRRR00","VERONICA HERNANDEZ GARCIA",3,15,1130,3102,"00",29,"PB",15,290039,3,null,20150101,20150331,11175,0]
[null,"GUANAJUATO","11DPT0010Y",100,"MEMV791203112","MEVM791203HGTDZR15","MARIO MEDINA VÁZQUEZ",3,15,1130,3102,"02","04","PB",15,204038,3,null,20150101,20150331,11175,0]
[null,"GUANAJUATO","11DPT0002P",100,"MASS590809U18","MASS590809HGTRTL08","SALVADOR MARTINEZ SOTO",3,19,1130,3102,"00",29,"TA",19,290052,3,null,20150101,20150331,11032.759999999998,0]
[null,"GUANAJUATO","11DPT0014U",100,"EAGL600822HR9","EAGL600822HGTSNR08","LORENZO PABLO ESTRADA GONZALEZ",3,20,1130,3102,"03","03","TA",20,303009,3,null,20150101,20150331,10964.25,0]
[null,"GUANAJUATO","11DPT0013V",120,"CAMJ670419324","CAMJ670419HGTRRS00","JOSE DE JESUS CARRILLO MARTINEZ",3,20,1130,3102,"03","02","PC",20,100005,3,null,20150101,20150331,10892.05,0]
[null,"GUANAJUATO","11DPT0007K",120,"MAMX651202NJ5","MXME651202MGTTEV07","EVA MATA MARTINEZ",3,20,1130,3102,"02","03","PC",20,203188,3,null,20150101,20150331,10892.05,0]
[null,"GUANAJUATO","11DPT0013V",120,"HERA790726J96","HERA790726MGTRMN07","ANA VERONICA HERNANDEZ RAMIREZ",3,18,1130,3102,"03","02","PA",18,100009,3,null,20150101,20150331,10855.009999999998,0]
[null,"GUANAJUATO","11DPT0014U",100,"CAPD830504746","CAPD830504HGTRTG05","DIEGO FELIPE CARDENAS  PATIÑO",3,30,1130,3102,"03","03","PB",30,303001,3,null,20150101,20150331,10802.5,0]
[null,"GUANAJUATO","11DPT0001Q",100,"GUJE600723CI3","GUJE600723HGTZMR03","ERNESTO GUZMAN JIMENEZ",3,20,1130,3102,"00",28,"PC",20,280038,3,null,20150101,20150331,10782.35,0]
[null,"GUANAJUATO","11DPT0006L",100,"AERJ730331GZ5","AERJ730331HGTRMN05","JUAN CARLOS ARREOLA ROMERO",3,12,1130,3102,"01",63,"PA",12,163004,3,null,20150101,20150331,10775.6,0]
[null,"GUANAJUATO","11DPT0001Q",120,"MEHE811224IH7","MEHE811224HGTNRM08","EMMANUEL MENDOZA HERNANDEZ",3,12,1130,3102,"00",28,"PB",12,280148,3,null,20150101,20150331,10722.71,0]
[null,"GUANAJUATO","11DPT0007K",120,"TIEA7005021TA","TIEA700502MDFHSN02"," ANGELICA THIRION ESCUDER  ",3,15,1130,3102,"02","03","PC",15,203085,3,null,20150101,20150331,10712.94,0]
[null,"GUANAJUATO","11DPT0002P",120,"RURA710611JV5","RURA710611HDFZML07","ALEJANDRO RUIZ RAMIREZ",3,17,1130,3102,"00",29,"PB",17,290065,3,null,20150101,20150331,10678.35,0]
[null,"GUANAJUATO","11DPT0012W",100,"RANS8002268Z7","RASN800226HGTNRS07","NESTOR  RANGEL  SUAREZ ",3,20,1130,3102,"04","02","TA",20,270035,3,null,20150101,20150331,10619.09,0]
[null,"GUANAJUATO","11DPT0002P",120,"AUCL821209DC6","AUCL821209MVZRRT05","LETICIA CAROLINA ARGUELLES CRUZ",3,20,1130,3102,"00",29,"PA",20,290094,3,null,20150101,20150331,10606.4,0]
[null,"GUANAJUATO","11DPT0008J",120,"MAMG691216UYA","MAMG691216HGTRRD04","JOSE GUADALUPE RAUL MARTINEZ MORENO",3,20,1130,3102,"02",33,"PA",20,523335,3,null,20150101,20150331,10495.93,0]
[null,"GUANAJUATO","11DPT0001Q",100,"CAPJ680119DJ7","CAPJ680119HGTZTN01","J. ANDRES CAZARES PATIÑO",3,18,1130,3102,"00",28,"PB",18,280011,3,null,20150101,20150331,10461.029999999999,0]
[null,"GUANAJUATO","11DPT0009I",100,"MEAA781114FWA","MEAA781114MGTDRD01","ADRIANA MEDEL ARROYO",3,15,1130,3102,"01",74,"PA",15,740021,3,null,20150101,20150331,10357.85,0]
[null,"GUANAJUATO","11DPT0008J",120,"RAFB620409PS9","RAFB620409MNLMNL08","BLANCA ESTHELA RAMOS FUENTES",3,20,1130,3102,"02",33,"PC",20,523342,3,null,20150101,20150331,10318.799999999999,0]
[null,"GUANAJUATO","11DPT0008J",120,"ROJL7510077S9","ROJL751007MGTJMR17","LAURA MARICELA ROJAS JIMENEZ",3,20,1130,3102,"02",33,"PC",20,523347,3,null,20150101,20150331,10318.799999999999,0]
[null,"GUANAJUATO","11DPT0013V",120,"COML571122DD6","COML571122MGTRRT18","LETICIA CORNEJO MARTINEZ",3,9,1130,3102,"03","02","PC",9,100006,3,null,20150101,20150331,10318.799999999999,0]
[null,"GUANAJUATO","11DPT0007K",120,"GULM751128QC4","GULM751128HGTRNR07","MARIO DE JESUS GUERRERO LUNA",3,17,1130,3102,"02","03","PC",17,203035,3,null,20150101,20150331,10259.24,0]
[null,"GUANAJUATO","11DPT0005M",120,"CUGV730427G51","CUGV730427HGTLMC00","VICTOR MANUEL CUELLAR GOMEZ",3,20,1130,3102,"00",72,"PB",20,1130,3,null,20150101,20150331,10243.75,0]
[null,"GUANAJUATO","11DPT0007K",120,"ROFL880718AL5","ROFL880718MGTDLR00","LAURA VIRIDIANA RODRIGUEZ FLORES",3,11,1130,3102,"02","03","PA",11,203168,3,null,20150101,20150331,10212.689999999999,0]
[null,"GUANAJUATO","11DPT0008J",120,"MACD620420JFA","MACD620420HGTRRV07","DAVID MARTINEZ CURTIDOR",3,24,1130,3102,"02",33,"PC",24,523334,3,null,20150101,20150331,10151.73,0]
[null,"GUANAJUATO","11DPT0010Y",100,"HERE800329V17","HERE800329HGTRDD03","EDGAR IVÁN HERNÁNDEZ RODRÍGUEZ",3,16,1130,3102,"02","04","PB",16,204025,3,null,20150101,20150331,9984.66,0]
[null,"GUANAJUATO","11DPT0001Q",100,"RAGM860115N6A","RAGM860115HGTMRR00","MAURO RAMIREZ GARCIA",3,26,1130,3102,"00",28,"PA",26,280063,3,null,20150101,20150331,9984.66,0]
[null,"GUANAJUATO","11DPT0001Q",100,"RALG600418P69","RALG600418MGTMPD09","MARIA GUADALUPE RAMOS LOPEZ",3,20,1130,3102,"00",28,"PC",20,280068,3,null,20150101,20150331,9984.66,0]
[null,"GUANAJUATO","11DPT0006L",100,"RORM6503108B9","RORM650310MGTSDL03","MILAGROS ROSAS RODRIGUEZ",3,18,1130,3102,"01",63,"PA",18,163040,3,null,20150101,20150331,9984.66,0]
[null,"GUANAJUATO","11DPT0005M",120,"MARJ690613N97","MARJ690613HGTGYN00","JUAN MIGUEL MAGAÑA  RAYA",3,17,1130,3102,"00",72,"PA",17,1130,3,null,20150101,20150331,9950.36,0]
[null,"GUANAJUATO","11DPT0006L",100,"VESJ58011884A","VESJ580118HGTGNN01","JUAN CARLOS VEGA SANCHEZ",3,15,1130,3102,"01",63,"PA",15,163055,3,null,20150101,20150331,9943.52,0]
[null,"GUANAJUATO","11DPT0011X",100,"GAMA5108287F5","GAMA510828HGTRR609","AGUSTIN  GARDIAZABAL  MORALES ",3,18,1130,3102,"02",49,"PC",18,249024,3,null,20150101,20150331,9936.76,0]
[null,"GUANAJUATO","11DPT0009I",100,"AACN800319VC6","AACN800319MGTYRY15","NAYELI DE JESUS AYALA CARRERA",3,20,1130,3102,"01",74,"PB",20,740004,3,null,20150101,20150331,9933.35,0]
[null,"GUANAJUATO","11DPT0002P",120,"COMI550105UFA","COMI550105MVZRRS01","MARIA ISABEL CORTES MARTINEZ",3,20,1130,3102,"00",29,"PB",20,290018,3,null,20150101,20150331,9933.35,0]
[null,"GUANAJUATO","11DPT0001Q",100,"GULA760327G74","GULA760327MCSLPN05","ANA CELIA GUILLEN LOPEZ",3,18,1130,3102,"00",28,"PB",18,280035,3,null,20150101,20150331,9882.5,0]
[null,"GUANAJUATO","11DPT0003O",120,"LOJA720726KJ9","LOJA720726MGTPMN03","ANA CRISTINA LOPEZ JIMENEZ",3,18,1210,3102,"00",30,"PC",18,28,3,null,20150101,20150331,9781.39,0]
[null,"GUANAJUATO","11DPT0002P",100,"RIMA811003E55","RIMA811003MGTVRN05","ANA PAOLA RIVADENEYRA MARTINEZ",3,18,1130,3102,"00",29,"PA",18,290062,3,null,20150101,20150331,9777.7800000000007,0]
[null,"GUANAJUATO","11DPT0007K",120,"MOVJ75111289A","MOVJ751112HJCRRR01","JORGE ARMANDO MORALES VARGAS",3,8,1130,3102,"02","03","PC",8,203060,3,null,20150101,20150331,9775.7899999999991,0]
[null,"GUANAJUATO","11DPT0002P",120,"CECE690308KZ9","CECE690308HGTRRL05","ELIAS CERVANTES CRUZ",3,19,1130,3102,"00",29,"TA",19,29011,3,null,20150101,20150331,9758.7800000000007,0]
[null,"GUANAJUATO","11DPT0007K",120,"OIMD8504181Z5","OIMD850418MGTLRN00","DIANA OLIVA MORENO",3,20,1130,3102,"02","03","PB",20,203065,3,null,20150101,20150331,9685,0]
[null,"GUANAJUATO","11DPT0014U",100,"AACJ6404113K8","AACJ640411HGTNBV01","JAVIER ANDRADE CIBRIAN",3,24,1130,3102,"03","03","PB",24,303005,3,null,20150101,20150331,9685,0]
[null,"GUANAJUATO","11DPT0010Y",120,"DIRS7905261S6","DIRS790526MJCZVR00","SAIRA  ESTHER DIAZ RIVERA",3,24,1130,3102,"02","04","PA",24,204009,3,null,20150101,20150331,9632.630000000001,0]
[null,"GUANAJUATO","11DPT0005M",120,"MABG7804019Z5","MABG780401MGTCRL00","GLORIA ELENA MACIEL  BARAJAS",3,20,1130,3102,"00",72,"PB",20,1130,3,null,20150101,20150331,9591.880000000001,0]
[null,"GUANAJUATO","11DPT0008J",120,"GOVA7403201E8","GOVA740320HGTMLR06","JOSE ARMANDO GOMEZ VALENCIA",3,21,1130,3102,"02",33,"PA",21,523366,3,null,20150101,20150331,9584.43,0]
[null,"GUANAJUATO","11DPT0011X",100,"PACM790918HT8","PACM790918HGTNRR13","MAURICIO  PANIAGUA  CARRILLO ",3,14,1130,3102,"02",49,"PC",14,249040,3,null,20150101,20150331,9530.58,0]
[null,"GUANAJUATO","11DPT0006L",100,"EIME671030L39","EIME671030HGTSRD00","EDUARDO ESPINO MIRANDA",3,18,1130,3102,"01",63,"PC",18,163014,3,null,20150101,20150331,9506.8100000000013,0]
[null,"GUANAJUATO","11DPT0010Y",100,"AOOV770724DZ8","AOOV770724MGTRRR09","VERONICA ARZOLA ORTEGA",3,12,1130,3102,"02","04","PA",12,204008,3,null,20150101,20150331,9451.32,0]
[null,"GUANAJUATO","11DPT0012W",100,"MUIM8412058X9","MUIM841205MQTXBR03","MARIANA MUÑOZ IBARRA",3,20,1130,3102,"04","02","PB",20,270020,3,null,20150101,20150331,9312.5,0]
[null,"GUANAJUATO","11DPT0007K",120,"NAGM7308014C0","NAGM730801MGTJZR05"," MARCELA NAJERA GUZMAN ",3,19,1130,3102,"02","03","PB",19,203064,3,null,20150101,20150331,9312.5,0]
[null,"GUANAJUATO","11DPT0002P",120,"FORA850413INA","FORA850413HGTLZL09","ALBERTO FLORES RAZO",3,17,1130,3102,"00",29,"PB",17,290082,3,null,20150101,20150331,9312.5,0]
[null,"GUANAJUATO","11DPT0005M",120,"DIGJ5805018S3","DIGJ580501HGTZTR09","JORGE DIAZ GUTIERREZ",3,20,1130,3102,"00",72,"PB",20,1130,3,null,20150101,20150331,9126.25,0]
[null,"GUANAJUATO","11DPT0012W",120,"PEGR750725A34","PEGR750725HDFRTC00","RICARDO PEREZ GUTIERREZ",3,15,1130,3102,"04","02","PA",15,270011,3,null,20150101,20150331,9016.9,0]
[null,"GUANAJUATO","11DPT0011X",100,"TOCR790420PZ9","TOCR790420HGTRRB01","RUBEN  TORRES  CARMONA ",3,20,1130,3102,"02",49,"PA",20,249053,3,null,20150101,20150331,8976.7900000000009,0]
[null,"GUANAJUATO","11DPT0011X",100,"NARV8007097C1","NARV800709HGTVQC06","VICTOR MANUEL  NAVARRO  ROQUE ",3,20,1130,3102,"02",49,"TA",20,249038,3,null,20150101,20150331,8971.93,0]
[null,"GUANAJUATO","11DPT0012W",120,"PARB8612287J6","PARB861228MGTCDR09","BARBARA PALOMA PACHECO  RODRIGUEZ",3,20,1130,3102,"04","02","PB",20,27027,3,null,20150101,20150331,8940,0]
[null,"GUANAJUATO","11DPT0005M",120,"CACR540413CR4","CACR540413HBCSSL00","RAUL CASTAÑEDA CASTRO",3,20,1130,3102,"00",72,"PB",20,1130,3,null,20150101,20150331,8940,0]
[null,"GUANAJUATO","11DPT0007K",120,"GOOE760928BN1","GOOE760928HGTMRN01","ENRIQUE ALEJANDRO GOMEZ OROPEZA",3,14,1130,3102,"02","03","PC",14,203160,3,null,20150101,20150331,8813.98,0]
[null,"GUANAJUATO","11DPT0012W",120,"MEGR720113GQ8","MEGR720113HMNRNM02","RAMIRO MERCADO  GONZALEZ",3,10,1130,3102,"04","02","PB",10,27018,3,null,20150101,20150331,8691.7000000000007,0]
[null,"GUANAJUATO","11DPT0001Q",120,"ZAVJ481005MS5","ZAVJ481005HGTVLS09","JOSE DE JESUS ZAVALA VILLAGOMEZ",3,22,1130,3102,"00",28,"PA",22,280166,3,null,20150101,20150331,8638.2799999999988,0]
[null,"GUANAJUATO","11DPT0001Q",100,"LAML7310086Z6","LAML731008MGTRNR00","LAURA LARA MANCERA",3,15,1130,3102,"00",28,"PC",15,280044,3,null,20150101,20150331,8599,0]
[null,"GUANAJUATO","11DPT0002P",100,"HERA5904202S0","HERA590420HGTRSN04","JOSE ANTONIO HERRERA  ROSALES",3,11,1130,3102,"00",29,"PB",11,290076,3,null,20150101,20150331,8416.4699999999993,0]
[null,"GUANAJUATO","11DPT0011X",100,"MAST560810KJ7","MAST560810HGTRNR00","J. TRINIDAD  MARTINEZ  SANCHEZ ",3,15,1130,3102,"02",49,"PA",15,249032,3,null,20150101,20150331,8286.26,0]
[null,"GUANAJUATO","11DPT0009I",100,"GOAJ7711065Z5","GOAJ771106HGTNLN00","JUAN PABLO GONZALEZ ALVARADO",3,19,1130,3102,"01",74,"TA",19,740014,3,null,20150101,20150331,8257.26,0]
[null,"GUANAJUATO","11DPT0007K",120,"GOPS6802087F1","GOPS680208HGTNDN00","SANTIAGO GONZALEZ PADILLA",3,15,1130,3102,"02","03","PC",15,203034,3,null,20150101,20150331,8216.9599999999991,0]
[null,"GUANAJUATO","11DPT0011X",100,"SACF740918BK7","SACF740918HJCNML11","FELIX SANCHEZ CAMPOS",3,12,1130,3102,"02",49,"TA",12,249029,3,null,20150101,20150331,8199.52,0]
[null,"GUANAJUATO","11DPT0001Q",100,"CARL560630141","CARL560630HGTSVS09","JOSE LUIS CASTRO RIVAS",3,19,1130,3102,"00",28,"PB",19,280010,3,null,20150101,20150331,8195,0]
[null,"GUANAJUATO","11DPT0009I",100,"AAVL730510P19","AAVL730510MGTYLR00","LAURA ELENA AYALA VALTIERRA",3,20,1130,3102,"01",74,"PB",20,740024,3,null,20150101,20150331,8070.85,0]
[null,"GUANAJUATO","11DPT0005M",120,"BAGA680215FI6","BAGA680215HDFRDD03","ADRIAN BRAVO GUADARRAMA",3,20,1130,3102,"00",72,"PB",20,1130,3,null,20150101,20150331,8070.85,0]
[null,"GUANAJUATO","11DPT0008J",120,"EIGG680608R24","EIGG680608HGTSNR01","GERARDO ESPITIA GONZALEZ",3,20,1130,3102,"02",33,"PB",20,523313,3,null,20150101,20150331,8070.85,0]
[null,"GUANAJUATO","11DPT0009I",100,"SAPR691204HS9","SAPR691204MGTNRS09","ROSA ELIA SANDOVAL PRADO",3,20,1130,3102,"01",74,"PB",20,740035,3,null,20150101,20150331,8070.85,0]
[null,"GUANAJUATO","11DPT0012W",120,"PEGA8608144V9","PEGA860814MGTRTD07","MARIA AIDA PEREZ  GUTIERREZ ",3,20,1130,3102,"04","02","PA",20,27029,3,null,20150101,20150331,8010.0599999999995,0]
[null,"GUANAJUATO","11DPT0009I",100,"MALS720215M37","MALS720215MGTRPR06","SARA MARTINEZ LOPEZ",3,18,1130,3102,"01",74,"PB",18,740020,3,null,20150101,20150331,8008.75,0]
[null,"GUANAJUATO","11DPT0012W",120,"MESL721106M79","MESL721106HMCNNC01","LUCIANO MENDOZA SANCHEZ",3,15,1130,3102,"04","02","PA",15,270163,3,null,20150101,20150331,7871.97,0]
[null,"GUANAJUATO","11DPT0002P",100,"DARE870421E95","DARE870421MGTMDD0","EDUARDINA ESAIG DAMIAN  RODRIGUEZ",3,18,1130,3102,"00",29,"PB",18,"b",3,null,20150101,20150331,7822.5,0]
[null,"GUANAJUATO","11DPT0001Q",100,"RECT770406EE9","RECT770406MMNNHR04","TERESITA DEL NIÑO JESUS RENTERIA CHAVEZ",3,16,1130,3102,"00",28,"PA",16,280069,3,null,20150101,20150331,7733.86,0]
[null,"GUANAJUATO","11DPT0010Y",100,"AURJ751104NX7","AURJ751104HGTGDN09","JUAN CARLOS  AGUIRRE RODRÌGUEZ",3,19,1130,3102,"02","04","PB",19,204002,3,null,20150101,20150331,7667.28,0]
[null,"GUANAJUATO","11DPT0012W",120,"GORC720101Q12","GORC720101MMNNBR04","CRISTINA GONZALEZ ROBLES",3,19,1130,3102,"04","02","TA",19,270178,3,null,20150101,20150331,7607.16,0]
[null,"GUANAJUATO","11DPT0010Y",100,"PEGO840715TW6","PEGO840715MGTRRL04","OLGA CRISTINA  PEREZ GUERRERO",3,9,1130,3102,"02","04","PB",9,204049,3,null,20150101,20150331,7554.4400000000005,0]
[null,"GUANAJUATO","11DPT0008J",120,"GACP660324G26","GACP660324HGTLPD03","PEDRO GALVEZ CAPORAL",3,21,1130,3102,"02",33,"PA",21,523316,3,null,20150101,20150331,7540.51,0]
[null,"GUANAJUATO","11DPT0009I",100,"MOCM7012151Q9","MOCM701215MGTRNN01","MANUELA MORALES CENDEJAS",3,10,1130,3102,"01",74,"PC",10,740025,3,null,20150101,20150331,7519.1100000000006,0]
[null,"GUANAJUATO","11DPT0007K",120,"MEZJ750302AC9","MEZJ750302HGTNPR00","JORGE MENDOZA ZAPATA",3,14,1130,3102,"02","03","PC",14,203152,3,null,20150101,20150331,7452.5499999999993,0]
[null,"GUANAJUATO","11DPT0010Y",100,"RAPB721103D6A","RAPB721103MMNMZT09","BEATRIZ EUGENIA RAMOS PAZ",3,15,1130,3102,"02","04","PC",15,204059,3,null,20150101,20150331,7452.45,0]
[null,"GUANAJUATO","11DPT0007K",120,"RUBS800124TR0","RUBS800124HGTZRL06","SAUL RUIZ BERBENA",3,12,1130,3102,"02","03","PC",12,203189,3,null,20150101,20150331,7452.45,0]
[null,"GUANAJUATO","11DPT0001Q",100,"DEPT800907TBA","DEPT800907MGTRDR04","MARIA TERESA DERRAMADERO PADILLA",3,12,1130,3102,"00",28,"PB",12,280017,3,null,20150101,20150331,7450,0]
[null,"GUANAJUATO","11DPT0010Y",120,"SOGC7802151Z2","SOGC780215MDFLRL01","CLAUDIA SOLACHE GARCÍA",3,15,1130,3102,"02","04","PB",15,204067,3,null,20150101,20150331,7450,0]
[null,"GUANAJUATO","11DPT0001Q",100,"AOOC650822A32","AOOC650822MGTRJR02","MA CRISTINA ARROYO OJEDA",3,20,1130,3102,"00",28,"PB",20,280005,3,null,20150101,20150331,7450,0]
[null,"GUANAJUATO","11DPT0008J",120,"AUME740716A41","AUME740716HPLGDN13","ENRIQUE AGUILAR MEDRANO",3,20,1130,3102,"02",33,"PA",20,523363,3,null,20150101,20150331,7374.78,0]
[null,"GUANAJUATO","11DPT0002P",120,"GUVG640807PZ4","GUVG640807MDFZRB04","GABRIELA GUIZAR VARGAS",3,8,1130,3102,"00",29,"PC",8,290036,3,null,20150101,20150331,7374.5599999999995,0]
[null,"GUANAJUATO","11DPT0012W",120,"MASA840303K12","MASA840303MDFRNN08","MARIA DE LOS ANGELES MARTINEZ SANCHEZ",3,12,1130,3102,"04","02","PA",12,270007,3,null,20150101,20150331,7369.6100000000006,0]
[null,"GUANAJUATO","11DPT0008J",120,"CUMJ850922E29","CUMJ850922MGTVRV00","JAVIERA MARIANA CUEVAS MIRELES",3,21,1130,3102,"02",33,"PA",21,523309,3,null,20150101,20150331,7291.9,0]
[null,"GUANAJUATO","11DPT0010Y",100,"RARM6206207M6","RARM620620HGTMDN03","MANUEL RAMÍREZ RODRÍGUEZ",3,12,1130,3102,"02","04","PA",12,204057,3,null,20150101,20150331,7281.58,0]
[null,"GUANAJUATO","11DPT0010Y",100,"ROGA700124964","ROGA700124MGTCZN09","ANA ELENA ROCHA GUZMÁN",3,15,1130,3102,"02","04","PB",15,204064,3,null,20150101,20150331,7251.61,0]
[null,"GUANAJUATO","11DPT0002P",120,"LARJ570720TF2","LARJ570720HGTGDR08","JORGE ARTURO LAGUNA RODIGUEZ",3,15,1130,3102,"00",29,"PC",15,290044,3,null,20150101,20150331,7201.68,0]
[null,"GUANAJUATO","11DPT0012W",120,"GARB840625CP8","GARB840625MQTLDR08","BRENDA LIDIA GALLEGOS RODRIGUEZ",3,15,1130,3102,"04","02","PA",15,27008,3,null,20150101,20150331,7181.43,0]
[null,"GUANAJUATO","11DPT0008J",120,"LOGS791206JH1","LOGS791206HGTPPR07","SERGIO LOPEZ GUAPO",3,20,1130,3102,"02",33,"PA",20,523331,3,null,20150101,20150331,7181.43,0]
[null,"GUANAJUATO","11DPT0002P",100,"MEMJ801218ND2","MEMJ801218HGTNRS09","JOSE DE JESUS MENDIOLA MARTINEZ",3,20,11029,3102,"00",29,"PA",20,290054,3,null,20150101,20150331,7181.43,0]
[null,"GUANAJUATO","11DPT0009I",100,"ROVA6201238U9","ROVA620123HGTDGL01","ALFONSO RODRIGUEZ VEGA",3,20,1130,3102,"01",74,"PA",20,740033,3,null,20150101,20150331,7181.43,0]
[null,"GUANAJUATO","11DPT0013V",120,"SECJ780511UPA","SECJ780511MGTRHN02","JUANA MARIA CONCEPCION SERRANO CHAGOYA",3,3,1130,3102,"03","02","PB",3,96,3,null,20150101,20150331,7181.43,0]
[null,"GUANAJUATO","11DPT0009I",100,"TOAB770225NZ9","TOAB770225MGTRRR00","BERENICE TORRES ARROYO",3,20,1130,3102,"01",74,"PA",20,740040,3,null,20150101,20150331,7181.43,0]
[null,"GUANAJUATO","11DPT0002P",120,"DEBY851217D4A","DEBJ851217MGTLLS09","JUSELY GUADALUPE DELGADO BELTRAN",3,17,1130,3102,"00",29,"PB",17,290139,3,null,20150101,20150331,7077.5,0]
[null,"GUANAJUATO","11DPT0002P",120,"EUQJ600614JNA","EUQJ600614HDFSRN05","JUAN MIGUEL ESQUIVEL QUIROZ",3,16,1130,3102,"00",29,"PB",16,290029,3,null,20150101,20150331,7077.5,0]
[null,"GUANAJUATO","11DPT0001Q",100,"VESA780412778","VESA780412MZSLNN00","ANGELICA MARIA VELAZCO SANDOVAL",3,18,1130,3102,"00",28,"PB",18,280087,3,null,20150101,20150331,7077.5,0]
[null,"GUANAJUATO","11DPT0002P",120,"CAHJ750812FB7","CAHJ750812HGTHRR09","JORGE ALEJANDRO CHAGOYA HERNANDEZ",3,10,1130,3102,"00",29,"PC",10,290012,3,null,20150101,20150331,7001.2800000000007,0]
[null,"GUANAJUATO","11DPT0007K",120,"TAGL820524R17","TAGL820524MGTPMZ06"," MARIA DE LA LUZ TAPIA GOMEZ     ",3,13,1130,3102,"02","03","PC",13,203084,3,null,20150101,20150331,6986.71,0]
[null,"GUANAJUATO","11DPT0007K",120,"RORL860709G29","RORL860709MGTDML06","LILIA BERENICE RODRIGUEZ RAMIREZ",3,10,1130,3102,"02","03","PA",10,203191,3,null,20150101,20150331,6972.51,0]
[null,"GUANAJUATO","11DPT0001Q",100,"ROSC730321AY9","ROSC730321HGTSLR07","JOSE CRUZ ROSALES SOLARZANO",3,20,1130,3102,"00",28,"PA",20,280076,3,null,20150101,20150331,6960.46,0]
[null,"GUANAJUATO","11DPT0009I",100,"TEAC711130CQ2","TEAC711130MGTJDL00","CLAUDIA ELENA TEJEDA ADAME",3,10,1130,3102,"01",74,"PC",10,740037,3,null,20150101,20150331,6948.4500000000007,0]
[null,"GUANAJUATO","11DPT0012W",120,"JAAM590516MH6","JAAM590516HGTMRN03","MANUEL JAIME ARELLANO",3,13,1130,3102,"04","02","PA",13,270001,3,null,20150101,20150331,6913.34,0]
[null,"GUANAJUATO","11DPT0010Y",100,"VESX850703GKA","VESX850703MGTLLC16","XOCHITL TOMASA VELÁZQUEZ SILVA",3,19,1130,3102,"02","04","PA",19,204071,3,null,20150101,20150331,6912.4499999999989,0]
[null,"GUANAJUATO","11DPT0002P",100,"MAST621028SCA","MAST621028MGTRTT12","MA TERESA MARTINEZ SOTO",3,18,1130,3102,"00",29,"PB",18,290051,3,null,20150101,20150331,6891.25,0]
[null,"GUANAJUATO","11DPT0010Y",100,"POAA7404163G8","POAA740416MDFRCN05","ANA LILIA PROA ACEVEDO",3,18,1130,3102,"02","04","PB",18,204053,3,null,20150101,20150331,6879.11,0]
[null,"GUANAJUATO","11DPT0007K",120,"DIVA711128CB2","DIVA711128MMCZGL03","ALEJANDRA DIAZ VEGA",3,16,1130,3102,"02","03","PB",16,203132,3,null,20150101,20150331,6860.23,0]
[null,"GUANAJUATO","11DPT0001Q",100,"CAVA820322S74","CAVA820322HDFHRB06","ABRAHAM CHAVEZ VARELA",3,22,1130,3102,"00",28,"PB",22,280013,3,null,20150101,20150331,6798.13,0]
[null,"GUANAJUATO","11DPT0001Q",120,"JIEC831030A73","JIEC831030MGTMSR07","MARIA CRISTHIAN JIMENEZ ESQUEDA",3,18,1130,3102,"00",28,"PA",18,280156,3,null,20150101,20150331,6794.73,0]
[null,"GUANAJUATO","11DPT0002P",100,"MOHT651003EA6","MOHT651003MGTRRR13","MA TERESA MORENO HERNANDEZ",3,17,1130,3102,"00",29,"TA",17,290055,3,null,20150101,20150331,6769.05,0]
[null,"GUANAJUATO","11DPT0011X",100,"MERA6410168B4","MERA641016HGTDZL14","ALEJANDRO MEDINA REZA",3,10,1130,3102,"02",49,"PC",10,249033,3,null,20150101,20150331,6637.95,0]
[null,"GUANAJUATO","11DPT0012W",120,"NOIG870606719","NOIG870606HMCGNS09","GUSTAVO NOGUEZ INIESTA",3,10,1130,3102,"04","02","PA",10,270165,3,null,20150101,20150331,6629.01,0]
[null,"GUANAJUATO","11DPT0006L",100,"COTR740102LT0","COTR740102MMCRRC00","ROCIO CORONA TIRADO",3,31,1130,3102,"01",63,"PA",31,163012,3,null,20150101,20150331,6629,0]
[null,"GUANAJUATO","11DPT0002P",100,"EAGA611030B76","EAGA611030HGTSTN01","ANTONIO MARTIN ESTRADA GUTIERREZ",3,17,1130,3102,"00",29,"PA",17,290029,3,null,20150101,20150331,6601.38,0]
[null,"GUANAJUATO","11DPT0010Y",120,"REBJ861120CG2","REBJ861120HGTYNN00","JUAN CARLOS REYNOSO BANDERAS",3,19,1130,3102,"02","04","PA",19,204010,3,null,20150101,20150331,6578.55,0]
[null,"GUANAJUATO","11DPT0001Q",120,"CABD840721MI3","CABD840721HGTSNN09","DANIEL CASIQUE BUENAVISTA",3,20,1130,3102,"00",28,"TA",20,28059,3,null,20150101,20150331,6537.11,0]
[null,"GUANAJUATO","11DPT0001Q",100,"PAEI8110081S7","PAEI811008MOCDSR01","IRMA LORENZ PADILLA ESCUDERO",3,16,1130,3102,"00",28,"PB",16,280126,3,null,20150101,20150331,6535.51,0]
[null,"GUANAJUATO","11DPT0007K",120,"MORB790906FV5","MORB790906MGTNSR05","BERTHA ALICIA MONJARAZ RIOS",3,10,1130,3102,"02","03","PC",10,203182,3,null,20150101,20150331,6480.08,0]
[null,"GUANAJUATO","11DPT0013V",120,"EILL500310BA8","EILL500310MDFLLL09","LILIA SUSANA ELIZALDE LLOPIS",3,15,1130,3102,"03","02","PB",15,117,3,null,20150101,20150331,6463.2800000000007,0]
[null,"GUANAJUATO","11DPT0007K",120,"VERA861220MM3","VERA861220MTLLML06","ALMA ROCIO VELA ROMERO",3,15,1130,3102,"02","03","TA",15,203213,3,null,20150101,20150331,6370.41,0]
[null,"GUANAJUATO","11DPT0005M",120,"ROLM821117536","ROLM821117HGTDPN05","MANUEL CHRISTIAN JARED RODRIGUEZ  LOPEZ",3,18,1130,3102,"00",72,"PB",18,1130,3,null,20150101,20150331,6332.5,0]
[null,"GUANAJUATO","11DPT0006L",100,"LOHE8811064TA","LOHE881106MJCPRD00","EDITH LOPEZ HERNANDEZ",3,11,1130,3102,"01",63,"TA",11,163067,3,null,20150101,20150331,6283.68,0]
[null,"GUANAJUATO","11DPT0007K",120,"EOTJ551129MU2","EOTS551129HGTSPT10"," J. SATURNINO ESCOTO TAPIA",3,10,1130,3102,"02","03","PC",10,203026,3,null,20150101,20150331,6221.49,0]
[null,"GUANAJUATO","11DPT0014U",100,"EALA741207MR5","EALA741207MGTSND01","ADRIANA ESCAMILLA  LUNA",3,30,1130,3102,"03","03","PA",30,303008,3,null,20150101,20150331,6187.08,0]
[null,"GUANAJUATO","11DPT0010Y",120,"LOJL93033086","LOJL930330HGTPMS07","LUIS ANGEL LOPEZ JIMENEZ",3,14,1130,3102,"02","04","PA",14,204010,3,null,20150101,20150331,6134.0899999999992,0]
[null,"GUANAJUATO","11DPT0010Y",120,"GOHV780329HP0","GOHV780329MGTNRR00","VERÓNICA GONZÁLEZ HERNÁNDEZ",3,15,1130,3102,"02","04","PB",15,204022,3,null,20150101,20150331,6053.13,0]
[null,"GUANAJUATO","11DPT0010Y",120,"CAGG7503244Z4","CAGG750324MGTBTB00","GABRIELA DEL CARMEN CABRERA GUTIÉRREZ",3,15,1130,3102,"02","04","PB",15,204010,3,null,20150101,20150331,6053.13,0]
[null,"GUANAJUATO","11DPT0002P",120,"EIVJ6412112B7","EIVJ641211HGTLLN00","JUAN CARLOS ELIZARRARAZ VILLALPANDO",3,18,1130,3102,"00",29,"PC",18,290026,3,null,20150101,20150331,6019.3,0]
[null,"GUANAJUATO","11DPT0012W",120,"HELM570929SP5","HELM570929HQTRRG04","MIGUEL HERNANDEZ LIRA",3,12,1130,3102,"04","02","PA",12,270001,3,null,20150101,20150331,5997.54,0]
[null,"GUANAJUATO","11DPT0002P",120,"JAOP740625985","JAOP740625MGTMLT05","PATRICIA JAIME  OLVERA",3,18,1130,3102,"00",29,"PA",18,290111,3,null,20150101,20150331,5966.1,0]
[null,"GUANAJUATO","11DPT0006L",100,"VEGJ690320CV6","VEGJ690320HGTGNN02","JUAN ANTONIO VEGA GONZALEZ",3,22,1130,3102,"01",63,"PA",22,163054,3,null,20150101,20150331,5966.1,0]
[null,"GUANAJUATO","11DPT0010Y",100,"RACM561219L8A","RACM561219HGTMNR07","MARIO RAMÍREZ CONTRERAS",3,5,1130,3102,"02","04","PB",5,204056,3,null,20150101,20150331,5937.57,0]
[null,"GUANAJUATO","11DPT0010Y",100,"MAVR720809AXA","MAVR720809MGTNZS05","ROSA BEATRIZ MANJARREZ VAZQUEZ",3,6,1130,3102,"02","04","PC",6,204033,3,null,20150101,20150331,5902.3,0]
[null,"GUANAJUATO","11DPT0002P",100,"HEGJ8007282N5","HEGJ800728MGTRTN07","JANETH HERNANDEZ GUTIERREZ",3,12,1130,3102,"00",29,"PA",12,290084,3,null,20150101,20150331,5712.35,0]
[null,"GUANAJUATO","11DPT0012W",120,"SAVD840330123","SAVD840330MCLLGL06","DULCE IRENE SALINAS VEGA",3,12,1130,3102,"04","02","PA",12,270014,3,null,20150101,20150331,5712.35,0]
[null,"GUANAJUATO","11DPT0012W",120,"ZARJ781201E25","ZARJ781201HGTRNS07","JESUS ZARAZUA RANGEL",3,20,1130,3102,"04","02","PA",20,270010,3,null,20150101,20150331,5712.35,0]
[null,"GUANAJUATO","11DPT0013V",20,"RAEM750806613","RAEM750806MDFMLN07","MONICA MARCELA RAMIREZ ELIZALDE",3,18,1130,3102,"03","02","PB",18,100014,3,null,20150101,20150331,5668,0]
[null,"GUANAJUATO","11DPT0008J",120,"LOVV821208K16","LOVV821208HGTPZC03","VICTOR HUGO LOPEZ VAZQUEZ",3,17,1130,3102,"02",33,"PA",17,523332,3,null,20150101,20150331,5634.66,0]
[null,"GUANAJUATO","11DPT0010Y",100,"NETN640509LW1","NETN640509MNLRRR02","NORA MERCEDES NEIRA TORRES",3,9,1130,3102,"02","04","PB",9,204045,3,null,20150101,20150331,5626.8600000000006,0]
[null,"GUANAJUATO","11DPT0002P",120,"OASF640805DW4","OASF640805HGTCTR00","FRANCISCO JAVIER OCAMPO SOTO",3,12,1130,3102,"00",29,"PC",12,290057,3,null,20150101,20150331,5589.35,0]
[null,"GUANAJUATO","11DPT0012W",120,"CACV851205PW0","CACV851205MQTRRR00","VERA CABELLO  CORONA",3,12,1130,3102,"04","02","PB",12,27005,3,null,20150101,20150331,5587.5,0]
[null,"GUANAJUATO","11DPT0002P",120,"CAMH790325MK6","CAMH790325HGTSSC09","HECTOR CASTRO MOSQUEDA",3,18,1130,3102,"00",29,"PB",18,290010,3,null,20150101,20150331,5587.5,0]
[null,"GUANAJUATO","11DPT0008J",120,"CIAV791109IT0","CIAV791109MGTRRR05","VERONICA CRISANTO ARRIAGA",3,18,1130,3102,"02",33,"PB",18,523308,3,null,20150101,20150331,5587.5,0]
[null,"GUANAJUATO","11DPT0002P",100,"COAA820127CJ8","COAA820127MGTRYN00","ANA ERICKA CORRALES AYALA",3,15,1130,3102,"00",29,"PB",15,290016,3,null,20150101,20150331,5587.5,0]
[null,"GUANAJUATO","11DPT0005M",120,"GABM731224PP4","GABM731224HGTRLG09","MIGUEL ANGEL GARCIA BELTRAN",3,15,1130,3102,"00",72,"PC",15,1130,3,null,20150101,20150331,5426.19,0]
[null,"GUANAJUATO","11DPT0002P",100,"GAMM750120RB8","GANN750120MGTRSR08","MARTHA ELBA GARCIA MOSQUEDA",3,19,1130,3102,"00",29,"PB",19,290031,3,null,20150101,20150331,5401.25,0]
[null,"GUANAJUATO","11DPT0010Y",120,"LOVJ660127MI1","LOVJ660127HGTPLN03","JUAN LÓPEZ VALENCIA",3,18,1130,3102,"02","04","PB",18,204032,3,null,20150101,20150331,5401.25,0]
[null,"GUANAJUATO","11DPT0008J",120,"JULB700329347","JULB700329HGTRNN09","BENITO JUAREZ LEON",3,20,1130,3102,"02",33,"PB",20,523327,3,null,20150101,20150331,5389.11,0]
[null,"GUANAJUATO","11DPT0013V",120,"RIGM700422KM3","RIGM700422MGTVNG06","MA MAGDALENA RIVERA GONZALEZ",3,21,1130,3102,"03","02","PC",21,100015,3,null,20150101,20150331,5374.38,0]
[null,"GUANAJUATO","11DPT0012W",120,"AEDI770518OLA","AEDI770518HGTRRS01","ISRAEL ARMANDO ARREDONDO  DORANTES",3,20,1130,3102,"04","02","TA",20,27002,3,null,20150101,20150331,5325.74,0]
[null,"GUANAJUATO","11DPT0012W",120,"GOZV911104PZ4","GOZV911104HGTNMC06","VICTOR HUGO GONZALEZ ZAMUDIO",3,10,1130,3102,"04","02","TA",10,270011,3,null,20150101,20150331,5291.28,0]
[null,"GUANAJUATO","11DPT0007K",120,"GOOC7007237B8","GOOC700123MGTMRR07","MA. DEL CARMEN GOMEZ OROPEZA",3,20,1130,3102,"02","03","PC",20,203040,3,null,20150101,20150331,5266.91,0]
[null,"GUANAJUATO","11DPT0008J",120,"VALS820325LX7","VALS820325MGTLNL09","SILVIA NANCY VALADEZ LEON",3,18,1130,3102,"02",33,"PC",18,523355,3,null,20150101,20150331,5266.91,0]
[null,"GUANAJUATO","11DPT0007K",120,"RICE740107C14","RICE740107MGTVSR06","  ERIKA ADRIANA RIVERA CISNEROS   ",3,21,1130,3102,"02","03","PB",21,203072,3,null,20150101,20150331,5215,0]
[null,"GUANAJUATO","11DPT0001Q",100,"RICM661008713","RICM661008MGTSSR09","MARIBEL RIOS CASTRO",3,20,1130,3102,"00",28,"PB",20,280070,3,null,20150101,20150331,5215,0]
[null,"GUANAJUATO","11DPT0005M",120,"VIZM6610296H8","VIZM661029MMNLRN03","MONICA VILLAGOMEZ  ZARATE",3,20,1130,3102,"00",72,"PB",20,1130,3,null,20150101,20150331,5215,0]
[null,"GUANAJUATO","11DPT0002P",120,"RORA810803AE8","RORA810803HGTDZR02","CARLOS ALFONSO RODRIGUEZ  RUIZ",3,8,1130,3102,"00",29,"PB",8,290063,3,null,20150101,20150331,5207.4799999999996,0]
[null,"GUANAJUATO","11DPT0011X",100,"SAOF7912075J9","SAOF791207HGTLRR02","FRANCISCO JAVIER  SALGADO ORTIZ",3,12,1130,3102,"02",49,"PC",12,249048,3,null,20150101,20150331,5159.3999999999996,0]
[null,"GUANAJUATO","11DPT0009I",100,"SATJ701026RC3","SATJ701026HGTNFS09","JOSE SANCHEZ TAFOYA",3,10,1130,3102,"01",74,"PC",10,740034,3,null,20150101,20150331,5159.3999999999996,0]
[null,"GUANAJUATO","11DPT0011X",100,"BAEJ7111265C6","BAEJ711126HGTTSS04","JESUS MARIO  BAUTISTA  ESCAMILLA ",3,24,1130,3102,"02",49,"PC",24,249008,3,null,20150101,20150331,5159.3999999999996,0]
[null,"GUANAJUATO","11DPT0007K",120,"HEAM5406144E9","HEAM540614MDFRRR09","MARISELA HERRERA ARVIZU",3,13,1130,3102,"02","03","PC",13,203172,3,null,20150101,20150331,5159.3999999999996,0]
[null,"GUANAJUATO","11DPT0007K",120,"MAPA6006036V3","MAPA600603MGTCLN00","ANA AMPARO MACIAS PALACIOS",3,20,1130,3102,"02","03","PC",20,203050,3,null,20150101,20150331,5159.3999999999996,0]
[null,"GUANAJUATO","11DPT0004N",100,"LOOE660716UY7","LOOE660716HGTPJD01","EDUARDO LOPEZ OJEDA",3,8,1130,3102,"01",28,"PB",8,128021,3,null,20150101,20150331,5072.84,0]
[null,"GUANAJUATO","11DPT0004N",120,"GOCE620703SD6","GOCE620703HDFNRN08","ENRIQUE GONZALEZ CARDONA",3,8,1130,3102,"01",28,"PC",8,128078,3,null,20150101,20150331,4992.33,0]
[null,"GUANAJUATO","11DPT0004N",120,"PARA650525ER4","PARA650525HGTNYR08","ARMANDO PANTOJA REYES",3,8,1130,3102,"01",28,"PB",8,128080,3,null,20150101,20150331,4992.33,0]
[null,"GUANAJUATO","11DPT0008J",120,"TOLJ711229Q89","TOLJ711229HGTRPV00","JAVIER TORRES LOPEZ",3,20,1130,3102,"02",33,"PC",20,523350,3,null,20150101,20150331,4992.33,0]
[null,"GUANAJUATO","11DPT0011X",100,"FAMD850123CZ0","FAMD850123HGTLNN04","DANIEL  FALCON  MONROY ",3,17,1130,3102,"02",49,"PB",17,249086,3,null,20150101,20150331,4992.33,0]
[null,"GUANAJUATO","11DPT0011X",120,"GARR8203151UA","GARR820315HHGRBY08","REYMUNDO GARCIA ROBLES",3,18,1130,3102,"02",49,"PB",18,249102,3,null,20150101,20150331,4992.33,0]
[null,"GUANAJUATO","11DPT0011X",100,"MOSA681126R27","MOSA681126MGTNRN06","MA ANGELES  MONTERO  SIERRA ",3,20,1130,3102,"02",49,"PC",20,249023,3,null,20150101,20150331,4992.33,0]
[null,"GUANAJUATO","11DPT0011X",100,"MUAO8512081H3","MUAO851208HGTXCS06","OSCAR  MUÑOZ ACEVEDO ",3,18,1130,3102,"02",49,"PB",18,249035,3,null,20150101,20150331,4992.33,0]
[null,"GUANAJUATO","11DPT0001Q",120,"RORM810208UU3","RORM810208HGTCCR04","MARTIN RAFAEL ROCHA RICO",3,14,1130,3102,"00",28,"PC",14,280145,3,null,20150101,20150331,4992.33,0]
[null,"GUANAJUATO","11DPT0011X",100,"SACM860807000","SACM860807HGTMMN00","JOSE MANUEL  SAMANO  CAMARGO ",3,20,1130,3102,"02",49,"PB",20,249085,3,null,20150101,20150331,4992.33,0]
[null,"GUANAJUATO","11DPT0007K",120,"AAGE740808PN4","AAGE740808HGTLRM03","EMMANUEL FRANCISCO ALCARAZ GARCIA",3,20,1710,3102,"02","03","PC",20,203004,3,null,20150101,20150331,4992.33,0]
[null,"GUANAJUATO","11DPT0011X",120,"AAME860903","AAME860903HMNLDD08","EDGAR ALAN ALFARO MEDINA",3,15,1130,3102,"02",49,"PB",15,249138,3,null,20150101,20150331,4992.33,0]
[null,"GUANAJUATO","11DPT0001Q",120,"AAVB660401UL2","AAVB660401MDFLVL01","BLANCA IVETTE ALVAREZ DEL CASTILLO VENTRE",3,20,1130,3102,"00",28,"PC",20,280002,3,null,20150101,20150331,4992.33,0]
[null,"GUANAJUATO","11DPT0010Y",100,"AEGE750228CT2","AEGE750228MGTRMR09","ERIKA ARÉVALO GÓMEZ",3,23,1130,3102,"02","04","PB",23,204007,3,null,20150101,20150331,4992.33,0]
[null,"GUANAJUATO","11DPT0006L",120,"CADJ720202F14","CADJ720202HMNHRN03","JUAN CHAVEZ DURAN",3,15,1130,3102,"01",63,"PC",15,163010,3,null,20150101,20150331,4992.33,0]
[null,"GUANAJUATO","11DPT0011X",100,"GUCT560830E19","GUCT560830MGTRSR17","MA TERESA GUERRERO CASTRO",3,20,1130,3102,"02",49,"PC",20,249025,3,null,20150101,20150331,4992.33,0]
[null,"GUANAJUATO","11DPT0010Y",100,"LORC760609NB1","LORC760609MDFPVL08","CLAUDETTE LÓPEZ DE LA RIVA",3,20,1130,3102,"02","04","PC",20,204030,3,null,20150101,20150331,4992.33,0]
[null,"GUANAJUATO","11DPT0006L",120,"RAMO6702175A0","RAMO670217MMNNJL07","OLGA OFELIA RANGEL MEJIA",3,18,1130,3102,"01",63,"PA",18,163098,3,null,20150101,20150331,4992.33,0]
[null,"GUANAJUATO","11DPT0011X",120,"RIOL830629124","RIOL830629MGTVJZ05","MARIA DE LA LUZ RIVERA OJEDA",3,17,1130,3102,"02",49,"PB",17,249126,3,null,20150101,20150331,4992.33,0]
[null,"GUANAJUATO","11DPT0010Y",120,"VELL651008V35","VELL651008MDFLGR02","MARÍA DE LOURDES JUANA VELÁZQUEZ LUGO",3,18,1130,3102,"02","04","PC",18,204070,3,null,20150101,20150331,4992.33,0]
[null,"GUANAJUATO","11DPT0012W",120,"GOHS8907177Z1","GOHS890717MQTMRN05","SANDRA IRAIS GOMEZ HERNANDEZ",3,15,1130,3102,"04","02","PA",15,270008,3,null,20150101,20150331,4989.2400000000007,0]
[null,"GUANAJUATO","11DPT0010Y",120,"JUBE7310241I6","JUBE731024MGTRLL05","ELIDUVINA JUAREZ BALANDRÁN",3,12,1130,3102,"02","04","TA",12,204028,3,null,20150101,20150331,4989.2400000000007,0]
[null,"GUANAJUATO","11DPT0008J",120,"GAPG840330FB1","GAPG840330MMCRRB02","GABRIELA GARCIA PEREZ",3,20,1130,3102,"02",33,"PA",20,523317,3,null,20150101,20150331,4978.6099999999997,0]
[null,"GUANAJUATO","11DPT0008J",120,"GOPR781214HT1","GOPR781214HGTNRD05","RODOLFO GONZALEZ PRESA",3,20,1130,3102,"02",33,"PA",20,523321,3,null,20150101,20150331,4978.6099999999997,0]
[null,"GUANAJUATO","11DPT0011X",100,"NAFE720728918","NAFE720728MDFVRV08","EVANGELINA NAVARRETE FARFAN",3,15,1130,3102,"02",49,"PA",15,249037,3,null,20150101,20150331,4971.76,0]
[null,"GUANAJUATO","11DPT0009I",100,"PABG6901266Q2","PABG690126HGTZNR06","GERARDO PAZ BONILLA",3,15,1130,3102,"01",74,"PA",15,740026,3,null,20150101,20150331,4971.76,0]
[null,"GUANAJUATO","11DPT0009I",100,"RARM770914S13","RARM770914HGTNYR07","MAURICIO RANGEL REYES",3,15,1130,3102,"01",74,"PA",15,740029,3,null,20150101,20150331,4971.76,0]
[null,"GUANAJUATO","11DPT0002P",120,"GORC820608RCA","GORC820608MGTLRT07","MA CONCEPCION GONZALEZ RAMIREZ",3,18,1130,3102,"00",29,"PC",18,290097,3,null,20150101,20150331,4944.43,0]
[null,"GUANAJUATO","11DPT0002P",100,"SOAO850607U46","SOAO850607HGGTGM04","OMAR DAVID SOTO AGUIRRE",3,18,1130,3102,"00",29,"TA",18,290067,3,null,20150101,20150331,4882.08,0]
[null,"GUANAJUATO","11DPT0008J",120,"GOGF7511182R7","GOGF751118HGTNSR05","FRANCISCO JAVIER GONZALEZ GASCA",3,22,1130,3102,"02",33,"PB",22,523319,3,null,20150101,20150331,4842.5,0]
[null,"GUANAJUATO","11DPT0005M",120,"GABM720316FV9","GABM720316MGTLRR09","MARTHA PATRICIA GARCIA BELTRAN",3,25,1130,3102,"00",72,"PB",25,1130,3,null,20150101,20150331,4842.5,0]
[null,"GUANAJUATO","11DPT0010Y",120,"PEAS8212087J7","PEAS821208HDFRNL03","SAUL PEREZ ANGUIANO",3,10,1130,3102,"02","04","TA",10,204009,3,null,20150101,20150331,4752.1499999999996,0]
[null,"GUANAJUATO","11DPT0012W",120,"SOMJ860107SDA","SOMJ860107MTSSNS08","JESSICA SOSA MENA",3,15,1130,3102,"04","02","PC",15,270158,3,null,20150101,20150331,4729.45,0]
[null,"GUANAJUATO","11DPT0011X",100,"AUGJ780722V55","AUGJ780722HGTGMN00","JUAN SIMON  AGUILAR  GOMEZ ",3,16,1130,3102,"02",49,"PB",16,249003,3,null,20150101,20150331,4712.71,0]
[null,"GUANAJUATO","11DPT0012W",120,"PEBG910930PM0","PEBG910930MQTRCD18","MARIA GUADALUPE PEREZ BECERRA",3,14,1130,3102,"04","02","TA",14,270013,3,null,20150101,20150331,4690.78,0]
[null,"GUANAJUATO","11DPT0009I",100,"RONS740802CB3","RONS740802HGTCXL05","SALVADOR ROCHA NUÑEZ",3,19,1130,3102,"01",74,"TA",19,740031,3,null,20150101,20150331,4690.78,0]
[null,"GUANAJUATO","11DPT0011X",100,"EAMA860511UL8","EAMA860511MMNSRN08","ANA LUCIA ESCALANTE MARIN",3,25,1130,3102,"02",49,"PB",25,249017,3,null,20150101,20150331,4656.25,0]
[null,"GUANAJUATO","11DPT0005M",120,"AULG650807MX2","AULG650807MCLGPD08","MARIA GUADALUPE AGUILAR LOPEZ",3,20,1130,3102,"00",72,"PB",20,1130,3,null,20150101,20150331,4656.25,0]
[null,"GUANAJUATO","11DPT0013V",120,"BURL821104LM8","BURL821104MGTTMT09","LETICIA BUTANDA RAMIREZ",3,18,1130,3102,"03","02","PB",18,100004,3,null,20150101,20150331,4656.25,0]
[null,"GUANAJUATO","11DPT0001Q",100,"CEGE7106304G8","CEGE710630MGTBML09","MA ELIZABETH CEBALLOS GOMEZ",3,20,1130,3102,"00",28,"PB",20,280012,3,null,20150101,20150331,4656.25,0]
[null,"GUANAJUATO","11DPT0010Y",120,"SAMD841004000","SAMD841004MGTNLN03","DINORHA GEORGINA SANTIAGO MELCHOR",3,13,1130,3102,"02","04","PB",13,204096,3,null,20150101,20150331,4647.16,0]
[null,"GUANAJUATO","11DPT0008J",120,"HEAR7110051U4","HEAR711005HDFRRY04","RAYMUNDO HERNANDEZ ARRIAGA",3,18,1130,3102,"02",33,"PA",18,523322,3,null,20150101,20150331,4647.16,0]
[null,"GUANAJUATO","11DPT0011X",100,"MABR8302104V5","MABR830210HGTRRB02","ROBERTO  MARTINEZ  BARRERA ",3,20,1130,3102,"02",49,"PA",20,249029,3,null,20150101,20150331,4640.3,0]
[null,"GUANAJUATO","11DPT0002P",120,"GULG780404F75","GULG780404HGTRGR06","JORGE GUADALUPE GUERRERO LAGUNA",3,10,1130,3102,"00",29,"TA",10,290035,3,null,20150101,20150331,4626.8600000000006,0]
[null,"GUANAJUATO","11DPT0008J",120,"COCJ840424II1","COCJ840424HTLCNR00","JAIRO COCOLETZI CONDE",3,21,1130,3102,"02",33,"PB",21,523307,3,null,20150101,20150331,4563.13,0]
[null,"GUANAJUATO","11DPT0001Q",100,"FEHE800724TQ5","FEHE800724HGTRRD06","EDUARDO FERNANDEZ HERNANDEZ",3,10,1130,3102,"00",28,"PB",10,280022,3,null,20150101,20150331,4562.5599999999995,0]
[null,"GUANAJUATO","11DPT0012W",120,"ROGJ7510022G2","ROHJ751002HGTDNX00","JOEL  RODRIGUEZ  GONZALEZ",3,10,1130,3102,"04","02","PB",10,27041,3,null,20150101,20150331,4517.34,0]
[null,"GUANAJUATO","11DPT0007K",120,"RAVM831112KP8","RAVM831112MGTMLN01","MONICA DE LA LUZ RAMIREZ VILLANUEVA",3,15,1130,3102,"02","03","PB",15,203195,3,null,20150101,20150331,4514.4800000000005,0]
[null,"GUANAJUATO","11DPT0001Q",100,"GUCM630109EJ1","GUCM630109MGTTSR00","MARIA MARTINA MARGARITA GUTIERREZ CASTRO",3,20,1130,3102,"00",28,"PC",20,280036,3,null,20150101,20150331,4514.4799999999996,0]
[null,"GUANAJUATO","11DPT0001Q",100,"ROVD750821HSA","ROVD750821MMNCLM06","DAMARY BERENICE ROCHA VILLAGOMEZ",3,17,1130,3102,"00",28,"PC",17,280111,3,null,20150101,20150331,4514.4799999999996,0]
[null,"GUANAJUATO","11DPT0010Y",120,"ROFA780327DH3","ROFA780327HGTDLL03","JOSE ALVARO RODRIGUEZ FLORES",3,20,1320,3102,"02","04","TA",20,204114,3,null,20150101,20150331,4501.8600000000006,0]
[null,"GUANAJUATO","11DPT0009I",100,"CASM6003305D3","CASM600330HGTMTL02","MELCHOR CAMPOS SOTO",3,23,1130,3102,"01",74,"PA",23,740007,3,null,20150101,20150331,4446.96,0]
[null,"GUANAJUATO","11DPT0007K",120,"GARG881113FV7","GARG881113HGTRDL05","GUILLERMO GARCIA RODRIGUEZ",3,19,1130,3102,"02","03","PA",19,203227,3,null,20150101,20150331,4446.96,0]
[null,"GUANAJUATO","11DPT0002P",120,"SAVR640908IQA","SAVR640908HGTNGB09","ROBERTO SANTILLAN VEGA",3,17,1130,3102,"00",29,"PB",17,290066,3,null,20150101,20150331,4345.8500000000004,0]
[null,"GUANAJUATO","11DPT0005M",120,"BACL660127PY3","BACL660127HGTRNS02","JOSE LUIS BRAVO CANO",3,20,1130,3102,"00",72,"PB",20,1130,3,null,20150101,20150331,4345.8500000000004,0]
[null,"GUANAJUATO","11DPT0002P",120,"LEHB680515J91","LEHB680515MDFDRR01","BRENDA LEDESMA HERNANDEZ",3,20,1130,3102,"00",29,"PB",20,290046,3,null,20150101,20150331,4345.8500000000004,0]
[null,"GUANAJUATO","11DPT0001Q",100,"PAGJ820614HB3","PAGJ820614MGTLRN07","JUANA ADRIANA PALOALTO GARCIA",3,20,1130,3102,"00",28,"PB",20,280061,3,null,20150101,20150331,4345.8500000000004,0]
[null,"GUANAJUATO","11DPT0010Y",100,"ROMR620310CS2","ROMR620310MDFMNC01","ROCÍO ROMERO MENA",3,20,1130,3102,"02","04","PC",20,204065,3,null,20150101,20150331,4299.5,0]
[null,"GUANAJUATO","11DPT0002P",120,"MATM690314EG4","MATM690314MGTRRT12","MATILDE MARTINEZ TORRES",3,13,1130,3102,"00",29,"PC",13,290053,3,null,20150101,20150331,4263.68,0]
[null,"GUANAJUATO","11DPT0010Y",120,"CALA6404086Z8","CALA640408HGTDXL04","ALBERTO CAUDILLO LIÑÁN",3,20,1130,3102,"02","04","PC",20,204014,3,null,20150101,20150331,4263.68,0]
[null,"GUANAJUATO","11DPT0010Y",120,"RASA6006139AA","RASA600613HGTMLN04","ANTONIO RAMÍREZ SOLÍS",3,20,1130,3102,"02","04","PA",20,204058,3,null,20150101,20150331,4143.13,0]
[null,"GUANAJUATO","11DPT0001Q",120,"CAOL581027513","CAOL581027HGTMLS01","JOSE LUIS CAMPOS OLALDE",3,16,1130,3102,"00",28,"PA",16,280179,3,null,20150101,20150331,4143.13,0]
[null,"GUANAJUATO","11DPT0006L",100,"MASE831216GZ4","MASE831216MGTNTL05","ELIA MANDUJANO SOTO",3,10,1130,3102,"01",63,"PA",10,163068,3,null,20150101,20150331,4135.93,0]
[null,"GUANAJUATO","11DPT0007K",120,"LELJ740926PK3","LELJ740926HJCNPN01","JUAN ANTONIO LEON LOPEZ",3,20,1130,3102,"02","03","PC",20,203046,3,null,20150101,20150331,4012.85,0]
[null,"GUANAJUATO","11DPT0010Y",120,"GAGA790221226","GAGA790221HGTSRR01","ARMANDO GASCA GUERRA",3,19,1130,3102,"02","04","PA",19,204107,3,null,20150101,20150331,3961.1899999999996,0]
[null,"GUANAJUATO","11DPT0002P",120,"RISM640319LE9","RISM640319HGTCRR02","JOSE MARTIN RICO SERRITEÑO",3,10,1130,3102,"00",29,"PA",10,290061,3,null,20150101,20150331,3954.33,0]
[null,"GUANAJUATO","11DPT0013V",120,"SAPJ7305052R5","SAPJ730505HGTNRN06","JUAN CARLOS SANCHEZ PEREZ",3,18,1130,3102,"03","02","PB",18,100016,3,null,20150101,20150331,3911.25,0]
[null,"GUANAJUATO","11DPT0005M",120,"DABG810704HX9","DABG810704HGTMRR08","GERSON FALCAO DAMIAN BRAVO",3,12,1130,3102,"00",72,"PB",12,1130,3,null,20150101,20150331,3911.25,0]
[null,"GUANAJUATO","11DPT0006L",100,"PIVC670724KD8","PIVC670724MMNLCR01","CRISTINA PLIEGO VICTORIA",3,10,1130,3102,"01",63,"PB",10,163035,3,null,20150101,20150331,3908.46,0]
[null,"GUANAJUATO","11DPT0009I",100,"SOSP630208MC6","SOSP630208HGTTCD07","PEDRO SOTO SAUCEDO",3,7,1130,3102,"01",74,"PA",7,740036,3,null,20150101,20150331,3903.58,0]
[null,"GUANAJUATO","11DPT0009I",100,"AAGG8604281N4","AAGG860428MGTLRD04","MARIA GUADALUPE ALAMILLA GARCIA",3,20,1130,3102,"01",74,"PA",20,740002,3,null,20150101,20150331,3866.93,0]
[null,"GUANAJUATO","11DPT0012W",120,"RIHS8511232P3","RIHS851123MGTVRC00","MARIA SOCORRO RIVERA HERNANDEZ",3,20,1130,3102,"04","02","PA",20,27038,3,null,20150101,20150331,3866.93,0]
[null,"GUANAJUATO","11DPT0006L",120,"GUSG880306VD5","GUSG880306HGTLNR09","GERARDO GUILLEN SANCHEZ",3,12,1130,3102,"01",63,"TA",12,163093,3,null,20150101,20150331,3864.0299999999997,0]
[null,"GUANAJUATO","11DPT0009I",100,"CACC741121MK3","CACC741121HGTSRR01","CARLOS ALBERTO CASTILLO CRUZ",3,10,1130,3102,"01",74,"PB",10,740008,3,null,20150101,20150331,3829.44,0]
[null,"GUANAJUATO","11DPT0012W",120,"OAVO8206077E6","OAVO820607HMNCZ08","OMAR ANTONIO  OCAMPO  VAZQUEZ",3,13,1130,3102,"04","02","PA",13,270021,3,null,20150101,20150331,3811.68,0]
[null,"GUANAJUATO","11DPT0007K",120,"GACM6402137QA","GACM640213MGTRNR05","MARICELA GARCIA CHAVEZ",3,15,1130,3102,"02","03","PC",15,203031,3,null,20150101,20150331,3762.08,0]
[null,"GUANAJUATO","11DPT0010Y",100,"PESJ720529I40","PESJ720529HGTRNN06","JUAN JOSÉ PÉREZ SANTIAGO",3,15,1130,3102,"02","04","PC",15,204052,3,null,20150101,20150331,3762.08,0]
[null,"GUANAJUATO","11DPT0002P",100,"RENJ720507T83","RENJ720507HGTXVL04","JULIO REA NAVARRO",3,16,1130,3102,"00",29,"PB",16,290060,3,null,20150101,20150331,3725,0]
[null,"GUANAJUATO","11DPT0007K",120,"SOMJ5508087H2","SOMJ550808MGTTRN02","JUANA SOTO MORAN",3,20,1130,3102,"02","03","PB",20,203081,3,null,20150101,20150331,3725,0]
[null,"GUANAJUATO","11DPT0001Q",100,"BOSC820326R12","BOSC820326HGTLRR09","CARLOS MARTIN BOLAÑOS SERVIN",3,20,1130,3102,"00",28,"PB",20,280008,3,null,20150101,20150331,3725,0]
[null,"GUANAJUATO","11DPT0001Q",100,"CAAL690628AM6","CAAL690628MGTRLT08","MARIA LETICIA CARDENAS ALMANZA",3,20,1130,3102,"00",28,"PB",20,280009,3,null,20150101,20150331,3725,0]
[null,"GUANAJUATO","11DPT0011X",100,"CARH670101MS3","CARH670101HGTRZC08","HECTOR  CARDENAS  RUIZ ",3,20,1130,3102,"02",49,"PB",20,249010,3,null,20150101,20150331,3725,0]
[null,"GUANAJUATO","11DPT0001Q",100,"CIGM510313HX4","CIGM510313HVZSRG08","MIGUEL ANGEL CISNEROS GARCIA",3,20,1130,3102,"00",28,"PB",20,280014,3,null,20150101,20150331,3725,0]
[null,"GUANAJUATO","11DPT0014U",120,"FABV830514ES9","FABV830514HGTRLC04","VICTOR ESTEBAN FRAUSTO BOLIO",3,9,1210,3102,"03","03","PB",9,303041,3,null,20150101,20150331,3725,0]
[null,"GUANAJUATO","11DPT0014U",100,"GAAA750801K73","GAAA750801MGTYVN02","ANGELICA MARIA GAYTAN AVILA",3,20,1130,3102,"03","03","PB",20,303012,3,null,20150101,20150331,3725,0]
[null,"GUANAJUATO","11DPT0005M",120,"GASR730617EQ9","GASR730619MGTRLS03","ROSA MARIA GARCIA  SILVA",3,20,1130,3102,"00",72,"PB",20,1130,3,null,20150101,20150331,3725,0]
[null,"GUANAJUATO","11DPT0010Y",120,"MAZA690627N73","MAZA690627MGTTMN03","ANA ROSA MATA ZAMORA",3,20,1130,3102,"02","04","PB",20,204009,3,null,20150101,20150331,3725,0]
[null,"GUANAJUATO","11DPT0012W",100,"VAMG850109N64","VAMG850109MBSZNB01","GABRIELA VAZQUEZ MONJARAZ",3,20,1130,3102,"04","02","PB",20,270052,3,null,20150101,20150331,3725,0]
[null,"GUANAJUATO","11DPT0013V",120,"VIBM750212ED8","VIBM750212MDFLRN06","MONICA VILCHIS BARCENAS",3,22,1130,3102,"03","02","PB",22,100018,3,null,20150101,20150331,3725,0]
[null,"GUANAJUATO","11DPT0009I",100,"PEFD7301136V8","PEFD730113HGTRLV06","DAVID PEREZ FELIPE",3,20,1130,3102,"01",74,"TA",20,740027,3,null,20150101,20150331,3553.23,0]
[null,"GUANAJUATO","11DPT0012W",120,"BASC910503127","BASC910503MGTZNR03","MARIA CRUZ BAEZA SANCHEZ",3,25,1130,3102,"04","02","TA",25,270009,3,null,20150101,20150331,3553.23,0]
[null,"GUANAJUATO","11DPT0011X",100,"CAER830626JA4","CAER830626MGTRSY00","REYNA LILIANA  CARDOSO  ESCUTIA ",3,19,1130,3102,"02",49,"PB",19,249011,3,null,20150101,20150331,3538.75,0]
[null,"GUANAJUATO","11DPT0010Y",120,"VIMU840526EL5","VIMU840526HDFLRR00","URIEL ALEJANDRO VILLÁGOMEZ MARTÍNEZ",3,19,1130,3102,"02","04","PB",19,204072,3,null,20150101,20150331,3538.75,0]
[null,"GUANAJUATO","11DPT0001Q",100,"HEAM501110PP1","HEAM501110MDFRRN05","MINERVA HERNANDEZ ARMENDARIZ",3,18,1130,3102,"00",28,"PB",18,280027,3,null,20150101,20150331,3480.23,0]
[null,"GUANAJUATO","11DPT0011X",100,"ZAMJ740416EMO","ZAMJ740416HDFMXR00","JORGE  ZAMORA  NUÑEZ ",3,16,1130,3102,"02",49,"PB",16,249056,3,null,20150101,20150331,3476.65,0]
[null,"GUANAJUATO","11DPT0007K",120,"GUHG690324J87","GUHG690324HGTTRB00","GABRIEL GUTIERREZ HERNANDEZ",3,16,1130,3102,"02","03","PC",16,203036,3,null,20150101,20150331,3439.6,0]
[null,"GUANAJUATO","11DPT0010Y",120,"RIRS720206SN4","RIRS720206MGTVML08","SOLEDAD SUSANA RIVERA RAMÍREZ",3,16,1130,3102,"02","04","PC",16,204062,3,null,20150101,20150331,3439.6,0]
[null,"GUANAJUATO","11DPT0007K",120,"ROHO780227K98","ROXH780227MGTCXN02","HONORINA PAOLA * ROCHA",3,16,1130,3102,"02","03","PC",16,203126,3,null,20150101,20150331,3439.6,0]
[null,"GUANAJUATO","11DPT0009I",100,"RIRG760502K16","RIRG760502MGTVDW04","GWENDOLYNE ERENDIRA RIVAS RODRIGUEZ",3,6,1130,3102,"01",74,"PB",6,740030,3,null,20150101,20150331,3398.55,0]
[null,"GUANAJUATO","11DPT0005M",120,"EIDR500307HY1","EIDR500307HGTNLN02","JOSE RENE ENRIQUEZ DELGADO",3,19,1130,3102,"00",72,"PB",19,1130,3,null,20150101,20150331,3352.5,0]
[null,"GUANAJUATO","11DPT0008J",120,"EIEA830501N66","EIEA830501MGTSSN05","ANDREA ESPITIA ESPITIA",3,18,1130,3102,"02",33,"PB",18,523312,3,null,20150101,20150331,3352.5,0]
[null,"GUANAJUATO","11DPT0006L",100,"SOAE851129KH7","SOAE851129MGTTCS09","ESPERANZA SOTO ACEVEDO",3,9,1130,3102,"01",63,"PB",9,163047,3,null,20150101,20150331,3328.22,0]
[null,"GUANAJUATO","11DPT0008J",120,"JULA7109296W5","JULA710929HGTRNL01","ALEJANDRO JUAREZ LEON",3,20,1130,3102,"02",33,"PA",20,523326,3,null,20150101,20150331,3314.5,0]
[null,"GUANAJUATO","11DPT0009I",100,"MATG681016SW7","MATG681016HGTGFR08","GERARDO MAGAÑA TAFOYA",3,20,1130,3102,"01",74,"PA",20,740019,3,null,20150101,20150331,3314.5,0]
[null,"GUANAJUATO","11DPT0001Q",120,"PIZM740723DV9","PIZM740723MGTZMR06","MIRYAM PIZANO ZAMORA",3,13,1130,3102,"00",28,"PA",13,280147,3,null,20150101,20150331,3314.5,0]
[null,"GUANAJUATO","11DPT0001Q",100,"GAFF820410AV4","GAFF820410HGTRRR01","FERNANDO GARCIA FRIAS",3,20,1130,3102,"00",28,"PA",20,280024,3,null,20150101,20150331,3314.5,0]
[null,"GUANAJUATO","11DPT0001Q",100,"GODA691116ALA","GODA691116HDFMZL07","ALEJANDRO GOMEZ DIAZ",3,20,1130,3102,"00",28,"PA",20,280029,3,null,20150101,20150331,3314.5,0]
[null,"GUANAJUATO","11DPT0013V",120,"LOSC860106KF2","LOSC860106HGTPRH07","CHRISTIAN EMMANUEL LOPEZ SUAREZ",3,18,1130,3102,"03","02","PA",18,114,3,null,20150101,20150331,3314.5,0]
[null,"GUANAJUATO","11DPT0005M",120,"TOVJ770823IY6","TOVJ770823HGTRRM05","JUAN MANUEL TORRES  VERA",3,20,1130,3102,"00",72,"PA",20,1130,3,null,20150101,20150331,3314.5,0]
[null,"GUANAJUATO","11DPT0012W",120,"VAPG660502A11","VAPG660502HMCZRR05","GERMAN VAZQUEZ PERALTA",3,20,1130,3102,"04","02","PA",20,27053,3,null,20150101,20150331,3314.5,0]
[null,"GUANAJUATO","11DPT0002P",120,"DICI670401TA1","DICI670401MGTZMR00","IRENE DIAZ CAMPOS",3,15,1130,3102,"00",29,"PC",15,290021,3,null,20150101,20150331,3224.63,0]
[null,"GUANAJUATO","11DPT0001Q",100,"GAMC720506I97","GAMC720506MGTRRN08","CONSTANZA GARCIA  MARTINEZ",3,15,1130,3102,"00",28,"PC",15,280025,3,null,20150101,20150331,3224.63,0]
[null,"GUANAJUATO","11DPT0010Y",100,"MORR630513CT2","MORR630513HGTSVD06","RODOLFO MOSQUEDA RUVALCABA",3,15,1130,3102,"02","04","PC",15,204042,3,null,20150101,20150331,3224.63,0]
[null,"GUANAJUATO","11DPT0001Q",100,"GUCA621009A88","GUCA621009MGTTHR00","ARACELI GUTIERREZ CHACON",3,15,1130,3102,"00",28,"PB",15,280037,3,null,20150101,20150331,3166.25,0]
[null,"GUANAJUATO","11DPT0011X",100,"HEMY820605MZ2","HEMY820605MGTRNL07","YOLANDA  HERNANDEZ  MONTOYA ",3,18,1130,3102,"02",49,"PA",18,249067,3,null,20150101,20150331,3148.78,0]
[null,"GUANAJUATO","11DPT0010Y",120,"GOGJ8611097Z8","GOGJ861109HGTNMR07","JORGE ARTURO GONGORA GAMIÑO",3,15,1130,3102,"02","04","PB",15,204117,3,null,20150101,20150331,3121.68,0]
[null,"GUANAJUATO","11DPT0010Y",120,"ROHA790902MQ8","ROHA790902HGTDRL09","ALEJANDRO RODRIGUEZ HERNANDEZ",3,22,1130,3102,"02","04","TA",22,204115,3,null,20150101,20150331,2953.27,0]
[null,"GUANAJUATO","11DPT0014U",100,"SACG751101985","SACG751101HDFNRR03","GERARDO JAVIER SANCHEZ CARRANZA",3,21,1130,3102,"03","03","TA",21,303016,3,null,20150101,20150331,2923.8,0]
[null,"GUANAJUATO","11DPT0002P",120,"HERA4412086H0","HERA441208HGTRSL07","ALFREDO HERRERA ROSALES",3,8,1130,3102,"00",29,"PA",8,290042,3,null,20150101,20150331,2915.37,0]
[null,"GUANAJUATO","11DPT0010Y",100,"GOAA670428AHA","GOAA670428MGTNLR05","ARACELI GONZÁLEZ ÁLVAREZ",3,15,1130,3102,"02","04","PA",15,204021,3,null,20150101,20150331,2900.21,0]
[null,"GUANAJUATO","11DPT0002P",100,"VAGN761014IF8","VAGN761014MGTLVD09","NADIA VALLEJO GUEVARA",3,18,1130,3102,"00",29,"PA",18,900069,3,null,20150101,20150331,2817.33,0]
[null,"GUANAJUATO","11DPT0001Q",100,"GOPE721215MA1","GOPE721215HGTNSD00","EDISON OSWALDO GONZALEZ PESCADOR",3,15,1130,3102,"00",28,"PB",15,280032,3,null,20150101,20150331,2793.75,0]
[null,"GUANAJUATO","11DPT0010Y",120,"AAPM8304305FA","AAPM830430MGTLRY09","MAYRA DE GUADALUPE CELENE ALVAREZ PÉREZ",3,15,1320,3102,"02","04","PB",15,204005,3,null,20150101,20150331,2793.75,0]
[null,"GUANAJUATO","11DPT0011X",100,"RISA740722842","RISA740722MGTCNL08","ALEJANDRA  RICALDE  SANCHEZ ",3,12,1130,3102,"02",49,"PB",12,249045,3,null,20150101,20150331,2699.08,0]
[null,"GUANAJUATO","11DPT0010Y",120,"LOMA9110192M9","LOMA911019MGTPNR09","AURORA LOPEZ MENDOZA",3,19,1130,3102,"02","04","TA",19,204116,3,null,20150101,20150331,2595.6,0]
[null,"GUANAJUATO","11DPT0011X",100,"LUCF7002115Q9","LUCF700211HGTLND05","FIDEL  LULE  CONTRERAS ",3,10,1130,3102,"02",49,"PC",10,249028,3,null,20150101,20150331,2579.6999999999998,0]
[null,"GUANAJUATO","11DPT0012W",120,"ZABA871015J40","ZABA871015HGTRCM04","AMANDO ZARAZUA BECERRA",3,19,1130,3102,"04","02","PA",19,270015,3,null,20150101,20150331,2520.7600000000002,0]
[null,"GUANAJUATO","11DPT0010Y",120,"MUDR701023BQ5","MUDR701023HGTXRN03","JOSE RENE MUÑOZ DURAN",3,15,1130,3102,"02","04","PA",15,204011,3,null,20150101,20150331,2485.88,0]
[null,"GUANAJUATO","11DPT0009I",100,"ROCC7912019U3","ROCC791201HGTDHS03","CESAR ADRIAN RODRIGUEZ CHAVEZ",3,15,1130,3102,"01",74,"PA",15,740032,3,null,20150101,20150331,2485.88,0]
[null,"GUANAJUATO","11DPT0012W",120,"SATE820405F51","SATE820405MGTNRV00","EVA MARIA DEL ROSARIO SANCHEZ TURRUBIARTES",3,15,1130,3102,"04","02","PA",15,27047,3,null,20150101,20150331,2485.88,0]
[null,"GUANAJUATO","11DPT0002P",120,"CUTP650130E94","CUTP650130HGTRRB03","PABLO CRUZ TORRES",3,15,1130,3102,"00",29,"PA",15,290019,3,null,20150101,20150331,2485.88,0]
[null,"GUANAJUATO","11DPT0013V",120,"DOIB750304RM3","DOIB750304HGTRNN07","BENJAMIN DORANTES INFANTE",3,6,1130,3102,"03","02","PA",6,100007,3,null,20150101,20150331,2485.88,0]
[null,"GUANAJUATO","11DPT0008J",120,"RIRJ8606049A1","RIRJ860604HGTSJN07","JUAN MANUEL RIOS ROJAS",3,15,1130,3102,"02",33,"PA",15,523343,3,null,20150101,20150331,2485.88,0]
[null,"GUANAJUATO","11DPT0010Y",100,"TEAA800207442","TEAA800207MGTRGL00","ALEJANDRA ISABEL TREJO AGUILAR",3,15,1130,3102,"02","04","PA",15,204069,3,null,20150101,20150331,2485.88,0]
[null,"GUANAJUATO","11DPT0013V",120,"RARG930413MZ7","RARG930413HGTMCS09","GUSTAVO PAUL RAMÍREZ ROCHA",3,16,1130,3102,"03","02","TA",16,153,3,null,20150101,20150331,2446.73,0]
[null,"GUANAJUATO","11DPT0008J",120,"AETA681104M99","AETA681104MGTRPL00","ALEJANDRA ARREGUIN TAPIA",3,20,1130,3102,"02",33,"TA",20,523368,3,null,20150101,20150331,2442.0500000000002,0]
[null,"GUANAJUATO","11DPT0010Y",120,"AALJ72112271A","AALJ721122MGTLZN08","JUANA CECILIA ALVAREZ LOZANO",3,12,1130,3102,"02","04","PA",12,204004,3,null,20150101,20150331,2397.85,0]
[null,"GUANAJUATO","11DPT0012W",120,"CAMJ890730SG6","CAMJ890730MDFSDZ09","JAZMIN CASASOLA MEDINA",3,12,1130,3102,"04","02","PA",12,270010,3,null,20150101,20150331,2397.85,0]
[null,"GUANAJUATO","11DPT0006L",100,"CAGG841115NK6","CAGG841115MGTLNL08","GIULIANA CALDERON GONZALEZ",3,12,1130,3102,"01",63,"PB",12,163009,3,null,20150101,20150331,2336.86,0]
[null,"GUANAJUATO","11DPT0012W",100,"LOZE710604574","LOZE710604MGTZRG00","MA. EUGENIA LOZADA ZARAZUA ",3,10,1130,3102,"04","02","PB",10,27016,3,null,20150101,20150331,2283.61,0]
[null,"GUANAJUATO","11DPT0013V",20,"MORJ631227S89","MORJ631227HGTTMN01","JUAN  MOTA RAMIREZ",3,8,1130,3102,"03","02","PB",8,100013,3,null,20150101,20150331,2278.09,0]
[null,"GUANAJUATO","11DPT0012W",100,"EIHA7010296Z8","EIHA701029HGTSRL01","ALEJANDRO ESPINOSA HERNANDEZ",3,10,1130,3102,"04","02","PB",10,27007,3,null,20150101,20150331,2270.67,0]
[null,"GUANAJUATO","11DPT0014U",100,"SEHJ520104JY1","SEHR520104HGTRRG15","RIGOBERTO SERVIN HERNANDEZ",3,12,1130,3102,"03","03","PB",12,303017,3,null,20150101,20150331,2270.67,0]
[null,"GUANAJUATO","11DPT0011X",100,"CAHE761123B77","CAHE761123MGTRRL03","ELIZABETH  CARRILLO  HERNANDEZ ",3,18,1130,3102,"02",49,"TA",18,249013,3,null,20150101,20150331,2265.2799999999997,0]
[null,"GUANAJUATO","11DPT0006L",100,"BEMG751210DE6","BEMG751210MDFLRD00","GUADALUPE KARINA BELTRAN MARTINEZ",3,10,1130,3102,"01",63,"PC",10,163005,3,null,20150101,20150331,2224.02,0]
[null,"GUANAJUATO","11DPT0012W",120,"SAGE751202C27","SAGE751202HGTLLD01","EDGAR RICARDO SALINAS GUALITO",3,15,1130,3102,"04","02","TA",15,270011,3,null,20150101,20150331,2219.9700000000003,0]
[null,"GUANAJUATO","11DPT0011X",100,"TOMS6212167K7","TOMS621216MGTRRS03","SUSANA  TORRES  MARTINEZ ",3,12,1130,3102,"02",49,"TA",12,249054,3,null,20150101,20150331,2219.9700000000003,0]
[null,"GUANAJUATO","11DPT0012W",120,"AUMA910826000","AUMA910826MGTGXL03","ALEJANDRA AGUILLON MUÑOZ",3,15,1130,3102,"04","02","TA",15,270014,3,null,20150101,20150331,2219.9700000000003,0]
[null,"GUANAJUATO","11DPT0009I",100,"COGB581101LL6","COGB581101HGTRMN07","BENJAMIN CORONA GOMEZ",3,15,1130,3102,"01",74,"TA",15,740009,3,null,20150101,20150331,2219.9700000000003,0]
[null,"GUANAJUATO","11DPT0012W",120,"YAHL870917Q59","YAHL870917MDFXRR05","LAURA PATRICIA YAÑEZ HURTADO",3,14,1130,3102,"04","02","PA",14,270015,3,null,20150101,20150331,2219.9700000000003,0]
[null,"GUANAJUATO","11DPT0012W",120,"MOHS911002127","MOHS911002HMCNRR00","SERGIO MONTES DE OCA",3,3,1130,3102,"04","02","TA",3,270015,3,null,20150101,20150331,2143.46,0]
[null,"GUANAJUATO","11DPT0012W",120,"MOHS911002127","MOHS911002HMCNRR00","SERGIO MONTES DE OCA HURTADO",3,3,1130,3102,"04","02","TA",3,270015,3,null,20150101,20150331,2143.46,0]
[null,"GUANAJUATO","11DPT0008J",120,"GOHM731017127","GOHM731017HGTMRG05","MIGUEL ANGEL GOMEZ HERNANDEZ",3,10,1130,3102,"02",33,"PB",10,523318,3,null,20150101,20150331,1990.31,0]
[null,"GUANAJUATO","11DPT0009I",100,"MEGM731204L93","MEGM731204MGTNZR02","MARISA MENDEZ GUZMAN",3,10,1130,3102,"01",74,"PB",10,740022,3,null,20150101,20150331,1954.23,0]
[null,"GUANAJUATO","11DPT0005M",120,"EANE770730ID6","EANE770730HMNSXD06","EDGAR CUAUHTEMOC ESTRADA NUÑEZ",3,20,1130,3102,"00",72,"PC",20,1130,3,null,20150101,20150331,1664.11,0]
[null,"GUANAJUATO","11DPT0008J",120,"GAGF8712258Z8","GAGF871225MGTRRR05","MARIA FERNANDA GARCIA GUERRERO",3,24,1130,3102,"02",33,"TA",24,233104,3,null,20150101,20150331,1664.11,0]
[null,"GUANAJUATO","11DPT0004N",120,"GURM680618F17","GURM680618MMNZSR03","MARTHA ELENA GUZMAN ROSALES",3,16,1130,3102,"01",28,"PB",16,128086,3,null,20150101,20150331,1664.11,0]
[null,"GUANAJUATO","11DPT0008J",120,"HEEF6801012R8","HEEF680101HHGRSL09","FELIPE HERNANDEZ ESTRADA",3,20,1130,3102,"02",33,"PC",20,523323,3,null,20150101,20150331,1664.11,0]
[null,"GUANAJUATO","11DPT0008J",120,"ROFA621121CRM","ROFA621121HMCDLR04","ARTURO RODRIGUEZ FLORES",3,16,1130,3102,"02",33,"PA",16,233102,3,null,20150101,20150331,1664.11,0]
[null,"GUANAJUATO","11DPT0008J",120,"ROGD8306177Y6","ROGD830617HGTDLG05","JOSE DIEGO RODRIGUEZ GALLEGOS",3,14,1130,3102,"02",33,"PB",14,523345,3,null,20150101,20150331,1664.11,0]
[null,"GUANAJUATO","11DPT0008J",120,"ROMC720828P54","ROMC720828HCLDTR00","CARLOS ENRIQUE RODRIGUEZ MATA",3,16,1130,3102,"02",33,"TA",16,523389,3,null,20150101,20150331,1664.11,0]
[null,"GUANAJUATO","11DPT0008J",120,"SOFM861120UC9","SOFM861120HGTLGR09","MARCOS ALBERTO SOLANO FIGUEROA",3,10,1130,3102,"02",33,"PB",10,523399,3,null,20150101,20150331,1664.11,0]
[null,"GUANAJUATO","11DPT0008J",120,"VAAE821122TKA","VAAE821122HDGLRR01","ERIK VALDEZ ARREGUIN",3,15,1130,3102,"02",33,"PB",15,523392,3,null,20150101,20150331,1664.11,0]
[null,"GUANAJUATO","11DPT0008J",120,"VAMA8207297V5","VAMA820729HGTZRR02","ARMANDO URIEL VAZQUEZ MARTINEZ",3,18,1130,3102,"02",33,"PB",18,523370,3,null,20150101,20150331,1664.11,0]
[null,"GUANAJUATO","11DPT0008J",120,"VECY870118BP9","VECY870118MGTRRS06","YESENIA IVON VERA CARACHEO",3,18,1130,3102,"02",33,"PB",18,233106,3,null,20150101,20150331,1664.11,0]
[null,"GUANAJUATO","11DPT0001Q",120,"RAMG8412191Z8","RAMG841219HGTNNL07","GUILLERMO RANGEL MANCERA",3,12,1130,3102,"00",28,"TA",12,280153,3,null,20150101,20150331,1664.11,0]
[null,"GUANAJUATO","11DPT0007K",120,"ROOF850730521","ROOF850730HGTMLR06","FRANCISCO ROMERO OLMOS",3,8,1130,3102,"02","03","PA",8,203245,3,null,20150101,20150331,1664.11,0]
[null,"GUANAJUATO","11DPT0006L",120,"SERM760806ERA","SERM760806MGTRCH07","MAHELY ALEJANDRA SERRANO RICO",3,18,1130,3102,"01",63,"PC",18,163091,3,null,20150101,20150331,1664.11,0]
[null,"GUANAJUATO","11DPT0007K",100,"AAGL5509065W0","AAGL550906HGTRZS02","JOSE LUIS ARAIZA GUZMAN",3,10,1130,3102,"02","03","PB",10,203251,3,null,20150101,20150331,1664.11,0]
[null,"GUANAJUATO","11DPT0011X",100,"AALJ750316LPA","AALJ750316HGTYLS05","JOSE  AYALA  LULE ",3,18,1130,3102,"02",49,"TA",18,249007,3,null,20150101,20150331,1664.11,0]
[null,"GUANAJUATO","11DPT0006L",100,"BACG700412ET2","BACG700412MGTRSD07","MA GUADALUPE BRAVO CASTRO",3,11,1130,3102,"01",63,"PA",11,163007,3,null,20150101,20150331,1664.11,0]
[null,"GUANAJUATO","11DPT0007K",120,"BARO871201333","BARO871201HGTRDM07","OMAR ALBERTO BARAJAS RODRIGUEZ",3,10,1710,3102,"02","03","PA",10,203011,3,null,20150101,20150331,1664.11,0]
[null,"GUANAJUATO","11DPT0006L",100,"BEGR700112IU3","BEGR700112MGTRRB08","MA REBECA BERNAL GORDILLO",3,16,1130,3102,"01",63,"PA",16,163006,3,null,20150101,20150331,1664.11,0]
[null,"GUANAJUATO","11DPT0011X",120,"GALL871108","GALL871108MGTRPL08","LILIANA GARCIA LOPEZ",3,18,1130,3102,"02",49,"PB",18,249139,3,null,20150101,20150331,1664.11,0]
[null,"GUANAJUATO","11DPT0011X",120,"GOVE850725","GOVE850725HTSMLD03","EDUARDO GOMEZ VILLAGOMEZ",3,8,1130,3102,"02",49,"PB",8,249137,3,null,20150101,20150331,1664.11,0]
[null,"GUANAJUATO","11DPT0006L",100,"MACV8204295T9","MACV820429MGTNSR06","VIRGINIA MANDUJANO CASTRO",3,14,1130,3102,"01",63,"PB",14,163105,3,null,20150101,20150331,1664.11,0]
[null,"GUANAJUATO","11DPT0006L",120,"MAGO860529ID3","MAGO860529HGTRZS08","OSCAR NAZARET MARTINEZ GUZMAN",3,17,1130,3102,"01",63,"PA",17,163106,3,null,20150101,20150331,1664.11,0]
[null,"GUANAJUATO","11DPT0006L",100,"ROGE870702MF0","ROGE870702MDFSRL00","ELSA GABRIELA DE LA ROSA GARCIA",3,15,1130,3102,"01",63,"PB",15,163104,3,null,20150101,20150331,1664.11,0]
[null,"GUANAJUATO","11DPT0007K",120,"SAAM830517LU0","SAAM830517HDFNRG07","MIGUEL ANGEL SANCHEZ ARANDA",3,10,1130,3102,"02","03","TA",10,203170,3,null,20150101,20150331,1664.11,0]
[null,"GUANAJUATO","11DPT0011X",100,"PATF850801UJA","PATF850801HGTLPR02","FRANCISCO EVERARDO  PLAZA  TAPIA ",3,13,1130,3102,"02",49,"PA",13,249043,3,null,20150101,20150331,1661.11,0]
[null,"GUANAJUATO","11DPT0008J",120,"CAFJ650317IR5","CAFJ650317HGTRLR04","JORGE CARRANCO FLORES",3,18,1130,3102,"02",33,"TA",18,523371,3,null,20150101,20150331,1501.4900000000002,0]
[null,"GUANAJUATO","11DPT0010Y",120,"EISJ7601299X1","EISJ760129HGTSPS19","J JESUS ESPINOZA SEPULVEDA",3,11,1130,3102,"02","04","TA",11,204113,3,null,20150101,20150331,1215.17,0]
[null,"GUANAJUATO","11DPT0010Y",120,"HEDT700419HG2","HEDT700419HGTRRR01","JOSÉ TERESO HERNÁNDEZ DURÁN",3,5,1130,3102,"02","04","PB",5,204024,3,null,20150101,20150331,1088.99,0]
[null,"Total Personas : ",null,903,null,null,null,null,null,null,null,null,null,"Total Plazas : ",null,903,null,null,"Total Pto. Federal",null,{"$f":"SUBTOTAL(109,Tabla12[Percepciones pagadas en el Periodo de Comisión con Presupuesto Federal*])","v":30807566.879999965}]
[]
[null,null,null,null,null,null,null,null,null,null,null,null,null,null,null,null,null,null,"Total Ppto. Otras Fuentes:",null,null,{"$f":"SUM(V16:V920)","v":0}]
[]
[null,"*Total de Percepciones reportadas por la Entidad Federativa como pagadas al trabajador durante la comisión."]
[null,"Fuente : Información proporcionada por las Entidades Federativas"]

{"sheet":"II D) 2","index":6,"n_rows":25,"n_cols":19,"rows_kept":25,"cut":false,"hidden":false,"merged":[[11,16,12,16],[11,15,12,15],[11,17,12,17],[11,18,12,18],[11,6,11,12],[11,13,12,13],[11,14,12,14],[8,1,8,9],[11,0,12,0],[11,1,12,1],[11,5,12,5],[11,2,12,2],[11,3,12,3],[11,4,12,4]]}
[]
[]
[]
[]
[]
[]
[]
[null,"Formato: Movimientos de Plazas"]
[null,{"$f":"IF('Caratula Resumen'!D22=\"Elige el Periodo…\",\"\",'Caratula Resumen'!D22)","v":"Fondo de Aportaciones para la Educación Tecnológica y de Adultos/Colegio Nacional de Educación Profesional Técnica (FAETA/CONALEP)"},null,null,null,null,null,null,null,null,null,null,null,null,null,null,null,{"$f":"IF('Caratula Resumen'!D23=\"Elige el Periodo…\",\"\",'Caratula Resumen'!D23)","v":"1er. Trimestre"}]
[]
[]
[null,"Entidad Federativa","RFC","CURP","Nombre","Origen Presupuestal\n de la plazas","Clave Presupuestal",null,null,null,null,null,null,"Clave de nivel de puesto","Clave de nivel de sueldo","Zona Económica","Tipo de movimiento","Quincena Inicial","Quincena Final"]
[null,null,null,null,null,null,"Partida Presupuestal","Código de Pago","Clave de Unidad","Clave de Sub Unidad","Clave de Categoría","Horas Semana Mes ","Número de Plaza"]
[]
[null,"Entidad Federativa","RFC","CURP","Nombbre","Origen Presupuestal\n de la plazas","Partida Presupuestal","Código de Pago","Clave de Unidad","Clave de Sub Unidad","Clave de Categoría","Horas semana mes","Número de plaza","Clave de nivel de puesto","Clave de nivel de sueldo","Zona Económica","Tipo de movimiento","Quincena Inicial","Quincena Final"]
[]
[]
[]
[]
[]
[null,"Total Personas : ",null,null,null,null,null,null,null,null,"Total Plazas : "]
[]
[]
[]
[null,"Fuente : Información proporcionada por las Entidades Federativas"]

{"sheet":"II D) 4","index":7,"n_rows":28,"n_cols":17,"rows_kept":28,"cut":false,"hidden":false,"merged":[[12,16,13,16],[12,5,13,5],[12,4,13,4],[12,3,13,3],[9,1,9,9],[24,13,24,14],[12,0,13,0],[12,6,13,6],[12,7,12,13],[12,14,12,15],[12,2,13,2],[12,1,13,1]]}
[]
[]
[]
[]
[]
[]
[]
[]
[null,"Formato: Trabajadores Jubilados en el Periodo"]
[null,{"$f":"IF('Caratula Resumen'!D22=\"Elige el Periodo…\",\"\",'Caratula Resumen'!D22)","v":"Fondo de Aportaciones para la Educación Tecnológica y de Adultos/Colegio Nacional de Educación Profesional Técnica (FAETA/CONALEP)"},null,null,null,null,null,null,null,null,null,null,null,null,null,{"$f":"IF('Caratula Resumen'!D23=\"Elige el Periodo…\",\"\",'Caratula Resumen'!D23)","v":"1er. Trimestre"}]
[]
[]
[null,"Entidad Federativa","R.F.C.","CURP","NOMBRE","Clave CT","Última(s) ó Penultima(s) Plaza(s) Ocupada(s)\n(*)","Clave Presupuestal de la Jubilación",null,null,null,null,null,null,"Periodo ocupado",null,"Quincena de inicio de jubilación"]
[null,null,null,null,null,null,null,"Partida Presupuestal","Código de Pago","Clave de Unidad","Clave de Sub Unidad","Clave de Categoría","Horas Semana Mes ","Número de Plaza","Inicio","Conclusión"]
[]
[null,"Entidad Federativa","R.F.C.","CURP","NOMBRE","Clave Centro de Trabajo","Última(s) ó Penultima(s) Plaza(s) Ocupada(s)\n(*)","Partida Presupuestal","Código de Pago","Clave de Unidad","Clave de Sub Unidad","Clave de Categoría","Horas Semana Mes ","Número de Plaza","Periodo ocupado\nInicio","Periodo ocupado\nConclusión","Quincena de inicio de jubilación"]
[null,"GUANAJUATO","SAAE560430Q40","SAAE560430MGTNES04","ESPERANZA CATALINA SANTAMARIA ARANA","11DPT0001Q",1,1130,1003,"00",28,"A03202","00.0","2494",198605,201424,201501]
[null,"GUANAJUATO","AARE560124L13","AARE560124HMNLJD09","EDUARDO ALTAMIRANO ROJAS","11DPT0008J",1,1130,1003,"02",33,"CF33206","00.0",14313,199610,201424,201501]
[null,"GUANAJUATO","RIHM610919TU2","RIHM610919MGTCRR07","MARICELA RICO HERNANDEZ","11DPT0008J",1,1130,1003,"02",33,"CF33204","00.0",10188,198618,201503,201503]
[null,"GUANAJUATO","VERF571109GG4","VERF571109HGTRDR04","FRANCISCO JAVIER VERDIN RODRIGUEZ","11DPT0007K",1,1130,1003,"02","03","PC",12,2030091,201218,201424,201501]
[null,"GUANAJUATO","ZAVR530901NL5","ZAVR530901HGTVLD02","ZAVALA VALLEJO RODOLFO ANTONIO","11DPT0004N",1,1130,1003,"01","28","CF19201","00.0",6523,198306,201424,201501]
[null,"GUANAJUATO","PEMC480916S30","PEMC480916HGTSRR00","PESCADOR MARTINEZ CRISTOBAL","11DPT0005M",1,1130,1003,"00",72,"S01201","00.0",4419,198116,201424,201501]
[null,"Total Personas : ",6,null,null,null,null,null,null,null,null,"Total Plazas : ",null,6]
[]
[]
[]
[null,"Fuente : Información proporcionada por las Entidades Federativas"]
[null,"(*) Si  el trabajador se jubila con más de una clave presupuestal, por cada plaza se debe llenar un registro hasta que se haya informado acerca de todas las plazas del trabajador."]

{"sheet":"II D) 4 A","index":8,"n_rows":24,"n_cols":18,"rows_kept":24,"cut":false,"hidden":false,"merged":[[18,13,18,14],[9,1,9,7],[20,13,20,14],[12,17,13,17],[12,1,13,1],[12,2,13,2],[12,3,13,3],[12,4,13,4],[12,5,13,5],[12,6,12,12],[12,13,12,14],[12,15,13,15],[12,16,13,16]]}
[]
[]
[]
[]
[]
[]
[]
[]
[null,"Formato: Trabajadores que Tramitaron Licencia Prejubilatoria en el Periodo"]
[null,{"$f":"IF('Caratula Resumen'!D22=\"Elige el Periodo…\",\"\",'Caratula Resumen'!D22)","v":"Fondo de Aportaciones para la Educación Tecnológica y de Adultos/Colegio Nacional de Educación Profesional Técnica (FAETA/CONALEP)"},null,null,null,null,null,null,null,null,null,null,null,null,null,null,null,{"$f":"IF('Caratula Resumen'!D23=\"Elige el Periodo…\",\"\",'Caratula Resumen'!D23)","v":"1er. Trimestre"}]
[]
[]
[null,"Entidad Federativa","R.F.C.","CURP","NOMBRE","Clave integrada","Clave Presupuestal",null,null,null,null,null,null,"Periodo Licencia",null,"Percepciones pagadas con Presupuesto Federal en el  Periodo reportado*","Percepciones pagadas con Presupuesto de otra Fuente en el  Periodo reportado*","Clave CT Origen"]
[null,null,null,null,null,null,"Partida Presupuestal","Código de Pago","Clave de Unidad","Clave de Sub Unidad","Clave de Categoría","Horas Semana Mes ","Número de Plaza","Inicio","Conclusión"]
[]
[null,"Entidad Federativa","R.F.C.","CURP","NOMBRE","Clave integrada","Partida Presupuestal","Código de Pago","Clave de Unidad","Clave de Sub Unidad","Clave de Categoría","Horas Semana Mes ","Número de Plaza","Periodo Licencia\nInicio","Periodo Licencia\nConclusión","Percepciones pagadas con Presupuesto Federal en el  Periodo reportado*","Percepciones pagadas con Presupuesto de otra Fuente en el  Periodo reportado*","Clave CT Origen"]
[null,"GUANAJUATO","MACE390728NC3","MACE390713HJCQLV03","EVERARDO MAQUEDA CUELLAR","113010030174S0120100.08089",1130,1003,"01",74,"S01201","00.0",8089,20150115,20150415,35178.36,0,"11DPT0009I"]
[null,"GUANAJUATO","RAGC520726TJ0","RAGC520726MGTYNR12","MARIA CARMEN RAYA GONZALEZ","113010030174CF0420100.08079",1130,1003,"01",74,"CF04201","00.0",8079,20150115,20150415,41106.54,0,"11DPT0009I"]
[null,"Total Personas : ",2,null,null,null,null,null,null,null,"Total Plazas : ",null,2,"Total Pto. Federal",null,{"$f":"SUBTOTAL(109,Tabla5[Percepciones pagadas con Presupuesto Federal en el  Periodo reportado*])","v":76284.899999999994}]
[]
[null,null,null,null,null,null,null,null,null,null,null,null,null,"Total Ppto. Otras Fuentes",null,null,{"$f":"SUM(Q17:Q20)","v":0}]
[]
[null,"*Total de Percepciones reportadas por la Entidad Federativa como pagadas en el periodo "]
[null,"Fuente : Información proporcionada por las Entidades Federativas"]

{"sheet":"II D) 6","index":9,"n_rows":28,"n_cols":13,"rows_kept":28,"cut":false,"hidden":false,"merged":[[10,1,10,6],[13,12,14,12],[13,9,13,10],[13,11,14,11],[13,1,14,1],[13,2,14,2],[13,3,14,3],[13,4,14,4],[13,5,14,5],[13,6,14,6],[13,7,13,8]]}
[]
[]
[]
[]
[]
[]
[]
[]
[]
[null,"Formato: Trabajadores Contratados por Honorarios en el Periodo"]
[null,{"$f":"IF('Caratula Resumen'!D22=\"Elige el Periodo…\",\"\",'Caratula Resumen'!D22)","v":"Fondo de Aportaciones para la Educación Tecnológica y de Adultos/Colegio Nacional de Educación Profesional Técnica (FAETA/CONALEP)"},null,null,null,null,null,null,null,null,null,null,{"$f":"IF('Caratula Resumen'!D23=\"Elige el Periodo…\",\"\",'Caratula Resumen'!D23)","v":"1er. Trimestre"}]
[]
[]
[null,"Entidad Federativa","Clave Centro de Trabajo","R.F.C.","CURP","Nombre","Identificador del Contrato","Equivalencia",null,"Periodo de Contratación",null,"Función","Percepciones pagadas dentro del periodo reportado"]
[null,null,null,null,null,null,null,"Clave de Categoría","Horas Semana Mes ","Inicio","Conclusión"]
[]
[null,"Entidad Federativa","Clave Centro de Trabajo","R.F.C.","CURP","Nombre","Identificador del Contrato","Clave de Categoría","Horas Semana Mes ","Periodo de Contratación\nInicio","Periodo de Contratación\nConclusión","Función","Percepciones pagadas dentro del periodo reportado"]
[]
[]
[]
[]
[]
[null,"Total Entidad Federativa Personas : ",null,null,null,null,null,null,null,null,null,"Subtotal Monto Pagado en el Periodo:"]
[]
[]
[null,null,null,null,null,null,null,null,null,"Total   Percepciones :"]
[]
[null,"Fuente : Información proporcionada por las Entidades Federativas"]

{"sheet":"II D) 7 1","index":10,"n_rows":50,"n_cols":19,"rows_kept":50,"cut":false,"hidden":false,"merged":[[8,17,8,18],[9,1,9,9],[12,6,13,6],[12,7,12,9],[12,10,13,10],[12,11,13,11],[12,12,13,12],[12,1,13,1],[12,2,13,2],[12,3,13,3],[12,4,13,4],[12,5,13,5],[12,17,13,17],[46,16,46,17],[12,18,13,18],[12,13,13,13],[12,14,13,14],[12,15,13,15],[12,16,13,16]]}
[]
[]
[]
[]
[]
[]
[]
[]
[null,"Formato: Analítico de Categorías / Plazas Autorizadas con su Tabulador",null,null,null,null,null,null,null,null,null,null,null,null,null,null,"Entidad Federativa:",{"$f":"IF('Caratula Resumen'!D21=\"Elige el Periodo…\",\"\",'Caratula Resumen'!D21)","v":" GUANAJUATO "}]
[null,{"$f":"IF('Caratula Resumen'!D22=\"Elige el Periodo…\",\"\",'Caratula Resumen'!D22)","v":"Fondo de Aportaciones para la Educación Tecnológica y de Adultos/Colegio Nacional de Educación Profesional Técnica (FAETA/CONALEP)"},null,null,null,null,null,null,null,null,null,null,null,null,null,null,null,null,{"$f":"IF('Caratula Resumen'!D23=\"Elige el Periodo…\",\"\",'Caratula Resumen'!D23)","v":"1er. Trimestre"}]
[]
[]
[null,"Clave Tipo educativo","Clave Nivel educativo","Clave Subnivel educativo","Descripción Nivel / Subnivel","Tipo Financiamiento","Partida Presupuestal","CATEGORIA",null,null,"Zona Económica","Nivel Puesto","Nivel Sueldo","Tipo Contratación","Monto mensual\npor plaza jornada","Monto mensual\nPor Plaza HSM","Número de Plazas Jornada","Número de Plazas HSM","Monto total autorizado"]
[null,null,null,null,null,null,null,"Tipo de Categoría"," Categoría","Descripción"]
[]
[null,"Clave Tipo educativo","Clave Nivel educativo","Clave Subnivel educativo","Descripción Nivel / Subnivel","Tipo Financiamiento","Partida Presupestal","Tipo de Categoría"," Categoría","Descripción","Zona Económica","Nivel Puesto","Nivel Sueldo","Tipo Contratación","Monto mensual\npor plaza jornada","Monto mensual\nPor Plaza HSM","Número de Plazas Jornada","Número de Plazas HSM","Monto total autorizado"]
[null,3,32,31,"LICENCIATURA UNIVERSITARIA",1,1130,3,"000000PC","PROFESIONISTA INSTRUCTOR TIPO \"C\"","C","000000D1",1,"H",0,107.49,0,1831,196814.19]
[null,3,32,31,"LICENCIATURA UNIVERSITARIA",1,1130,3,"000000PB","PROFESIONISTA INSTRUCTOR TIPO \"B\"","C","000000D2",2,"H",0,93.13,0,2727,253965.50999999998]
[null,3,32,31,"LICENCIATURA UNIVERSITARIA",1,1130,3,"000000PA","PROFESIONISTA INSTRUCTOR TIPO \"A\"","C","000000D3",3,"H",0,82.86,0,3151,261091.86]
[null,2,21,20,"PROFESIONAL TÉCNICO",1,1130,3,"000000TA","TÉCNICO INSTRUCTOR \"A\"","C","000000D4",4,"H",0,60.91,0,2304,140336.63999999998]
[null,1,12,4,"PRIMARIA GENERAL",1,1540,2,"00S01201","ASISTENTE DE SERV. BASICOS","C",2,2,"P",5832.15,0,68,0,396586.19999999995]
[null,1,12,4,"PRIMARIA GENERAL",1,1540,2,"0CF18201","AUXILIAR DE SEGURIDAD","C",2,2,"P",5832.15,0,15,0,87482.25]
[null,1,12,4,"PRIMARIA GENERAL",1,1540,2,"0CF18202","OPERADOR DE SERVICIOS BÁSICOS","C",2,2,"P",5832.15,0,1,0,5832.15]
[null,1,13,7,"SECUNDARIA GENERAL",1,1540,2,"00S01202","AUXILIAR DE SERV. GENERALES","C",4,4,"P",6355.5,0,54,0,343197]
[null,1,13,7,"SECUNDARIA GENERAL",1,1540,2,"0CF34202","PROMOTOR CULTURAL Y DEP.","C",5,5,"P",6619.2,0,9,0,59572.799999999996]
[null,1,13,7,"SECUNDARIA GENERAL",1,1540,2,"00A03202","SECRETARIA \"C\"","C",5,5,"P",6619.2,0,32,0,211814.39999999999]
[null,2,22,22,"BACHILLERATO GENERAL",1,1540,2,"0CF34201","TECNICO BIBLIOTECARIO","C",6,6,"P",6885.25,0,12,0,82623]
[null,2,22,22,"BACHILLERATO GENERAL",1,1540,2,"0ED01201","TECNICO EN MAT. DIDÁCTICOS","C",6,6,"P",6885.25,0,11,0,75737.75]
[null,2,22,22,"BACHILLERATO GENERAL",1,1540,2,"0CF19201","TUTOR ESCOLAR","C",6,6,"P",6885.25,0,15,0,103278.75]
[null,2,22,22,"BACHILLERATO GENERAL",1,1540,2,"0CF21202","ASISTENTE ESCOLAR Y S.","C",7,7,"P",7154.2,0,14,0,100158.8]
[null,2,22,22,"BACHILLERATO GENERAL",1,1540,2,"0CF04201","SECRETARIA \"B\"","C",7,7,"P",7154.2,0,14,0,100158.8]
[null,2,22,22,"BACHILLERATO GENERAL",1,1540,2,"00T08201","TECNICO EN GRAFICACIÓN","C",8,8,"P",7424.25,0,5,0,37121.25]
[null,2,22,22,"BACHILLERATO GENERAL",1,1540,2,"0CF33202","TECNICO EN CONTABILIDAD","C",9,9,"P",7968.45,0,7,0,55779.15]
[null,2,22,22,"BACHILLERATO GENERAL",1,1540,2,"0CF33203","TECNICO FINANCIERO","C",9,9,"P",7968.45,0,9,0,71716.05]
[null,2,22,22,"BACHILLERATO GENERAL",1,1540,2,"0CF18203","SUPERVISOR DE MTTO","C",9,9,"P",7968.45,0,19,0,151400.54999999999]
[null,2,22,22,"BACHILLERATO GENERAL",1,1540,2,"00A01801","ADMINISTRATIVO TEC. ESP.","C",11,11,"P",8254.75,0,10,0,82547.5]
[null,2,22,22,"BACHILLERATO GENERAL",1,1540,2,"0CF33204","SUBJEFE TECNICO ESP.","C",13,13,"P",13615.35,0,60,0,816921]
[null,3,32,31,"LICENCIATURA UNIVERSITARIA",1,1540,2,"0CF33206","JEFE DE PROYECTO","C",15,15,"P",20993.25,0,82,0,1721446.5]
[null,3,32,31,"LICENCIATURA UNIVERSITARIA",1,1540,5,"0CF02105","COORDINADOR EJECUTIVO","C",21,21,"P",25707.39,0,10,0,257073.9]
[null,3,32,31,"LICENCIATURA UNIVERSITARIA",1,1540,5,"0CF01601","JEFE DE UNIDAD","C",22,22,"P",29719.360000000001,0,7,0,208035.52000000002]
[null,3,32,31,"LICENCIATURA UNIVERSITARIA",1,1540,5,"0CF11102","DIRECTOR DE CENTRO","C",24,24,"P",37686.910000000003,0,3,0,113060.73000000001]
[null,3,32,31,"LICENCIATURA UNIVERSITARIA",1,1540,5,"0CF02100","SUBCOORDINADOR","C",25,25,"P",37378.76,0,1,0,37378.76]
[null,3,32,31,"LICENCIATURA UNIVERSITARIA",1,1540,5,"0CF02104","DIRECTOR DE PLANTEL \"D\" Y \"E\"","C",26,26,"P",29695.83,0,5,0,148479.15000000002]
[null,3,32,31,"LICENCIATURA UNIVERSITARIA",1,1540,5,"0CF02103","DIRECTOR DE PLANTEL \"B\" Y \"C\"","C",27,27,"P",30324.799999999999,0,8,0,242598.39999999999]
[null,3,32,31,"LICENCIATURA UNIVERSITARIA",1,1540,5,"0CF02102","DIRECTOR DE PLANTEL \"A\"","C",28,28,"P",30374.94,0,1,0,30374.94]
[null,3,32,31,"LICENCIATURA UNIVERSITARIA",1,1540,5,"0CF11100","REPRESENTANTE","C",30,30,"P",79876.210000000006,0,1,0,79876.210000000006]
[null,null,null,null,null,null,null,null,null,null,null,null,null,"Total Jornada:",{"$f":"SUBTOTAL(109,Tabla15[Monto mensual\npor plaza jornada])","v":447011.65},null,"Total Autorizado:",null,{"$f":"SUBTOTAL(109,Tabla15[Monto total autorizado])","v":6472459.7100000009}]
[null,null,null,null,null,null,null,null,null,null,null,null,null,"Total HSM",{"$f":"SUM(Tabla15[Monto mensual\nPor Plaza HSM])","v":344.39}]
[]
[null,"Fuente : Información proporcionada por las Entidades Federativas"]

{"sheet":"II D) 7 2 ","index":11,"n_rows":53,"n_cols":18,"rows_kept":53,"cut":false,"hidden":false,"merged":[[14,8,15,8],[14,9,14,13],[14,14,14,16],[10,16,10,17],[11,1,11,9],[14,1,15,1],[14,2,15,2],[14,3,15,3],[14,17,15,17],[14,6,15,6],[14,7,15,7],[14,4,15,4],[14,5,15,5]]}
[]
[]
[]
[]
[]
[]
[]
[]
[]
[]
[null,"Formato: Catálogo de Categorías y Tabuladores",null,null,null,null,null,null,null,null,null,null,null,null,null,"Entidad Federativa:",{"$f":"IF('Caratula Resumen'!D21=\"Elige el Periodo…\",\"\",'Caratula Resumen'!D21)","v":" GUANAJUATO "}]
[null,{"$f":"IF('Caratula Resumen'!D22=\"Elige el Periodo…\",\"\",'Caratula Resumen'!D22)","v":"Fondo de Aportaciones para la Educación Tecnológica y de Adultos/Colegio Nacional de Educación Profesional Técnica (FAETA/CONALEP)"},null,null,null,null,null,null,null,null,null,null,null,null,null,null,null,{"$f":"IF('Caratula Resumen'!D23=\"Elige el Periodo…\",\"\",'Caratula Resumen'!D23)","v":"1er. Trimestre"}]
[]
[]
[null,"Identificador origen presupuestal de la plaza","Clave de categoría","Descripción de la categoría","Tipo de contratación","Tipo de categoría","Clave de concepto de pago","Clave de nivel de puesto","Clave de nivel de sueldo","Sueldo asignado por zona económica",null,null,null,null,"Datos adicionales de horas",null,null,"Fecha de actualización"]
[null,null,null,null,null,null,null,null,null,"Inicio de vigencia del sueldo","Fin de vigencia del sueldo","Monto Mensual Jornada ó de HSM\nZona A","Monto Mensual Jornada ó de HSM\nZona B","Monto Mensual Jornada ó de HSM\nZona C","Horas \nde compatibilidad","Horas de servicio (HSM)","Horas de docencia"]
[]
[null,"Identificador origen presupuestal de la plaza","Clave de categoría","Descripción de la categoría","Tipo de contratación","Tipo de categoría","Clave de concepto de pago","Clave de nivel de puesto","Clave de nivel de sueldo","Inicio de vigencia del sueldo","Fin de vigencia del sueldo","Monto Mensual Jornada ó de HSM\nZona A","Monto Mensual Jornada ó de HSM\nZona B","Monto Mensual Jornada ó de HSM\nZona C","Horas \nde compatibilidad","Horas de servicio (HSM)","Horas de docencia","Fecha de actualización"]
[null,1,"0CF02105","COORDINADOR EJECUTIVO II","P",5,1003,21,21,201501,999999,0,0,25707.39,8,0,"00.0",20150101]
[null,1,"0CF01601","JEFE DE UNIDAD","P",5,1003,22,22,201501,999999,0,0,29719.360000000001,8,0,"00.0",20150101]
[null,1,"0CF11102","DIRECTOR DE CENTRO","P",5,1003,24,24,201501,999999,0,0,37686.910000000003,8,0,"00.0",20150101]
[null,1,"0CF02100","SUBCOORDINADOR","P",5,1003,25,25,201501,999999,0,0,37378.76,8,0,"00.0",20150101]
[null,1,"0CF02104","DIRECTOR DE PLANTEL \"D\" Y \"E\" II","P",5,1003,26,26,201501,999999,0,0,29695.83,8,0,"00.0",20150101]
[null,1,"0CF02103","DIRECTOR DE PLANTEL \"B\" Y \"C\" II","P",5,1003,27,27,201501,999999,0,0,30324.799999999999,8,0,"00.0",20150101]
[null,1,"0CF02102","DIRECTOR DE PLANTEL \"A\" II","P",5,1003,28,28,201501,999999,0,0,30374.94,8,0,"00.0",20150101]
[null,1,"0CF11100","REPRESENTANTE","P",5,1003,30,30,201501,999999,0,0,79876.210000000006,8,0,"00.0",20150101]
[null,1,"000000TA","DOCENTE TIPO 'TA'","H",1,1001,"000000D4",4,201501,999999,0,0,60.91,0,0,20,20150101]
[null,1,"000000PA","DOCENTE TIPO 'PA'","H",1,1001,"000000D3",3,201501,999999,0,0,82.86,0,0,20,20150101]
[null,1,"000000PB","DOCENTE TIPO 'PB'","H",1,1001,"000000D2",2,201501,999999,0,0,93.13,0,0,20,20150101]
[null,1,"000000PC","DOCENTE TIPO 'PC'","H",1,1001,"000000D1",1,201501,999999,0,0,107.49,0,0,20,20150101]
[null,1,"00S01201","ASISTENTE DE SERVICIOS BASICOS","P",2,1003,2,2,201501,999999,0,0,5832.15,8,0,"00.0",20150101]
[null,1,"0CF18201","AUXILIAR DE SEGURIDAD","P",2,1003,2,2,201501,999999,0,0,5832.15,8,0,"00.0",20150101]
[null,1,"0CF18202","OPERADOR DE SERVICIOS BASICOS","P",2,1003,2,2,201501,999999,0,0,5832.15,8,0,"00.0",20150101]
[null,1,"00S01202","AUXILIAR DE SERVICIOS GENERALES","P",2,1003,4,4,201501,999999,0,0,6355.5,8,0,"00.0",20150101]
[null,1,"0CF34202","PROMOTOR CULTURAL Y DEP","P",2,1003,5,5,201501,999999,0,0,6619.2,8,0,"00.0",20150101]
[null,1,"00A03202","SECRETARIA 'C'","P",2,1003,5,5,201501,999999,0,0,6619.2,8,0,"00.0",20150101]
[null,1,"0CF34201","TECNICO BIBILIOTECARIO","P",2,1003,6,6,201501,999999,0,0,6885.25,8,0,"00.0",20150101]
[null,1,"0ED01201","TECNICO DE MATS DIDACTICOS","P",2,1003,6,6,201501,999999,0,0,6885.25,8,0,"00.0",20150101]
[null,1,"0CF19201","TUTOR ESCOLAR","P",2,1003,6,6,201501,999999,0,0,6885.25,8,0,"00.0",20150101]
[null,1,"0CF21202","ASISTENTE ESCOLAR Y SOCIAL","P",2,1003,7,7,201501,999999,0,0,7154.2,8,0,"00.0",20150101]
[null,1,"0CF04201","SECRETARIA   B","P",2,1003,7,7,201501,999999,0,0,7154.2,8,0,"00.0",20150101]
[null,1,"00T08201","TECNICO EN GRAFICACION","P",2,1003,8,8,201501,999999,0,0,7424.25,8,0,"00.0",20150101]
[null,1,"0CF33202","TECNICO EN CONTABILIDAD","P",2,1003,9,9,201501,999999,0,0,7968.45,8,0,"00.0",20150101]
[null,1,"0CF33203","TECNICO FINANCIERO","P",2,1003,9,9,201501,999999,0,0,7968.45,8,0,"00.0",20150101]
[null,1,"0CF18203","SUPERVISOR DE MANTENIMIENTO","P",2,1003,9,9,201501,999999,0,0,7968.45,8,0,"00.0",20150101]
[null,1,"00A01801","ADMINISTRATIVO TECNICO ESPECIALISTA","P",2,1003,11,11,201501,999999,0,0,8254.75,8,0,"00.0",20150101]
[null,1,"0CF33204","SUBJEFE TECNICO ESPECIALISTA","P",2,1003,13,13,201501,999999,0,0,13615.35,8,0,"00.0",20150101]
[null,1,"0CF33206","JEFE DE PROYECTO","P",2,1003,15,15,201501,999999,0,0,20993.25,8,0,"00.0",20150101]
[null,null,null,null,null,null,null,null,null,null,"Total Zona A:",{"$f":"SUBTOTAL(109,Tabla16[Monto Mensual Jornada ó de HSM\nZona A])","v":0}]
[null,null,null,null,null,null,null,null,null,null,null,"Total Zona B:",{"$f":"SUM(M19:M49)","v":0}]
[null,null,null,null,null,null,null,null,null,null,null,null,"Total Zona C:",{"$f":"SUM(N19:N50)","v":447356.0400000001}]
[]
[null,"Fuente : Información proporcionada por las Entidades Federativas"]

{"sheet":"II D) 7 3","index":12,"n_rows":84,"n_cols":11,"rows_kept":84,"cut":false,"hidden":false,"merged":[[9,1,9,7],[8,9,8,10]]}
[]
[]
[]
[]
[]
[]
[]
[]
[null,"Formato: Catálogo de Percepciones y Deducciones",null,null,null,null,null,null,"Entidad Federativa:",{"$f":"IF('Caratula Resumen'!D21=\"Elige el Periodo…\",\"\",'Caratula Resumen'!D21)","v":" GUANAJUATO "}]
[null,{"$f":"IF('Caratula Resumen'!D22=\"Elige el Periodo…\",\"\",'Caratula Resumen'!D22)","v":"Fondo de Aportaciones para la Educación Tecnológica y de Adultos/Colegio Nacional de Educación Profesional Técnica (FAETA/CONALEP)"},null,null,null,null,null,null,null,null,{"$f":"IF('Caratula Resumen'!D23=\"Elige el Periodo…\",\"\",'Caratula Resumen'!D23)","v":"1er. Trimestre"}]
[]
[]
[null,"Identificador origen presupuestal de la plaza","Tipo de concepto de pago ","Origen de financiamiento del concepto de percepciones.","Porcentaje de participación federal por fuente de recursos","Grupo al que pertenece concepto de pago (Percepción y/o Deducción)","Clave de concepto de pago","Descripción del concepto de pago ","Partida presupuestal","Fecha del","Fecha  al"]
[]
[null,"Identificador origen presupuestal de la plaza","Tipo de concepto de pago ","Origen de financiamiento del concepto de percepciones.","Porcentaje de participación federal por fuente de recursos","Grupo al que pertenece concepto de pago (Percepción y/o Deducción)","Clave de concepto de pago","Descripción del concepto de pago ","Partida presupuestal","Fecha del","Fecha  al"]
[null,1,"P","F",100,"P0",1003,"Salario Base",1130,20150101,20151231]
[null,1,"P","F",100,"P1",2517,"Estímulo de Productividad",1540,20150101,20151231]
[null,1,"P","F",100,"P1",2800,"Despensa",1540,20150101,20151231]
[null,1,"P","F",100,"P1",1602,"Desarrollo y Capacitación",1540,20150101,20151231]
[null,1,"P","F",100,"P1",2766,"Prima de Antigüedad",1540,20150101,20151231]
[null,1,"P","F",100,"P1",2754,"Ayuda de Guardería",1540,20150101,20151231]
[null,1,"P","F",100,"P1",2615,"Canastilla Materna",1540,20150101,20151231]
[null,1,"P","F",100,"P1",2600,"Estímulo por Puntualidad y Asistencia",1540,20150101,20151231]
[null,1,"P","F",100,"P1",2680,"Anteojos  y/o Lentes de contacto",1540,20150101,20151231]
[null,1,"P","F",100,"P1",3503,"Pago por Defunción",1540,20150101,20151231]
[null,1,"P","F",100,"P1",1624,"Prima Dominical",1320,20150101,20151231]
[null,1,"P","F",100,"P1",3623,"Prima Vacacional",1320,20150101,20151231]
[null,1,"P","F",100,"P1",2850,"Labores en Condiciones Insalubres",1540,20150101,20151231]
[null,1,"P","F",100,"P1",2655,"Aparatos Ortopédicos",1540,20150101,20151231]
[null,1,"P","F",100,"P1",2627,"Estímulo por día de la Madres",1540,20150101,20151231]
[null,1,"P","F",100,"P1",2810,"Ayuda para Titulación",1540,20150101,20151231]
[null,1,"P","F",100,"P1",2625,"Ayuda para Utiles Escolares",1540,20150101,20151231]
[null,1,"P","F",100,"P1",1601,"Apoyo por contraer Nupcias",1540,20150101,20151231]
[null,1,"P","F",100,"P1",1603,"Compensación",1340,20150101,20151231]
[null,1,"P","F",100,"P1",5050,"Exceso del credito al salario",1130,20150101,20151231]
[null,1,"P","F",100,"P1",2553,"Días económicos",1540,20150101,20151231]
[null,1,"P","F",100,"P1",2565,"Ajuste salarial",1540,20150101,20151231]
[null,1,"P","F",100,"P1",2573,"Días de descanso obligatorio",1540,20150101,20151231]
[null,1,"P","F",100,"P1",1002,"subsidio al empleo",1130,20150101,20151231]
[null,1,"D",null,0,"D1",5045,"I.S.P.T. a Retener",0,20150101,20151231]
[null,1,"D",null,0,"D1",2920,"Seguro de Retiro",0,20150101,20151231]
[null,1,"D",null,0,"D1",2735,"Seg.Vida METLIFE de MEXICO",0,20150101,20151231]
[null,1,"D",null,0,"D2",8135,"Prestamo Issste",0,20150101,20151231]
[null,1,"D",null,0,"D1",8523,"Cuota Sindical Local",0,20150101,20151231]
[null,1,"D",null,0,"D1",6250,"Seg.Salud T.Activo",0,20150101,20151231]
[null,1,"D",null,0,"D1",6251,"Seg.Salud T.Pensionado",0,20150101,20151231]
[null,1,"D",null,0,"D1",6252,"Seg.Invalidez y Vida",0,20150101,20151231]
[null,1,"D",null,0,"D1",6253,"S.Sociales y Cult.",0,20150101,20151231]
[null,1,"D",null,0,"D1",6254,"S.Ret.Cesantia Avzda",0,20150101,20151231]
[null,1,"D",null,0,"D2",8095,"Cred. Hip. Creciente",0,20150101,20151231]
[null,1,"D",null,0,"D2",1927,"Seg. da%os Fovissste",0,20150101,20151231]
[null,1,"D",null,0,"D2",8580,"Pension Alimenticia",0,20150101,20151231]
[null,1,"D",null,0,"D3",2950,"Otras deducciones",0,20150101,20151231]
[null,1,"P","F",100,"P0",1001,"Salario Base del personal docente",1130,20150101,20151231]
[null,1,"P","F",100,"P1",1002,"subsidio al empleo del personal docente",3301,20150101,20151231]
[null,1,"P","F",100,"P1",1019,"Bonificación (graba para ISPT) del personal docente",1590,20150101,20151231]
[null,1,"P","F",100,"P1",1020,"Bonificación (no graba para ISPT) del personal docente",1590,20150101,20151231]
[null,1,"P","F",100,"P1",1021,"Prima Vacacional",1320,20150101,20151231]
[null,1,"P","F",100,"P1",1005,"Estimulo al desempeño docente",1710,20150101,20151231]
[null,1,"P","F",100,"P1",1006,"Horas recuperadas",1540,20150101,20151231]
[null,1,"D",null,0,"D1",2001,"I.S.P.T. a Retener del personal docente",0,20150101,20151231]
[null,1,"D",null,0,"D2",2002,"Cuota Sindical Local del personal docente",0,20150101,20151231]
[null,1,"D",null,0,"D2",2003,"Seg. de salud activo para el personal docente",0,20150101,20151231]
[null,1,"D",null,0,"D2",2004,"Seg. de salud t. pensionado del personal docente",0,20150101,20151231]
[null,1,"D",null,0,"D2",2005,"Seg. invalidez y vida del personal docente",0,20150101,20151231]
[null,1,"D",null,0,"D2",2006,"S. social y cultural del personal docente",0,20150101,20151231]
[null,1,"D",null,0,"D2",2007,"S.Ret.Cesantia Avzda del personal docente",0,20150101,20151231]
[null,1,"D",null,0,"D2",2008,"Horas no impartidas del personal docente",0,20150101,20151231]
[null,1,"D",null,0,"D2",2009,"Pensión alimenticia del personal docente",0,20150101,20151231]
[null,1,"D",null,0,"D3",2010,"Otros descuentos del personal docente",0,20150101,20151231]
[null,1,"D",null,0,"D2",2011,"Descuento por retardos del personal docente",0,20150101,20151231]
[null,1,"D",null,0,"D2",2015,"Crédito hipotecario del personal docente",0,20150101,20151231]
[null,1,"D",null,0,"D2",2014,"Préstamo personal del personal docente",0,20150101,20151231]
[null,1,"D",null,0,"D2",2021,"Ahorro solidario del personal docente",0,20150101,20151231]
[null,1,"P","F",100,"P1",2805,"Previsión Múltiple",1540,20150101,20151231]
[null,1,"P","F",100,"P1",1022,"Asesorías Complementarias",1130,20150101,20151231]
[null,1,"P","F",100,"P1",1023,"Interinatos",1130,20150101,20151231]
[null,1,"D",null,100,"D2",2010,"Ajuste por pago indebido",0,20150101,20151231]
[null,1,"D",null,100,"D2",2016,"Seguro de Daños de Fovissste",0,20150101,20151231]
[null,1,"D",null,100,"D2",2017,"Cuota Sindical para Docentes TD",0,20150101,20151231]
[null,1,"D",null,100,"D2",2022,"Seguro de Vida",0,20150101,20151231]
[null,1,"P","F",100,"P1",1004,"Aguinaldo Personal Docente",1320,20150101,20151231]
[null,1,"P","F",100,"P1",3613,"Aguinaldo",1320,20150101,20151231]
[null,"Fuente : Información proporcionada por las Entidades Federativas"]

{"sheet":"E)","index":13,"n_rows":26,"n_cols":8,"rows_kept":26,"cut":false,"hidden":false,"merged":[[9,1,9,5],[12,1,14,1],[12,2,14,2],[13,7,14,7],[12,3,14,3],[12,4,14,4],[12,5,12,7],[13,5,14,5],[13,6,14,6]]}
[]
[]
[]
[]
[]
[]
[]
[]
[null,"Formato: Trabajadores que Cobran con RFC / CURP con Formato Incorrecto"]
[null,{"$f":"IF('Caratula Resumen'!D22=\"Elige el Periodo…\",\"\",'Caratula Resumen'!D22)","v":"Fondo de Aportaciones para la Educación Tecnológica y de Adultos/Colegio Nacional de Educación Profesional Técnica (FAETA/CONALEP)"},null,null,null,null,null,{"$f":"IF('Caratula Resumen'!D23=\"Elige el Periodo…\",\"\",'Caratula Resumen'!D23)","v":"1er. Trimestre"}]
[]
[]
[null,"Entidad Federativa","RFC","CURP","NOMBRE TRABAJADOR","Motivo"]
[null,null,null,null,null,"Sin RFC o erroneo","RFC Sin Homoclave","Sin CURP o Erronea"]
[]
[]
[null,"Entidad Federativa","RFC","CURP","NOMBRE TRABAJADOR","Sin RFC o erroneo","RFC Sin Homoclave","Sin CURP o Erronea"]
[]
[]
[]
[]
[]
[null,"Total Personas : ",null,null,"Total Sin RFC o Erroneo:"]
[null,null,null,null,null,"Total RFC Sin Homoclave:"]
[null,null,null,null,null,null,"Total Sin CURP o Erroneo:"]
[null,"Fuente : Información proporcionada por las Entidades Federativas"]

{"sheet":"F) 1","index":14,"n_rows":26,"n_cols":19,"rows_kept":26,"cut":false,"hidden":false,"merged":[[9,1,9,6],[12,15,13,15],[12,16,13,16],[12,17,12,18],[12,1,13,1],[12,2,13,2],[12,3,13,3],[12,4,13,4],[12,5,13,5],[12,6,13,6],[12,7,13,7],[12,8,12,14]]}
[]
[]
[]
[]
[]
[]
[]
[]
[null,"Formato: Trabajadores con Doble Asignación Salarial en Municipios no Colindantes Geográficamente"]
[null,{"$f":"IF('Caratula Resumen'!D22=\"Elige el Periodo…\",\"\",'Caratula Resumen'!D22)","v":"Fondo de Aportaciones para la Educación Tecnológica y de Adultos/Colegio Nacional de Educación Profesional Técnica (FAETA/CONALEP)"},null,null,null,null,null,null,null,null,null,null,null,null,null,null,null,null,{"$f":"IF('Caratula Resumen'!D23=\"Elige el Periodo…\",\"\",'Caratula Resumen'!D23)","v":"1er. Trimestre"}]
[]
[]
[null,"Entidad Federativa","Municipio","Localidad","RFC","CURP","Nombre del Trabajador","Clave integrada","Clave Presupuestal",null,null,null,null,null,null,"Clave CT","Nombre CT","Periodo en el CT"]
[null,null,null,null,null,null,null,null,"Partida Presupuestal","Código de Pago","Clave de Unidad","Clave de Sub Unidad","Clave de Categoría","Horas Semana Mes ","Número de Plaza",null,null,"Desde","Hasta"]
[]
[null,"Entidad Federativa","Municipio","Localidad","RFC","CURP","Nombre del Trabajador","Clave integrada","Partida Presupuestal","Código de Pago","Clave de Unidad","Clave de Sub Unidad","Clave de Categoría","Horas semana mes","Número de Plaza","Clave CT","Nombre CT","Periodo en el CT\nDesde","Periodo en el CTH\nasta"]
[]
[]
[]
[]
[]
[null,"Total Personas : ",null,null,null,null,null,null,null,null,null,null,"Total Plazas : "]
[]
[]
[null,"Fuente : Información proporcionada por las Entidades Federativas"]
[null,"Importante: Listar Sólo los Municipios no Colindantes"]

{"sheet":"F) 2","index":15,"n_rows":26,"n_cols":20,"rows_kept":26,"cut":false,"hidden":false,"merged":[[13,3,14,3],[13,4,14,4],[13,5,14,5],[10,1,10,9],[13,19,14,19],[13,18,14,18],[13,6,13,12],[13,13,14,13],[13,14,14,14],[13,15,14,15],[13,16,13,17],[13,1,14,1],[13,2,14,2]]}
[]
[]
[]
[]
[]
[]
[]
[]
[]
[null,"Formato: Trabajadores Ocupando Plazas que Superan el Número de Horas de Compatibilidad Autorizadas"]
[null,{"$f":"IF('Caratula Resumen'!D22=\"Elige el Periodo…\",\"\",'Caratula Resumen'!D22)","v":"Fondo de Aportaciones para la Educación Tecnológica y de Adultos/Colegio Nacional de Educación Profesional Técnica (FAETA/CONALEP)"},null,null,null,null,null,null,null,null,null,null,null,null,null,null,null,null,{"$f":"IF('Caratula Resumen'!D23=\"Elige el Periodo…\",\"\",'Caratula Resumen'!D23)","v":"1er. Trimestre"}]
[]
[]
[null,"Entidad Federativa","RFC","CURP","Nombre","Clave integrada","Clave Presupuestal",null,null,null,null,null,null,"CT","Nombre CT","Turno CT","Periodo",null,"Total de Horas en el CT","Horas de compatibilidad de la categoría"]
[null,null,null,null,null,null,"Partida Presupuestal","Código de Pago","Clave de Unidad","Clave de Sub Unidad","Clave de Categoría","Horas Semana Mes ","Número de Plaza",null,null,null,"Desde","Hasta"]
[]
[null,"Entidad Federativa","RFC","CURP","Nombre","Clave integrada","Partida Presupuestal","Código de Pago","Clave de Unidad","Clave de Sub Unidad","Clave de Categoría","Horas semana mes","Número de plaza","CT","Nombre CT","Turno CT","Periodo\nDesde","Periodo\nHasta","Total de Horas en el CT","Horas de compatibilidad de la categoría"]
[]
[]
[]
[]
[]
[null,"Total Personas : ",null,null,null,null,null,null,null,null,"Total Plazas : "]
[]
[]
[null,"Fuente : Información proporcionada por las Entidades Federativas"]

{"sheet":"G)","index":16,"n_rows":28,"n_cols":20,"rows_kept":28,"cut":false,"hidden":false,"merged":[[10,1,10,8],[12,5,12,11],[13,1,14,1],[13,2,14,2],[13,3,14,3],[13,4,14,4],[13,5,14,5],[13,6,13,12],[13,19,14,19],[13,13,14,13],[13,14,14,14],[13,15,13,16],[13,17,14,17],[13,18,14,18]]}
[]
[]
[]
[]
[]
[]
[]
[]
[]
[null,"Formato: Trabajadores Cuyo Salario Básico Supere los Ingresos Promedio de un Docente en la Categoría más Alta del Tabulador Salarial Correspondiente a Cada Entidad"]
[null,{"$f":"IF('Caratula Resumen'!D22=\"Elige el Periodo…\",\"\",'Caratula Resumen'!D22)","v":"Fondo de Aportaciones para la Educación Tecnológica y de Adultos/Colegio Nacional de Educación Profesional Técnica (FAETA/CONALEP)"},null,null,null,null,null,null,null,null,null,null,null,null,null,null,null,null,null,{"$f":"IF('Caratula Resumen'!D23=\"Elige el Periodo…\",\"\",'Caratula Resumen'!D23)","v":"1er. Trimestre"}]
[]
[]
[null,"Entidad Federativa","R.F.C.","CURP","Nombre","Clave integrada","Clave Presupuestal Integrada y Categoria aparte",null,null,null,null,null,null,"Clave CT Origen","Nombre CT","Periodo",null,"Monto de Remuneraciones Mensuales ","Monto de referencia","Diferencia\n(R-S)"]
[null,null,null,null,null,null,"Partida Presupuestal","Código de Pago","Clave de Unidad","Clave de Sub Unidad","Clave de Categoría","Horas Semana Mes ","Número de Plaza",null,null,"Desde","Hasta"]
[]
[null,"Entidad Federativa","R.F.C.","CURP","Nombre","Clave integrada","Partida Presupuestal","Código de Pago","Clave de Unidad","Clave de Sub Unidad","Clave de Categoría","Horas Semana Mes ","No. de plaza","CT","Nombre CT","Periodo\nDesde","Periodo\nHasta","Monto de Remuneraciones Mensuales ","Monto de referencia","Diferencia\n(R-S)"]
[]
[]
[]
[]
[]
[]
[null,"Total Personas : ",null,null,null,null,null,null,null,null,null,null,null,null,"Total Remuneraciones Mensuales:"]
[]
[null,null,null,null,null,null,null,null,null,null,null,null,null,null,null,null,null,"Total Diferencia:"]
[]
[null,"Fuente : Información proporcionada por las Entidades Federativas"]

{"sheet":"Listas","index":17,"n_rows":42,"n_cols":8,"rows_kept":42,"cut":false,"hidden":true,"merged":[]}
[]
[]
[]
[null,"Elige un Fondo…"]
[null,"Fondo de Aportaciones para la Educación Básica y Normal (FAEB)"]
[null,"Fondo de Aportaciones para la Educación Tecnológica y de Adultos/Colegio Nacional de Educación Profesional Técnica (FAETA/CONALEP)"]
[null,"Fondo de Aportaciones para la Educación Tecnológica y de Adultos/Instituto Nacional para la Educación de los Adultos (FAETA/INEA)"]
[]
[]
[null,null,null,null,null,null,null,"Elige la Entidad Federativa…"]
[null,"Elige el Periodo…",null,null,null,null,null,"AGUASCALIENTES"]
[null,"1er. Trimestre",null,null,null,null,null,"BAJA CALIFORNIA"]
[null,"2do. Trimestre",null,null,null,null,null,"BAJA CALIFORNIA SUR"]
[null,"3er. Trimestre",null,null,null,null,null,"CAMPECHE"]
[null,"4to. Trimestre",null,null,null,null,null,"COAHUILA "]
[null,null,null,"Elige el Año…",null,null,null,"COLIMA "]
[null,null,null,2013,null,null,null,"CHIAPAS "]
[null,null,null,2014,null,null,null,"CHIHUAHUA "]
[null,null,null,2015,null,null,null,"DISTRITO FEDERAL"]
[null,null,null,2016,null,null,null," DURANGO "]
[null,null,null,2017,null,null,null," GUANAJUATO "]
[null,null,null,2018,null,null,null," GUERRERO "]
[null,null,null,null,null,null,null," HIDALGO"]
[null,null,null,null,null,null,null," JALISCO "]
[null,null,null,null,null,null,null," MEXICO "]
[null,null,null,null,null,null,null," MICHOACAN "]
[null,null,null,null,null,null,null," MORELOS "]
[null,null,null,null,null,null,null," NAYARIT "]
[null,null,null,null,null,null,null," NUEVO LEON"]
[null,null,null,null,null,null,null," OAXACA "]
[null,null,null,null,null,null,null," PUEBLA "]
[null,null,null,null,null,null,null," QUERETARO "]
[null,null,null,null,null,null,null," QUINTANA ROO"]
[null,null,null,null,null,null,null," SAN LUIS"]
[null,null,null,null,null,null,null," SINALOA "]
[null,null,null,null,null,null,null," SONORA "]
[null,null,null,null,null,null,null," TABASCO "]
[null,null,null,null,null,null,null," TAMAULIPAS "]
[null,null,null,null,null,null,null," TLAXCALA "]
[null,null,null,null,null,null,null," VERACRUZ"]
[null,null,null,null,null,null,null," YUCATÁN "]
[null,null,null,null,null,null,null," ZACATECAS "]