{"text_format":"1","workbook":"xlsx","n_sheets":18,"sheets":["Caratula Resumen","A Y  II D3","A Y II D4","B)","II B) Y 1","II C y 1_","II D) 2","II D) 4","II D) 4 A","II D) 6","II D) 7 1","II D) 7 2 ","II D) 7 3","E)","F) 1","F) 2","G)","Listas"],"not_rendered":{"charts":0,"images":16,"macros":1,"external_links":0,"defined_names":17,"comments":16,"pivot_tables":0},"unopened":[],"bounds":{"document_bytes":16777216,"sheet_cells":100000,"rows_first":2000,"rows_last":500,"rows_between":2000,"halvings":0,"cell_chars":16384,"cell_head_chars":4096},"cells_cut":0,"cells_raw":0,"read":"whole","date_system":"1900"}

{"sheet":"Caratula Resumen","index":0,"n_rows":73,"n_cols":18,"rows_kept":73,"cut":false,"hidden":false,"merged":[[69,2,69,5],[71,2,71,5],[72,2,72,5],[73,2,73,5],[20,3,20,14],[21,3,21,14],[22,3,22,14],[49,3,49,6],[62,2,62,5],[63,2,63,5],[65,2,65,5],[66,2,66,5],[68,2,68,5],[43,3,43,6],[44,3,44,6],[45,3,45,6],[46,3,46,6],[47,3,47,6],[48,3,48,6],[37,3,37,6],[38,3,38,6],[39,3,39,6],[40,3,40,6],[41,3,41,6],[42,3,42,6],[36,3,36,6],[10,3,10,18],[11,3,11,18],[12,3,12,18],[34,3,34,6],[35,3,35,6]]}
[]
[]
[]
[]
[]
[]
[]
[]
[]
[]
[]
[null,null,null,"FORMATOS ENTREGADOS PARA DAR CUMPLIMIENTO AL ARTICULO 73 DE \"LA LEY GENERAL DE CONTABILIDAD GUBERNAMENTAL\""]
[]
[]
[]
[]
[]
[]
[]
[]
[null,null,"Entidad Federativa :"," GUANAJUATO "]
[null,null,"Fondo :","Fondo de Aportaciones para la Educación Tecnológica y de Adultos/Instituto Nacional para la Educación de los Adultos (FAETA/INEA)"]
[null,null,"Periodo :","4to. Trimestre"]
[]
[]
[]
[]
[]
[]
[]
[]
[null,null,null,null,null,null,null,"TOTAL REGISTROS ",null,"Num. de Paginas",null,"TOTAL PERSONAS",null,"TOTAL PLAZAS",null,"Total Pto. Federal",null,"Total Ppto. Otras Fuentes"]
[]
[]
[null,1,"A Y II D3","Personal Comisionado",null,null,null,0,null,1,null,0,null,0,null,0,null,0]
[null,2,"A Y II D4","Personal con Licencia",null,null,null,0,null,1,null,0,null,0,null,0,null,0]
[null,3,"B)   ","Registro Federal de Contribuyentes de Trabajadores con Pagos Retroactivos con un Periodo Mayor a 45 días",null,null,null,0,null,1,null,0,null,0,null,"N/A",null,"N/A"]
[null,4,"II B) Y 1","Plaza / Función",null,null,null,270,null,6,null,270,null,"N/A",null,"N/A",null,"N/A"]
[null,5,"II C y 1_","Personal Federalizado por Registro Federal de Contribuyentes",null,null,null,7,null,7]
[null,6,"II D) 2","Movimientos de Plazas",null,null,null,189,null,6,null,189,null,189,null,"N/A",null,"N/A"]
[null,7,"II D) 4","Trabajadores Jubilados en el Periodo",null,null,null,0,null,1,null,0,null,0,null,"N/A",null,"N/A"]
[null,8,"II D) 4 A","Trabajadores que Tramitaron Licencia Prejubilatoria en el Periodo",null,null,null,0,null,1,null,0,null,0,null,0,null,0]
[null,9,"II D) 6","Trabajadores Contratados por Honorarios en el Periodo",null,null,null,11,null,1,null,11,null,"N/A",null,"N/A",null,"N/A"]
[null,10,"II D) 7 1 ","Analítico de Categorías / Plazas Autorizadas con su Tabulador",null,null,null,17,null,1,null,"N/A",null,"N/A",null,"N/A",null,"N/A"]
[null,11,"II D) 7 2 ","Catálogo de Categorías y Tabuladores",null,null,null,191,null,6,null,"N/A",null,"N/A",null,"N/A",null,"N/A"]
[null,12,"II D) 7 3 ","Catálogo de Percepciones y Deducciones",null,null,null,220,null,7,null,"N/A",null,"N/A",null,"N/A",null,"N/A"]
[null,13,"E)","Trabajadores que Cobran con RFC / CURP con Formato Incorrecto",null,null,null,0,null,1,null,0,null,"N/A",null,"N/A",null,"N/A"]
[null,14,"F) 1","Trabajadores con Doble Asignación Salarial en Municipios no Colindantes Geográficamente",null,null,null,0,null,1,null,0,null,"N/A",null,"N/A",null,"N/A"]
[null,15,"F) 2","Trabajadores Ocupando Plazas que Superan el Número de Horas de Compatibilidad Autorizadas",null,null,null,1,null,1,null,1,null,1,null,"N/A",null,"N/A"]
[null,16,"G)","Trabajadores Cuyo Salario Básico Supere los Ingresos Promedio de un Docente en la Categoría más Alta del Tabulador Salarial Correspondiente a Cada Entidad",null,null,null,0,null,1,null,1,null,"N/A",null,"N/A",null,"N/A"]
[]
[]
[]
[]
[]
[]
[]
[]
[]
[]
[]
[]
[null,null,"C.P. ESMERALDA HERNANDEZ ESCOGIDO"]
[null,null,"Nombre del  Responsable"]
[]
[null,null,"ENCARGADA DE LA OFICINA DE RECURSOS HUMANOS"]
[null,null,"Cargo"]
[]
[]
[null,null,"Firma"]
[]
[null,null,"19 DE ENERO DE 2016"]
[null,null,"Fecha"]

{"sheet":"A Y  II D3","index":1,"n_rows":27,"n_cols":25,"rows_kept":27,"cut":false,"hidden":false,"merged":[[9,1,9,7],[12,6,12,12],[12,1,13,1],[12,2,13,2],[12,3,13,3],[12,4,13,4],[12,5,13,5],[23,12,23,14],[12,24,13,24],[12,13,12,14],[12,15,13,15],[12,16,13,16],[12,17,13,17],[12,18,12,19],[12,20,13,20],[21,13,21,14],[12,21,13,21],[12,22,13,22],[12,23,13,23]]}
[]
[]
[]
[]
[]
[]
[]
[]
[null,"Formato: Personal Comisionado"]
[null,{"$f":"IF('Caratula Resumen'!D22=\"Elige el Periodo…\",\"\",'Caratula Resumen'!D22)","v":"Fondo de Aportaciones para la Educación Tecnológica y de Adultos/Instituto Nacional para la Educación de los Adultos (FAETA/INEA)"},null,null,null,null,null,null,null,null,null,null,null,null,null,null,null,null,null,null,null,null,null,{"$f":"IF('Caratula Resumen'!D23=\"Elige el Periodo…\",\"\",'Caratula Resumen'!D23)","v":"4to. Trimestre"}]
[]
[]
[null,"Entidad Federativa","R.F.C.","CURP","Nombre","Clave integrada","Clave Presupuestal",null,null,null,null,null,null,"Fecha Comisión",null,"Percepciones pagadas en el Periodo de Comisión con Presupuesto Federal*","Percepciones pagadas en el Periodo de Comisión con Presupuesto de otra fuente*","Clave CT Origen","CT Destino dentro del sector",null,"Lugar de la comisión fuera del sector educativo","Tipo de Comisión","Función Específica","Objeto de la comision","No. Oficio"]
[null,null,null,null,null,null,"Partida Presupuestal","Código de Pago","Clave de Unidad","Clave de Sub Unidad","Clave de Categoría","Horas Semana Mes ","Número de Plaza","Inicio","Conclusión",null,null,null,"Clave","Turno"]
[]
[null,"Entidad Federativa","R.F.C.","CURP","Nombre","Clave integrada","Partida Presupuestal","Código de Pago","Clave de Unidad","Clave de Sub Unidad","Clave de Categoría","Horas Semana Mes ","Número de Plaza","Fecha Comisión\nInicio","Fecha Comisión\nConclusión","Percepciones pagadas en el Periodo de Comisión con Presupuesto Federal*","Percepciones pagadas en el Periodo de Comisión con Presupuesto de otra fuente*","Clave CT Origen","Clave","Turno","Lugar de la comisión fuera del sector educativo","Tipo de Comisión","Función Específica","Objeto de la comision","No. Oficio"]
[]
[]
[]
[]
[]
[null,"Total Personas : ",null,null,null,null,null,null,null,null,"Total Plazas : ",null,null,"Total Pto. Federal"]
[]
[null,null,null,null,null,null,null,null,null,null,null,null,"Total Ppto. Otras Fuentes"]
[]
[null,"*Total de Percepciones reportadas por la Entidad Federativa como pagadas al trabajador durante la comisión."]
[null,"Fuente : Información proporcionada por las Entidades Federativas."]

{"sheet":"A Y II D4","index":2,"n_rows":27,"n_cols":21,"rows_kept":27,"cut":false,"hidden":false,"merged":[[9,1,9,6],[21,13,21,14],[12,16,13,16],[12,17,13,17],[12,20,13,20],[12,1,13,1],[12,3,13,3],[12,4,13,4],[12,5,13,5],[12,6,12,12],[12,13,12,14],[12,2,13,2],[12,18,12,19],[12,15,13,15]]}
[]
[]
[]
[]
[]
[]
[]
[]
[null,"Formato: Personal con Licencia"]
[null,{"$f":"IF('Caratula Resumen'!D22=\"Elige el Periodo…\",\"\",'Caratula Resumen'!D22)","v":"Fondo de Aportaciones para la Educación Tecnológica y de Adultos/Instituto Nacional para la Educación de los Adultos (FAETA/INEA)"},null,null,null,null,null,null,null,null,null,null,null,null,null,null,null,null,null,null,{"$f":"IF('Caratula Resumen'!D23=\"Elige el Periodo…\",\"\",'Caratula Resumen'!D23)","v":"4to. Trimestre"}]
[]
[]
[null,"Entidad Federativa","R.F.C.","CURP","NOMBRE","Clave integrada","Clave Presupuestal",null,null,null,null,null,null,"Periodo Licencia",null,"Percepciones pagadas en el Periodo de la Licencia con Presupuesto Federal*","Percepciones pagadas en el Periodo de la Licencia con Presupuesto de otra fuente*","Clave CT Origen","Licencia",null,"Descripción de la Licencia"]
[null,null,null,null,null,null,"Partida Presupuestal","Código de Pago","Clave de Unidad","Clave de Sub Unidad","Clave de Categoría","Horas Semana Mes ","Número de Plaza","Inicio","Conclusión",null,null,null,"Clave","Tipo"]
[]
[null,"Entidad Federativa","R.F.C.","CURP","NOMBRE","Clave integrada","Partida Presupuestal","Código de Pago","Clave de Unidad","Clave de Sub Unidad","Clave de Categoría","Horas Semana Mes ","Número de Plaza","Periodo Licencia\nInicio","Periodo Licencia\nConclusión","Percepciones pagadas en el Periodo de la Licencia con Presupuesto Federal*","Percepciones pagadas en el Periodo de la Licencia con Presupuesto de otra fuente*","Clave CT Origen","Licencia\nClave","Licencia\nTipo","Descripción de la Licencia"]
[]
[]
[]
[]
[]
[null,"Total Personas : ",null,null,null,null,null,null,null,null,"Total Plazas : ",null,null,"Total Pto. Federal"]
[]
[null,null,null,null,null,null,null,null,null,null,null,null,null,"Total Ppto. Otras Fuentes"]
[]
[null,"*Total de Percepciones reportadas por la Entidad Federativa como pagadas al trabajador durante la Licencia."]
[null,"Fuente : Información proporcionada por las Entidades Federativas."]

{"sheet":"B)","index":3,"n_rows":27,"n_cols":19,"rows_kept":27,"cut":false,"hidden":false,"merged":[[9,1,9,10],[12,1,13,1],[12,2,13,2],[12,3,13,3],[12,4,13,4],[12,5,12,11],[12,18,13,18],[12,12,13,12],[12,13,13,13],[12,14,13,14],[12,15,12,16],[12,17,13,17]]}
[]
[]
[]
[]
[]
[]
[]
[]
[null,"Formato: Registro Federal de Contribuyentes de Trabajadores con Pagos Retroactivos con un Periodo Mayor a 45 días"]
[null,{"$f":"IF('Caratula Resumen'!D22=\"Elige el Periodo…\",\"\",'Caratula Resumen'!D22)","v":"Fondo de Aportaciones para la Educación Tecnológica y de Adultos/Instituto Nacional para la Educación de los Adultos (FAETA/INEA)"},null,null,null,null,null,null,null,null,null,null,null,null,null,null,null,{"$f":"IF('Caratula Resumen'!D23=\"Elige el Periodo…\",\"\",'Caratula Resumen'!D23)","v":"4to. Trimestre"}]
[]
[]
[null,"Entidad Federativa","RFC","CURP","Nombre","Clave Presupuestal",null,null,null,null,null,null,"Clave de Centro de Trabajo","Fecha de emisión de pago","Motivo del Pago Retroactivo","Periodo pagado",null,"Días transcurridos para el pago","Percepciones pagadas en el periodo reportado *"]
[null,null,null,null,null,"Partida Presupuestal","Código de Pago","Clave de Unidad","Clave de Sub Unidad","Clave de Categoría","Horas Semana Mes ","Número de Plaza",null,null,null,"Desde","Hasta"]
[]
[null,"Entidad Federativa","RFC","CURP","Nombre","Partida Presupuestal","Código de Pago","Clave de Unidad","Clave de Sub Unidad","Clave de Categoría","Horas semana mes","Número de plaza","Clave de Centro de Trabajo","Fecha de emisión de pago","Motivo del Pago Retroactivo","Periodo pagado\nDesde","Periodo pagado\nHasta","Días transcurridos para el pago","Percepciones pagadas en el periodo reportado *"]
[]
[]
[]
[]
[]
[null,"Total Personas : ",null,null,null,null,null,null,null,null,"Total Plazas : ",null,null,null,null,"Total Percepciones Pagadas:"]
[]
[]
[]
[null,"*Total de Percepciones reportadas por la Entidad Federativa como pagadas en el periodo "]
[null,"Fuente : Información proporcionada por las Entidades Federativas"]

{"sheet":"II B) Y 1","index":4,"n_rows":290,"n_cols":25,"rows_kept":290,"cut":false,"hidden":false,"merged":[[12,24,14,24],[13,6,13,8],[13,9,13,11],[13,12,13,14],[13,15,13,17],[13,18,13,20],[12,6,12,20],[12,21,14,21],[12,22,14,22],[12,23,14,23],[12,4,14,4],[12,3,14,3],[12,2,14,2],[9,1,9,9],[287,21,287,23],[12,1,14,1],[12,5,14,5]]}
[]
[]
[]
[]
[]
[]
[]
[]
[null,"Formato: Plaza / Función"]
[null,{"$f":"IF('Caratula Resumen'!D22=\"Elige el Periodo…\",\"\",'Caratula Resumen'!D22)","v":"Fondo de Aportaciones para la Educación Tecnológica y de Adultos/Instituto Nacional para la Educación de los Adultos (FAETA/INEA)"},null,null,null,null,null,null,null,null,null,null,null,null,null,null,null,null,null,null,null,null,null,{"$f":"IF('Caratula Resumen'!D23=\"Elige el Periodo…\",\"\",'Caratula Resumen'!D23)","v":"4to. Trimestre"}]
[]
[]
[null,"Entidad Federativa","RFC","CURP","Nombre","Centros de Trabajo","Plazas por tipo de función",null,null,null,null,null,null,null,null,null,null,null,null,null,null,"Total plazas Jornada","Total \nHSM","Total de Honorarios","Total de recursos presupuestales ejercidos en servicios personales en el periodo\n(2)"]
[null,null,null,null,null,null,"Apoyo a la labor educativa",null,null,"Administrativo y de servicio",null,null,"Docente y Apoyo Técnico Pedagógico",null,null,"Directivos y Supervisión",null,null,"Mandos medios y superiores"]
[null,null,null,null,null,null,"Jornada","HSM","Honorarios","Jornada","HSM","Honorarios","Jornada","HSM","Honorarios","Jornada","HSM","Honorarios","Jornada","HSM","Honorarios"]
[]
[null,"Entidad Federativa","RFC","CURP","Nombre","Centros de Trabajo","Jornada","HSM","Honorarios","Jornada2","HSM3","Honorarios4","Jornada5","HSM6","Honorarios7","Jornada8","HSM9","Honorarios10","Jornada11","HSM12","Honorarios13","Total plazas Jornada","Total \nHSM","Total de Honorarios","Total de recursos presupuestales ejercidos en servicios personales en el periodo\n(2)"]
[null,"GUANAJUATO","COPC760616J13","COPC760616HGTRTR05","CARLOS ALBERTO CORDOBA PATIﾑO",1,0,0,0,0,0,0,7,35,0,0,0,0,0,0,0,1,35,0,42555]
[null,"GUANAJUATO","TOMG850829D80","TOMG850829HGTRRD08","JOSE GUADALUPE DE LA TORRE MARQUEZ",1,0,0,0,0,0,0,7,35,0,0,0,0,0,0,0,1,35,0,45334]
[null,"GUANAJUATO","TEMY831012PC7","TEMY831012MGTRDD05","YADIRA ELISA TERAN MEDINA",1,0,0,0,0,0,0,7,35,0,0,0,0,0,0,0,1,35,0,46589]
[null,"GUANAJUATO","SACM760716KV0","SACM760716MJCNSN08","MONICA DEL CARMEN SANDOVAL CASTELLON",1,0,0,0,0,0,0,7,35,0,0,0,0,0,0,0,1,35,0,45907]
[null,"GUANAJUATO","COSY800415BF0","COSY800415MGTRVN04","YUNERY CORTES SAAVEDRA",1,0,0,0,0,0,0,7,35,0,0,0,0,0,0,0,1,35,0,42027]
[null,"GUANAJUATO","AAPR490907F72","AAPR490907MDFLLS06","MA. DEL ROSARIO ROCIO ALMAGRO PALATO",1,0,0,0,0,0,0,7,35,0,0,0,0,0,0,0,1,35,0,42322]
[null,"GUANAJUATO","MADT730323NL2","MADT730323MGTTVR17","TERESITA DE JESUS MATA DAVALOS",1,0,0,0,0,0,0,7,35,0,0,0,0,0,0,0,1,35,0,48615]
[null,"GUANAJUATO","GOAA581209FLA","GOAA581209MGTNGL08","ALICIA GONZALEZ AGUIRRE",1,0,0,0,0,0,0,7,35,0,0,0,0,0,0,0,1,35,0,46665]
[null,"GUANAJUATO","MAAC750527A26","MAAC750527MGTRGR07","CAROLINA MARTINEZ AGREDA",1,0,0,0,0,0,0,7,35,0,0,0,0,0,0,0,1,35,0,40450]
[null,"GUANAJUATO","PECA660503AR0","PECA660503MGTRBN07","ANTONIA PEREZ CABELLO",1,0,0,0,0,0,0,7,35,0,0,0,0,0,0,0,1,35,0,45933]
[null,"GUANAJUATO","CASR640104TEA","CASR640104MGTBNS05","ROSA MARIA CABRERA SANCHEZ",1,0,0,0,0,0,0,7,35,0,0,0,0,0,0,0,1,35,0,44677]
[null,"GUANAJUATO","GALA740123JB8","GALA740123MGTLPL08","ALMA ROSA GALINDO LOPEZ",1,0,0,0,0,0,0,7,35,0,0,0,0,0,0,0,1,35,0,39789]
[null,"GUANAJUATO","COBA780319BUA","COBA780319HGTRTN00","JOSE ANTONIO CORDOBA BAUTISTA",1,0,0,0,0,0,0,7,35,0,0,0,0,0,0,0,1,35,0,40362]
[null,"GUANAJUATO","GOGE831013479","GOGE831013MGTNRL03","ELIA JUDITH GONZALEZ GUERRA",1,0,0,0,0,0,0,7,35,0,0,0,0,0,0,0,1,35,0,37879]
[null,"GUANAJUATO","PAGG860302DX9","PAGG860302MDFDRB08","GABRIELA PADILLA GUERRERO",1,0,0,0,0,0,0,7,35,0,0,0,0,0,0,0,1,35,0,37497]
[null,"GUANAJUATO","SAAP650303N74","SAAP650303MGTNLT02","PATRICIA SANCHEZ ALVARADO",1,0,0,0,0,0,0,7,35,0,0,0,0,0,0,0,1,35,0,45193]
[null,"GUANAJUATO","CAOD910826S90","CAOD910826MSPNRL03","DULCE VIRIDIANA CANO ORTA",1,0,0,0,0,0,0,7,35,0,0,0,0,0,0,0,1,35,0,37456]
[null,"GUANAJUATO","GOTJ781129KP5","GOTJ781129MGTMPC08","JACQUELINE GOMEZ TAPIA",1,0,0,0,0,0,0,7,35,0,0,0,0,0,0,0,1,35,0,44333]
[null,"GUANAJUATO","SACA4609287F8","SACA460928MGTNRL03","MA. ALEJANDRINA CARMEN SANCHEZ CARRASCO",1,0,0,0,0,0,0,7,35,0,0,0,0,0,0,0,1,35,0,48042]
[null,"GUANAJUATO","CUPS720728BN7","CUPS720728MGTVSL06","SILVIA CUEVAS PESCADOR",1,0,0,0,0,0,0,7,35,0,0,0,0,0,0,0,1,35,0,43888]
[null,"GUANAJUATO","ZAGJ830623IG5","ZAGJ830623MGTVLN06","JUANA ZAVALA GALLEGOS",1,0,0,0,0,0,0,7,35,0,0,0,0,0,0,0,1,35,0,40813]
[null,"GUANAJUATO","SEER810904RN6","SEER810904HGTRSF07","RAFAEL SERRATO ESPINOSA",1,0,0,0,0,0,0,7,35,0,0,0,0,0,0,0,1,35,0,43843]
[null,"GUANAJUATO","UORV800303CD1","UORV800303MGTLNR08","VERONICA ULLOA RANGEL",1,0,0,0,0,0,0,7,35,0,0,0,0,0,0,0,1,35,0,41955]
[null,"GUANAJUATO","RIRJ650926ED3","RIRJ650926HGTCMX07","J.JESUS RICO RAMIREZ",1,0,0,0,0,0,0,7,35,0,0,0,0,0,0,0,1,35,0,45535]
[null,"GUANAJUATO","GARR860218GD7","GARR860218HGTRJL03","JOSE RAUL GRANADOS ROJAS",1,0,0,0,0,0,0,7,35,0,0,0,0,0,0,0,1,35,0,37647]
[null,"GUANAJUATO","GOPS8011178I3","GOPS801117MGTMRN09","MARIA SANDRA GOMEZ PEREZ",1,0,0,0,0,0,0,7,35,0,0,0,0,0,0,0,1,35,0,38186]
[null,"GUANAJUATO","LOCJ8109121HA","LOCJ810912HDFPRN00","JUAN CARLOS LOPEZ CRUZ",1,0,0,0,0,0,0,7,35,0,0,0,0,0,0,0,1,35,0,45907]
[null,"GUANAJUATO","ROPE881009G46","ROPE881009MGTDRV05","EVELIN GUADALUPE RODRIGUEZ PEREZ",1,0,0,0,0,0,0,7,35,0,0,0,0,0,0,0,1,35,0,37647]
[null,"GUANAJUATO","MAAC750325Q52","MAAC750325MGTLLR02","MA. DEL CARMEN MALDONADO ALMANZA",1,0,0,0,0,0,0,7,35,0,0,0,0,0,0,0,1,35,0,42112]
[null,"GUANAJUATO","GURV740105E98","GURV740105MGTRDR07","VERONICA GUERRERO RODRIGUEZ",1,0,0,0,0,0,0,7,35,0,0,0,0,0,0,0,1,35,0,45731]
[null,"GUANAJUATO","CALM860815G43","CALM860815MJCHNY02","MAYRA CAROLINA CHAVEZ DE LEﾓN",1,0,0,0,0,0,0,7,35,0,0,0,0,0,0,0,1,35,0,39216]
[null,"GUANAJUATO","MEGG6409203P0","MEGG640920HGTDLR04","GERARDO MEDINA GALVAN",1,0,0,0,0,0,0,7,35,0,0,0,0,0,0,0,1,35,0,44503]
[null,"GUANAJUATO","GOMM610218KG4","GOMM610218MGTNRR05","MARTA PATRICIA GONZALEZ MORENO",1,0,0,0,0,0,0,7,35,0,0,0,0,0,0,0,1,35,0,45370]
[null,"GUANAJUATO","HECG7209202C4","HECG720920MGTRRR07","GRISELDA HERRERA CERVANTES",1,0,0,0,0,0,0,7,35,0,0,0,0,0,0,0,1,35,0,46848]
[null,"GUANAJUATO","EASG700512IU9","EASG700512MCMSNR00","GRACIELA ESCAMILLA SANCHEZ",1,0,0,0,0,0,0,7,35,0,0,0,0,0,0,0,1,35,0,47592]
[null,"GUANAJUATO","TAML5306213J5","TAML530621HGTPRS02","JOSE LUIS TAPIA MARTINEZ",1,0,0,0,0,0,0,7,35,0,0,0,0,0,0,0,1,35,0,44416]
[null,"GUANAJUATO","PACP681127IL7","PACP681127MGTRHT00","PATRICIA PRADO CHAVEZ",1,0,0,0,0,0,0,7,35,0,0,0,0,0,0,0,1,35,0,48557]
[null,"GUANAJUATO","CAGR690302HRA","CAGR690302MGTMMS03","MA. DEL ROSARIO CAMPOS GOMEZ",1,0,0,0,0,0,0,7,35,0,0,0,0,0,0,0,1,35,0,47019]
[null,"GUANAJUATO","GOND6504247RA","GOND650424MGTNXL03","DALIA SONIA GONZALEZ NIﾑO",1,0,0,0,0,0,0,7,35,0,0,0,0,0,0,0,1,35,0,44677]
[null,"GUANAJUATO","GUOA740914U2A","GUOA740914MMNDRN06","MA. DE LOS ANGELES GUDIﾑO ORDAZ",1,0,0,0,0,0,0,7,35,0,0,0,0,0,0,0,1,35,0,44855]
[null,"GUANAJUATO","OAGM681221I42","OAGM681221MGTRRR09","MARICRUZ ORDAZ GRANADOS",1,0,0,0,0,0,0,7,35,0,0,0,0,0,0,0,1,35,0,34580]
[null,"GUANAJUATO","MAAL680513MP3","MAAL680513MMNRNZ01","MARIA DE LA LUZ MARTINEZ ANDRADE",1,0,0,0,0,0,0,7,35,0,0,0,0,0,0,0,1,35,0,48702]
[null,"GUANAJUATO","LERF661028KV3","LERF661028HGTNZR04","FERNANDO LEON RUIZ",1,0,0,0,0,0,0,7,35,0,0,0,0,0,0,0,1,35,0,43756]
[null,"GUANAJUATO","CACP630616HG8","CACP630616MGTLHT16","MA. PATRICIA DOLORES CALDERON CHAVEZ",1,0,0,0,0,0,0,7,35,0,0,0,0,0,0,0,1,35,0,46135]
[null,"GUANAJUATO","RAJC810331LAA","RAJC810331MGTMRL02","CLAUDIA JACQUELINE RAMIREZ JARAMILLO",1,0,0,0,0,0,0,7,35,0,0,0,0,0,0,0,1,35,0,47003]
[null,"GUANAJUATO","CAVA651011TB7","CAVA651011HGTLRL04","JOSE ALFREDO CALDERON VARELA",1,0,0,0,0,0,0,7,35,0,0,0,0,0,0,0,1,35,0,49140]
[null,"GUANAJUATO","FONO7308067J5","FOXN730806MGTLXR04","NORMA LILIA FLORES ",1,0,0,0,0,0,0,7,35,0,0,0,0,0,0,0,1,35,0,46707]
[null,"GUANAJUATO","HECS730303TG6","HECS730303MGTRNS05","SUSANA TERESA HERNANDEZ CANTERO",1,0,0,0,0,0,0,7,35,0,0,0,0,0,0,0,1,35,0,47592]
[null,"GUANAJUATO","HECA7404077F6","HECA740407MGTRND08","ADRIANA HERNANDEZ CANTERO",1,0,0,0,0,0,0,7,35,0,0,0,0,0,0,0,1,35,0,47060]
[null,"GUANAJUATO","COOS660919CRA","COOS660919MGTNLS08","SUSANA ISABEL CONTRERAS OLMOS",1,0,0,0,0,0,0,7,35,0,0,0,0,0,0,0,1,35,0,44097]
[null,"GUANAJUATO","CAGY820417182","CAGY820417MGTRTJ03","YAJAHIRA CARDENAS GUTIERREZ",1,0,0,0,0,0,0,7,35,0,0,0,0,0,0,0,1,35,0,37647]
[null,"GUANAJUATO","BABM6804276E6","BABM680427MMCXLR01","MARGARITA BAﾑOS BAILON",1,0,0,0,0,0,0,7,35,0,0,0,0,0,0,0,1,35,0,45761]
[null,"GUANAJUATO","CARA730215VE3","CARA730215MGTHJL00","ALMA DELIA CHAVEZ ROJAS",1,0,0,0,0,0,0,7,35,0,0,0,0,0,0,0,1,35,0,46452]
[null,"GUANAJUATO","HEDM871214861","HEDM871214HGTRLN04","JOSE MANUEL HERNANDEZ DELGADO",1,0,0,0,0,0,0,7,35,0,0,0,0,0,0,0,1,35,0,40362]
[null,"GUANAJUATO","VARL750211VB2","VARL750211MGTRMR07","MARIA LOURDES VARGAS RAMIREZ",1,0,0,0,0,0,0,7,35,0,0,0,0,0,0,0,1,35,0,46625]
[null,"GUANAJUATO","PECC830605V49","PECC830605MNEXSN04","CINTHYA PEﾑALOZA CISNEROS",1,0,0,0,0,0,0,7,35,0,0,0,0,0,0,0,1,35,0,42528]
[null,"GUANAJUATO","CAOE780824GY2","CAOE780824MGTSRM07","EMILIA CASTELLANO ORTEGA",1,0,0,0,0,0,0,7,35,0,0,0,0,0,0,0,1,35,0,46192]
[null,"GUANAJUATO","FOQL7110275I8","FOQL711027MGTLVN02","LEONOR FLORES QUEVEDO",1,0,0,0,0,0,0,7,35,0,0,0,0,0,0,0,1,35,0,39663]
[null,"GUANAJUATO","MIYA600511Q72","MIYA600511MGTRRN01","MA. ANTONIA MIRANDA YERENA",1,0,0,0,0,0,0,7,35,0,0,0,0,0,0,0,1,35,0,44024]
[null,"GUANAJUATO","HERA790725FQ8","HERA790725MGTRDL08","ALEJANDRA HERNANDEZ RODRIGUEZ",1,0,0,0,0,0,0,7,35,0,0,0,0,0,0,0,1,35,0,44043]
[null,"GUANAJUATO","AURM640517UH3","AURM640517HGTGCR01","MARTIN AGUIRRE RICO",1,0,0,0,0,0,0,7,35,0,0,0,0,0,0,0,1,35,0,48427]
[null,"GUANAJUATO","NAHL730801RV8","NAHL730801MGTVRR01","MARIA DE LOURDES NAVARRO HERNANDEZ",1,0,0,0,0,0,0,7,35,0,0,0,0,0,0,0,1,35,0,45907]
[null,"GUANAJUATO","PEAR630107AT2","PEAR630107HMCXRY08","JOSE REY PEﾑA ARRIAGA",1,0,0,0,0,0,0,7,35,0,0,0,0,0,0,0,1,35,0,45170]
[null,"GUANAJUATO","AUGA6812277W5","AUGA681227MGTGRN03","ANA MARIA AGUILAR GARCIA",1,0,0,0,0,0,0,7,35,0,0,0,0,0,0,0,1,35,0,41444]
[null,"GUANAJUATO","HEAE670513TV7","HEAE670513HGTRGD08","EDUARDO HERNANDEZ AGUADO",1,0,0,0,0,0,0,7,35,0,0,0,0,0,0,0,1,35,0,47425]
[null,"GUANAJUATO","GOMI721001DE2","GOMI721001MDFNJN03","INES ROSARIO GONZALEZ MUJICA",1,0,0,0,0,0,0,7,35,0,0,0,0,0,0,0,1,35,0,45619]
[null,"GUANAJUATO","MISR800307LH4","MISR800307MGTRLS07","ROSAURA MIRANDA SALAZAR",1,0,0,0,0,0,0,7,35,0,0,0,0,0,0,0,1,35,0,49602]
[null,"GUANAJUATO","PACL700401SI9","PACL700401MGTRHR04","LAURA PRADO CHAVEZ",1,0,0,0,0,0,0,7,35,0,0,0,0,0,0,0,1,35,0,49620]
[null,"GUANAJUATO","MAGE751103B16","MAGE751103MGTYTR08","ERIKA GUADALUPE MAYCOTTE GUTIERREZ",1,0,0,0,0,0,0,7,35,0,0,0,0,0,0,0,1,35,0,48427]
[null,"GUANAJUATO","SOSM750119S26","SOSM750119MGTRTR02","MARTHA SORIA SOTO",1,0,0,0,0,0,0,7,35,0,0,0,0,0,0,0,1,35,0,45538]
[null,"GUANAJUATO","VIRM731126CL3","VIRM731126MGTLMN06","MARIA MONICA VILLANUEVA RAMIREZ",1,0,0,0,0,0,0,7,35,0,0,0,0,0,0,0,1,35,0,47022]
[null,"GUANAJUATO","FEET711003EB8","FEET711003MGTLSR05","TERESA FELIX ESTRELLA",1,0,0,0,0,0,0,7,35,0,0,0,0,0,0,0,1,35,0,49838]
[null,"GUANAJUATO","LOSS570105T33","LOSS570105MTSZLS00","SUSANA ENRIQUETA LOZANO SALCEDO",1,0,0,0,0,0,0,7,35,0,0,0,0,0,0,0,1,35,0,44349]
[null,"GUANAJUATO","RAOM680518SX1","RAOM680518MMNNCR06","MARIBEL RANGEL OCHOA",1,0,0,0,0,0,0,7,35,0,0,0,0,0,0,0,1,35,0,49072]
[null,"GUANAJUATO","HECR621219RI5","HECR621219MGTRRS02","MARIA DEL ROSARIO HERNANDEZ CARDENAS",1,0,0,0,0,0,0,7,35,0,0,0,0,0,0,0,1,35,0,51747]
[null,"GUANAJUATO","HECE750420552","HECE750420MGTRRM01","MA. EMILIA HERNANDEZ CARDENAS",1,0,0,0,0,0,0,7,35,0,0,0,0,0,0,0,1,35,0,51293]
[null,"GUANAJUATO","BINL4906195XA","BINL490619HDFRGS05","JOSE LUIS BRIBIESCA NEGRETE",1,0,0,0,0,0,0,7,35,0,0,0,0,0,0,0,1,35,0,50765]
[null,"GUANAJUATO","CAJU6804082V6","CAXJ680408MGTMXN08","JUANA MARIA CAMACHO ",1,0,0,0,0,0,0,7,35,0,0,0,0,0,0,0,1,35,0,52409]
[null,"GUANAJUATO","COOD541119637","COOD541119MGTNRL00","DULCE MARIA ELIZABETH CONTRERAS ORDUﾑA",1,0,0,0,0,0,0,7,35,0,0,0,0,0,0,0,1,35,0,50368]
[null,"GUANAJUATO","LOVE3907178K6","LOVE390717MGTPZS07","MA. ESTELA LOPEZ VAZQUEZ",1,0,0,0,0,0,0,7,35,0,0,0,0,0,0,0,1,35,0,51137]
[null,"GUANAJUATO","TEMM661201D47","TEMG661201MGTRRD06","MA. GUADALUPE TREJO MARTINEZ",1,0,0,0,0,0,0,7,35,0,0,0,0,0,0,0,1,35,0,50176]
[null,"GUANAJUATO","MAOL731125E39","MAOL731125MGTLRC03","LUCINA MALDONADO ORDUﾑO",1,0,0,0,0,0,0,7,35,0,0,0,0,0,0,0,1,35,0,51210]
[null,"GUANAJUATO","VAPR690730J94","VAPR690730MGTZNS03","ROSA LAURA VAZQUEZ PONCE",1,0,0,0,0,0,0,7,35,0,0,0,0,0,0,0,1,35,0,52769]
[null,"GUANAJUATO","VIMG771213D20","VIMG771213MGTLNB08","GABRIELA VILLANUEVA MENDOZA",1,0,0,0,0,0,0,7,35,0,0,0,0,0,0,0,1,35,0,47262]
[null,"GUANAJUATO","BARA6501175H5","BARA650117MGTRDN02","ANTONIA BARRERA RODRIGUEZ",1,0,0,0,0,0,0,7,35,0,0,0,0,0,0,0,1,35,0,53781]
[null,"GUANAJUATO","AOMM651230U5A","AOMM651230MGTBSY06","MA. MAYELA ABOYTES MOSQUEDA",1,0,0,0,0,0,0,7,35,0,0,0,0,0,0,0,1,35,0,54711]
[null,"GUANAJUATO","AILP690120TW9","AILP690120MSPRNT09","PATRICIA DE JESUS ARCIGA LEON",1,0,0,0,0,0,0,7,35,0,0,0,0,0,0,0,1,35,0,48917]
[null,"GUANAJUATO","HESF670102636","HESF670102HGTRLR07","FERMIN HERNANDEZ SILVA",1,0,0,0,0,0,0,7,35,0,0,0,0,0,0,0,1,35,0,53153]
[null,"GUANAJUATO","GUAA541207PD5","GUAA541207MGTTVL07","ALMA ROSA GUTIERREZ AVILES",1,0,0,0,0,0,0,7,35,0,0,0,0,0,0,0,1,35,0,45229]
[null,"GUANAJUATO","VAQE630516EZ8","VAQE630516MGTRVS07","ESTHELA VARGAS QUEVEDO",1,0,0,0,0,0,0,7,35,0,0,0,0,0,0,0,1,35,0,51510]
[null,"GUANAJUATO","COCB750608U65","COCB750608MGTRRL08","BLANCA RAQUEL CORONEL CARBAJAL",1,0,0,0,0,0,0,7,35,0,0,0,0,0,0,0,1,35,0,53768]
[null,"GUANAJUATO","VALF830903IU4","VALF830903HGTLNR07","FRANCISCO JAVIER VALDEZ LANDIN",1,0,0,0,0,0,0,7,35,0,0,0,0,0,0,0,1,35,0,44267]
[null,"GUANAJUATO","ROJJ671130GY1","ROJJ671130HGTDMS06","JOSE RODRIGUEZ JIMENEZ",1,0,0,0,0,0,0,7,35,0,0,0,0,0,0,0,1,35,0,55265]
[null,"GUANAJUATO","CATE6508044X6","CATE650804MGTRRS04","ESPERANZA CARRILLO TORRES",1,0,0,0,0,0,0,7,35,0,0,0,0,0,0,0,1,35,0,55243]
[null,"GUANAJUATO","HERL8008128A5","HERL800812MGTRSR15","LAURA ELENA HERRERA RIOS",1,0,0,0,0,0,0,7,35,0,0,0,0,0,0,0,1,35,0,46453]
[null,"GUANAJUATO","REPC540808QI9","REPC540808MGTNRN06","MARIA CONCEPCION RENTERIA PEREZ",1,0,0,0,0,0,0,7,35,0,0,0,0,0,0,0,1,35,0,61295]
[null,"GUANAJUATO","CARJ550620A19","CARJ550620HGTSDM09","JAIME CASTILLO RODRIGUEZ",1,0,0,0,0,0,0,7,35,0,0,0,0,0,0,0,1,35,0,59667]
[null,"GUANAJUATO","ROSR7704116C6","ROSR770411MGTDLS01","MARIA DEL ROSARIO RODRIGUEZ SALGADO",1,0,0,0,0,0,0,7,35,0,0,0,0,0,0,0,1,35,0,54016]
[null,"GUANAJUATO","GOGL670809V8A","GOGL670809HGTNRS00","LUIS ALBERTO GONZALEZ GARCIA",1,0,0,0,0,0,0,7,35,0,0,0,0,0,0,0,1,35,0,57890]
[null,"GUANAJUATO","PEEM590530399","PEEM590530HDFRSN06","MANUEL ANGEL PEREZ ESCAMILLA",1,0,0,0,0,0,0,7,35,0,0,0,0,0,0,0,1,35,0,56462]
[null,"GUANAJUATO","CAVJ620328P75","CAVG620328HGTHRD03","J. GUADALUPE CHAVEZ VARGAZ",1,0,0,0,0,0,0,7,35,0,0,0,0,0,0,0,1,35,0,57012]
[null,"GUANAJUATO","JUON6804281K2","JUON680428HGTRRX00","NOE JUAREZ ORTEGA",1,0,0,0,0,0,0,7,35,0,0,0,0,0,0,0,1,35,0,56654]
[null,"GUANAJUATO","RORC700828A28","RORC700828MGTMML06","CLAUDIA IMELDA ROMERO RAMOS",1,0,0,0,0,0,0,7,35,0,0,0,0,0,0,0,1,35,0,58282]
[null,"GUANAJUATO","COMM660914G87","COMR660914MGTNDC09","MA. DEL ROCIO CONCHA MEDINA",1,0,0,0,0,0,0,7,35,0,0,0,0,0,0,0,1,35,0,49142]
[null,"GUANAJUATO","VEPE671201NI6","VEPE671201MGTGRG04","MARIA EUGENIA VEGA PAREDES",1,0,0,0,0,0,0,7,35,0,0,0,0,0,0,0,1,35,0,53340]
[null,"GUANAJUATO","VILR670220CZ3","VILR670220MGTLNM04","RAMONA VILLANUEVA LUNA",1,0,0,0,0,0,0,7,35,0,0,0,0,0,0,0,1,35,0,59370]
[null,"GUANAJUATO","PAGT5911092P8","PAGT591109HGTLRD01","TEODORO PALMERIN GARCIA",1,0,0,0,0,0,0,7,35,0,0,0,0,0,0,0,1,35,0,56632]
[null,"GUANAJUATO","BAVG670930HU0","BAVG670930MGTRZD05","MA. GUADALUPE BARCENAS VAZQUEZ",1,0,0,0,0,0,0,7,35,0,0,0,0,0,0,0,1,35,0,61649]
[null,"GUANAJUATO","RATR611023E56","RATR611023MGTMRS03","ROSA MAGDALENA RAMIREZ TRONCOSO",1,0,0,0,0,0,0,7,35,0,0,0,0,0,0,0,1,35,0,58637]
[null,"GUANAJUATO","LUOE610116R96","LUOE610116HDGNLM05","EMILIO LUNA OLAGUE",1,0,0,0,0,0,0,7,35,0,0,0,0,0,0,0,1,35,0,56610]
[null,"GUANAJUATO","CUPM810513D93","CUPM810513HGTRRR00","MARTIN ANTONIO CRUZ PEREZ",1,0,0,0,0,0,0,7,35,0,0,0,0,0,0,0,1,35,0,53250]
[null,"GUANAJUATO","MAGE550714NZ1","MAGE550714HGTRNS03","ESTEBAN MARTINEZ GONZALEZ",1,0,0,0,0,0,0,7,35,0,0,0,0,0,0,0,1,35,0,57209]
[null,"GUANAJUATO","GOAS751103PH7","GOAS751103MGTNRL01","SILVIA SANTOS GONZALEZ ARANDA",1,0,0,0,0,0,0,7,35,0,0,0,0,0,0,0,1,35,0,52650]
[null,"GUANAJUATO","LERM7308264B5","LERM730826MGTDSN09","MONICA LEDESMA ROSALES",1,0,0,0,0,0,0,7,35,0,0,0,0,0,0,0,1,35,0,52313]
[null,"GUANAJUATO","PELL620125LZ0","PELL620125MVZRLR03","MARIA DE LOURDES PEREZ LLANOS",1,0,0,0,0,0,0,7,35,0,0,0,0,0,0,0,1,35,0,54680]
[null,"GUANAJUATO","CABF530212GK8","CABF530212HGTNRR05","FRANCISCO JAVIER CANO BARRON",1,0,0,0,0,0,0,7,35,0,0,0,0,0,0,0,1,35,0,52160]
[null,"GUANAJUATO","CIVM630826EF1","CIVR630826MGTSRS09","MA. DEL ROSARIO CISNEROS VERDIN",1,0,0,0,0,0,0,7,35,0,0,0,0,0,0,0,1,35,0,51855]
[null,"GUANAJUATO","NEGM641224M74","NEGM641224MGTGVR06","MARTINA NEGRETE GOVEA",1,0,0,0,0,0,0,7,35,0,0,0,0,0,0,0,1,35,0,48078]
[null,"GUANAJUATO","PEDM7406101Q5","PEDM740610MDFRMR01","MARGARITA PERALTA DOMINGUEZ",1,0,0,0,0,0,0,7,35,0,0,0,0,0,0,0,1,35,0,52331]
[null,"GUANAJUATO","FOMJ7811187W8","FOMJ781118HGTLDN07","JUAN PABLO FLORES MEDINA",1,0,0,0,0,0,0,7,35,0,0,0,0,0,0,0,1,35,0,51636]
[null,"GUANAJUATO","DOVR6304095Y7","DOVR630409MBCMZS05","MARIA DEL ROSARIO DOMINGUEZ VAZQUEZ",1,0,0,0,0,0,0,7,35,0,0,0,0,0,0,0,1,35,0,56518]
[null,"GUANAJUATO","VIGO710314HSA","VIGO710314HGTLNS05","OSCAR JACOBO VILLICAﾑA GONZALEZ",1,0,0,0,0,0,0,7,35,0,0,0,0,0,0,0,1,35,0,49842]
[null,"GUANAJUATO","SAAL700325CX2","SAAL700325MGTNGT00","LETICIA SANDOVAL AGUAYO",1,0,0,0,0,0,0,7,35,0,0,0,0,0,0,0,1,35,0,53614]
[null,"GUANAJUATO","RALE870501NL5","RALE870501MGTMYL02","MARIA ELENA RAMOS LOYOLA",1,0,0,0,0,0,0,7,35,0,0,0,0,0,0,0,1,35,0,46033]
[null,"GUANAJUATO","RAML6801057F2","RAML680105MMNMCN00","LINDA RAMIREZ MACEDO",1,0,0,0,0,0,0,7,35,0,0,0,0,0,0,0,1,35,0,51842]
[null,"GUANAJUATO","MOSR650129V62","MOSR650129MGTRNF09","MA. DEL REFUGIO MORONES SANCHEZ",1,0,0,0,0,0,0,7,35,0,0,0,0,0,0,0,1,35,0,56549]
[null,"GUANAJUATO","AEAJ851118LC0","AEAJ851118HGTRCN00","JUAN CARLOS ARMENTA ACEVEDO",1,0,0,0,0,0,0,7,35,0,0,0,0,0,0,0,1,35,0,51842]
[null,"GUANAJUATO","OEMJ730208CX6","OEMM730208HGTJDR00","J. MERCED OJEDA MEDINA",1,0,0,0,0,0,0,7,35,0,0,0,0,0,0,0,1,35,0,52270]
[null,"GUANAJUATO","MALA730704I26","MALA730704HGTRPR02","ARNULFO MARQUEZ LOPEZ",1,0,0,0,0,0,0,7,35,0,0,0,0,0,0,0,1,35,0,53767]
[null,"GUANAJUATO","MOCK900306NE6","MOCK900306MDFRSR15","KAREN ANEL MORENO CASTILLO",1,0,0,0,0,0,0,7,35,0,0,0,0,0,0,0,1,35,0,46675]
[null,"GUANAJUATO","LUMR751129U75","LUMR751129HGTGTC02","RICARDO ERNESTO LUGO MATA",1,0,0,0,0,0,0,7,35,0,0,0,0,0,0,0,1,35,0,47745]
[null,"GUANAJUATO","ZAGB700228KX3","ZAGB700228MGTVMT03","BEATRIZ ZAVALA GOMEZ",1,0,0,0,0,0,0,7,35,0,0,0,0,0,0,0,1,35,0,53960]
[null,"GUANAJUATO","ROLA760606566","ROLA760606HGTJPN03","JOSE ANTONIO ROJAS LOPEZ",1,0,0,0,0,0,0,7,35,0,0,0,0,0,0,0,1,35,0,53746]
[null,"GUANAJUATO","CAAB610110HC5","CAAB610110MGTRRR07","BERTHA ANGELICA CARPIO ARAGON",1,0,0,0,0,0,0,7,35,0,0,0,0,0,0,0,1,35,0,35544]
[null,"GUANAJUATO","GAPE660401EX7","GAPE660401HDFRRD03","EDUARDO GARCIA PEREZ",1,0,0,0,0,0,0,7,35,0,0,0,0,0,0,0,1,35,0,48300]
[null,"GUANAJUATO","SAMM750910419","SAMM750910MGTCRR00","MERCEDES ELENA SAUCEDO MORENO",1,0,0,0,0,0,0,7,35,0,0,0,0,0,0,0,1,35,0,54126]
[null,"GUANAJUATO","LAMZ780504N49","LAMZ780504MSLRNN01","ZINTIA DENISE LARA MENDIVIL",1,0,0,0,0,0,0,7,35,0,0,0,0,0,0,0,1,35,0,48313]
[null,"GUANAJUATO","HELM750417G75","HELM750417MGTRZG00","MARIA MAGDALENA HERNANDEZ LAZO",1,0,0,0,0,0,0,7,35,0,0,0,0,0,0,0,1,35,0,46799]
[null,"GUANAJUATO","LOLB681130LWA","LOLB681130MGTPLT03","BEATRIZ LOPEZ LLANOS",1,0,0,0,0,0,0,7,35,0,0,0,0,0,0,0,1,35,0,50158]
[null,"GUANAJUATO","GACC7402201D0","GACC740220MVZRYL09","CLAUDIA GARCIA CAYETANO",1,0,0,0,0,0,0,7,35,0,0,0,0,0,0,0,1,35,0,46675]
[null,"GUANAJUATO","GORE840602N47","GORE840602HGTNDM00","EMMANUEL GONZALEZ RODRIGUEZ",1,0,0,0,0,0,0,7,35,0,0,0,0,0,0,0,1,35,0,50226]
[null,"GUANAJUATO","CAPJ840105CE0","CAPJ840105HGTMRL00","JULIO CESAR CAMACHO PRADO",1,0,0,0,0,0,0,7,35,0,0,0,0,0,0,0,1,35,0,46675]
[null,"GUANAJUATO","GUGJ8305032WA","GUGJ830503HGTTVN06","JUAN JESUS GUTIERREZ GUEVARA",1,0,0,0,0,0,0,7,35,0,0,0,0,0,0,0,1,35,0,45819]
[null,"GUANAJUATO","LOGC850904FK8","LOGC850904HGTPRR05","CARLOS ALBERTO LOPEZ GARCIA",1,0,0,0,0,0,0,7,35,0,0,0,0,0,0,0,1,35,0,46247]
[null,"GUANAJUATO","GOGR650725KF1","GOGR650725HGTNRB02","ROBERTO GONZALEZ GARCIA",1,0,0,0,0,0,0,7,35,0,0,0,0,0,0,0,1,35,0,56632]
[null,"GUANAJUATO","NIMU831228318","NIMU831228MGTXRR02","URSULA MACARENA NIﾑO MARTINEZ",1,0,0,0,0,0,0,7,35,0,0,0,0,0,0,0,1,35,0,48728]
[null,"GUANAJUATO","MORM7609166F8","MORC760916MMCNZR07","MA. DEL CARMEN MONTES DE OCA REZA",1,0,0,0,0,0,0,7,35,0,0,0,0,0,0,0,1,35,0,46461]
[null,"GUANAJUATO","SAME750520NR8","SAME750520MGTNJR05","ERIKA SANCHEZ MEJIA",1,0,0,0,0,0,0,7,35,0,0,0,0,0,0,0,1,35,0,48942]
[null,"GUANAJUATO","LAOJ8212131K9","LAOJ821213HGTRLS09","JESUS SAMUEL LARA OLMOS",1,0,0,0,0,0,0,7,35,0,0,0,0,0,0,0,1,35,0,51296]
[null,"GUANAJUATO","LURF6001292T1","LURF600129HGTNMR01","FRANCISCO JAVIER LUNA RAMIREZ",1,0,0,0,0,0,0,7,35,0,0,0,0,0,0,0,1,35,0,56666]
[null,"GUANAJUATO","ZACR521017I51","ZACR521017HGTMRG01","ROGELIO ARTURO ZAMARRIPA CRUZ",1,0,0,0,0,0,0,7,35,0,0,0,0,0,0,0,1,35,0,57974]
[null,"GUANAJUATO","VAGL591217DU7","VAGL591217MGTRRL06","LILIA VARGAS GARCIDUEﾑAS",1,0,0,0,0,0,0,7,35,0,0,0,0,0,0,0,1,35,0,57401]
[null,"GUANAJUATO","RATM581224UF9","RATM581224HGTMRN03","JOSE MANUEL RAMOS TORRES",1,0,0,0,0,0,0,7,35,0,0,0,0,0,0,0,1,35,0,50986]
[null,"GUANAJUATO","AERS660208UT4","AERS660208HGTRYR01","SERGIO ARREDONDO RAYA",1,0,0,0,0,0,0,7,35,0,0,0,0,0,0,0,1,35,0,57092]
[null,"GUANAJUATO","CAEJ651225BV9","CAEJ651225HVZHSS03","JESUS CHAGALA ESPEJO",1,0,0,0,0,0,0,7,35,0,0,0,0,0,0,0,1,35,0,49829]
[null,"GUANAJUATO","MENC680926QE2","MENC680926MGTDVR02","MARIA DEL CARMEN MEDEL NAVARRETE",1,0,0,0,0,0,0,7,35,0,0,0,0,0,0,0,1,35,0,54898]
[null,"GUANAJUATO","HUED670420517","HUED670420HDFRSV00","DAVID HUERTA ESTRADA",1,0,0,0,0,0,0,7,35,0,0,0,0,0,0,0,1,35,0,56160]
[null,"GUANAJUATO","VARA71012288A","VARA710122MGTRMN01","MARIA DE LOS ANGELES VARGAS RAMIREZ",1,0,0,0,0,0,0,7,35,0,0,0,0,0,0,0,1,35,0,60012]
[null,"GUANAJUATO","NEAC740715LD9","NEAC740715HGTGRR02","CRISTOBAL NEGRETE ARIAS",1,0,0,0,0,0,0,7,35,0,0,0,0,0,0,0,1,35,0,57612]
[null,"GUANAJUATO","FAHI7401088Z2","FAHI740108HGTBRV04","IVAN FABELA HERNANDEZ",1,0,0,0,0,0,0,7,35,0,0,0,0,0,0,0,1,35,0,54449]
[null,"GUANAJUATO","MEVG630915G81","MEVG630915MGTRRD08","MA. GUADALUPE MERCADO VARELA",1,0,0,0,0,0,0,7,35,0,0,0,0,0,0,0,1,35,0,58121]
[null,"GUANAJUATO","MELR640522PX9","MELR640522MGTNNT06","RITA MENDEZ LEON",1,0,0,0,0,0,0,7,35,0,0,0,0,0,0,0,1,35,0,54750]
[null,"GUANAJUATO","RICR7705149U3","RICR770514HGTVRB05","ROBERTO CARLOS RIVERA CORONILLA",1,0,0,0,0,0,0,7,35,0,0,0,0,0,0,0,1,35,0,55798]
[null,"GUANAJUATO","COOM721217SVA","COOM721217MGTNLN02","MA. MANUELA CONTRERAS OLMOS",1,0,0,0,0,0,0,7,35,0,0,0,0,0,0,0,1,35,0,56012]
[null,"GUANAJUATO","GUMA6701215Q1","GUMA670121MGTTRN09","ANA GUTIERREZ MORENO",1,0,0,0,0,0,0,7,35,0,0,0,0,0,0,0,1,35,0,55768]
[null,"GUANAJUATO","EIRJ6812089I5","EIRC681208HGTNMR05","J. CARLOS ENRIQUEZ RAMIREZ",1,0,0,0,0,0,0,7,35,0,0,0,0,0,0,0,1,35,0,55925]
[null,"GUANAJUATO","RAMD681211IP3","RAMD681211HMCMRN05","DANIEL RAMIREZ MARTINEZ",1,0,0,0,0,0,0,7,35,0,0,0,0,0,0,0,1,35,0,56353]
[null,"GUANAJUATO","YEPV780203IU0","YEPV780203MGTBVR00","VERONICA ADRIANA YEBRA PAVON",1,0,0,0,0,0,0,7,35,0,0,0,0,0,0,0,1,35,0,48084]
[null,"GUANAJUATO","VANR620916TF0","VANR620916HGTRGG03","ROGELIO VARGAS NEGRETE",1,0,0,0,0,0,0,7,35,0,0,0,0,0,0,0,1,35,0,55582]
[null,"GUANAJUATO","MAGM6404092N1","MAGM640409MGTNNR08","MARTA MANDUJANO GONZALEZ",1,0,0,0,0,0,0,7,35,0,0,0,0,0,0,0,1,35,0,60785]
[null,"GUANAJUATO","GOGA680110DL7","GOGA680110MGTNYN00","ANA BERTHA GONZALEZ GAYTAN",1,0,0,0,0,0,0,7,35,0,0,0,0,0,0,0,1,35,0,56864]
[null,"GUANAJUATO","HEPC690801P80","HEPC690801MGTRRR08","MA. DEL CARMEN HERNANDEZ PEREZ",1,0,0,0,0,0,0,7,35,0,0,0,0,0,0,0,1,35,0,55907]
[null,"GUANAJUATO","CACF6710055H4","CACF671005HGTLDR06","FRANCISCO CALDERON CAUDILLO",1,0,0,0,0,0,0,7,35,0,0,0,0,0,0,0,1,35,0,55056]
[null,"GUANAJUATO","GURR6007275B3","GURR600727HSPLMD06","RODOLFO GUEL RAMIREZ",1,0,0,0,0,0,0,7,35,0,0,0,0,0,0,0,1,35,0,54920]
[null,"GUANAJUATO","ROCR541120D22","ROCR541120HGTSVC07","RICARDO FEDERICO ROSALES COVARRUBIAS",1,0,0,0,0,0,0,7,35,0,0,0,0,0,0,0,1,35,0,54130]
[null,"GUANAJUATO","BEBL7508072M7","BEBL750807HQTRRS05","J. LUIS BERRA BORTOLINI",1,0,0,0,0,0,0,7,35,0,0,0,0,0,0,0,1,35,0,53820]
[null,"GUANAJUATO","RACR700730AH9","RACR700730MGTZNB06","REBECA RAZO CANO",1,0,0,0,0,0,0,7,35,0,0,0,0,0,0,0,1,35,0,53060]
[null,"GUANAJUATO","MAGE551119NR4","MAGE551119MGTYRD05","EDITH MAYCOTTE GRANADOS",1,0,0,0,0,0,0,7,35,0,0,0,0,0,0,0,1,35,0,55947]
[null,"GUANAJUATO","RABA570323E11","RABA570323MDFVSN07","ANA MARIA RAVELO BUSTAMANTE",1,0,0,0,0,0,0,7,35,0,0,0,0,0,0,0,1,35,0,54060]
[null,"GUANAJUATO","GAML720417UE8","GAML720417HGTRRS07","LUIS ALBERTO GARCIA MARTINEZ",1,0,0,0,0,0,0,7,35,0,0,0,0,0,0,0,1,35,0,55842]
[null,"GUANAJUATO","FICJ7603185H9","FICT760318HGTRSR03","J. TRINIDAD FRIAS CASTAﾑEDA",1,0,0,0,0,0,0,7,35,0,0,0,0,0,0,0,1,35,0,40261]
[null,"GUANAJUATO","GAMJ711118AJ8","GAMJ711118HGTRCC07","JACOBO GARCIA MICHACA",1,0,0,0,0,0,0,7,35,0,0,0,0,0,0,0,1,35,0,54470]
[null,"GUANAJUATO","ROSJ600516BL3","ROSJ600516MGTBNN05","JUANA ROBLES SANTANA",1,0,0,0,0,0,0,7,35,0,0,0,0,0,0,0,1,35,0,53872]
[null,"GUANAJUATO","OELM6606116J8","OELM660611MGTRRR05","MARTINA ORNELAS LARA",1,0,0,0,0,0,0,7,35,0,0,0,0,0,0,0,1,35,0,52252]
[null,"GUANAJUATO","RARC7011229A3","RARC701122MGTNDR00","MA. CARLOTA PATRICIA RANGEL RODRIGUEZ",1,0,0,0,0,0,0,7,35,0,0,0,0,0,0,0,1,35,0,54938]
[null,"GUANAJUATO","HEMM781102T78","HEMM781102MGTRNR07","MARISELA HERNANDEZ MONTOYA",1,0,0,0,0,0,0,7,35,0,0,0,0,0,0,0,1,35,0,53724]
[null,"GUANAJUATO","AAGH700108U53","AAGH700108MGTLRR09","HORTENCIA ALMANZA GARCIA",1,0,0,0,0,0,0,7,35,0,0,0,0,0,0,0,1,35,0,55008]
[null,"GUANAJUATO","RAAG660220BC0","RAAG660220MGTMVD07","MA. GUADALUPE RUTH RAMOS AVILA",1,0,0,0,0,0,0,7,35,0,0,0,0,0,0,0,1,35,0,57291]
[null,"GUANAJUATO","DUVE540209Q63","DUVE540209HGTRLR06","ERNESTO DURAN VALDIVIA",1,0,0,0,0,0,0,7,35,0,0,0,0,0,0,0,1,35,0,62130]
[null,"GUANAJUATO","AUTC7502082I3","AUTC750208MGTGRN15","MA. CONSUELO AGUILAR TIRADO",1,0,0,0,0,0,0,7,35,0,0,0,0,0,0,0,1,35,0,55222]
[null,"GUANAJUATO","FOMO6906162N2","FOMO690616HGTNDS05","OSCAR FONSECA MEDRANO",1,0,0,0,0,0,0,7,35,0,0,0,0,0,0,0,1,35,0,54084]
[null,"GUANAJUATO","DULR740520184","DULR740520HGTRPY01","JOSE REYES DURAN LOPEZ",1,0,0,0,0,0,0,7,35,0,0,0,0,0,0,0,1,35,0,54366]
[null,"GUANAJUATO","DOVL720318BXA","DOVL720318HGTMLS06","JOSE LUIS DOMINGUEZ VALDES",1,0,0,0,0,0,0,7,35,0,0,0,0,0,0,0,1,35,0,53724]
[null,"GUANAJUATO","TOAN630405S63","TOXA630405HGTLXN01","JOSE ANTONIO TOLENTINO ",1,0,0,0,0,0,0,7,35,0,0,0,0,0,0,0,1,35,0,55488]
[null,"GUANAJUATO","TOSH760727J54","TOSH760727HGTRNC04","HECTOR DANIEL TORRES SAENEZ",1,0,0,0,0,0,0,7,35,0,0,0,0,0,0,0,1,35,0,51894]
[null,"GUANAJUATO","RARC7301176A2","RARC730117MGTMVR07","MA. CARINA ALEJANDRA RAMIREZ RIVAS",1,0,0,0,0,0,0,7,35,0,0,0,0,0,0,0,1,35,0,51466]
[null,"GUANAJUATO","GUHA770213FQ8","GUHA770213MGTVRL02","ALMA ROSA GUEVARA HERNANDEZ",1,0,0,0,0,0,0,7,35,0,0,0,0,0,0,0,1,35,0,56436]
[null,"GUANAJUATO","VINF7009219V8","VINF700921HGTLXR06","FRANCISCO ALFONSO VILCHES NUﾑEZ",1,0,0,0,0,0,0,7,35,0,0,0,0,0,0,0,1,35,0,56506]
[null,"GUANAJUATO","MOTE6904283LA","MOTE690428MGTRRL09","ELVIRA MORALES TORRES",1,0,0,0,0,0,0,7,35,0,0,0,0,0,0,0,1,35,0,54322]
[null,"GUANAJUATO","FOGF6810217L0","FOGF681021HGTLRR06","JOSE FERNANDO FLORES GARCIA",1,0,0,0,0,0,0,7,35,0,0,0,0,0,0,0,1,35,0,61143]
[null,"GUANAJUATO","BAGJ5610276T2","BAGC561027HGTLLR02","J. CARMEN BALDERAS GALLEGOS",1,0,0,0,0,0,0,7,35,0,0,0,0,0,0,0,1,35,0,50964]
[null,"GUANAJUATO","QULC671003EH8","QULC671003MDFRPL03","CLAUDIA REYNA QUIROZ LOPEZ",1,0,0,0,0,0,0,7,35,0,0,0,0,0,0,0,1,35,0,54964]
[null,"GUANAJUATO","RIRS751216TU4","RIRS751216MDFSMN07","SONIA RIOS RAMOS",1,0,0,0,0,0,0,7,35,0,0,0,0,0,0,0,1,35,0,54205]
[null,"GUANAJUATO","NEPR690831KW1","NEPR690831HGTGDM08","RAMON GUILLERMO NEGRETE PADRON",1,0,0,0,0,0,0,7,35,0,0,0,0,0,0,0,1,35,0,51851]
[null,"GUANAJUATO","LOVH74031691A","LOVH740316HDFPNG06","HUGO LOPEZ VENEGAS",1,0,0,0,0,0,0,7,35,0,0,0,0,0,0,0,1,35,0,54536]
[null,"GUANAJUATO","RIHM750221AD5","RIHM750221HGTSRG01","MIGUEL DAMICIO RIOS HERNANDEZ",1,0,0,0,0,0,0,7,35,0,0,0,0,0,0,0,1,35,0,53898]
[null,"GUANAJUATO","ROPP680417AU8","ROPP680417MGTDRT05","PATRICIA RODRIGUEZ PEREZ",1,0,0,0,0,0,0,7,35,0,0,0,0,0,0,0,1,35,0,53894]
[null,"GUANAJUATO","NAMS5306098W6","NAMS530609MGTRRL00","SILVIA LAURA NARVAEZ MORA",1,0,0,0,0,0,0,7,35,0,0,0,0,0,0,0,1,35,0,60243]
[null,"GUANAJUATO","ZAMH6907077M4","ZAMH690707MGTVRR00","MARIA HERLINDA ZAVALA MARTINEZ",1,0,0,0,0,0,0,7,35,0,0,0,0,0,0,0,1,35,0,54563]
[null,"GUANAJUATO","GUMC6804029G4","GUMC680402MGTZNR09","MARIA DEL CARMEN GUZMAN MANZANILLA",1,0,0,0,0,0,0,7,35,0,0,0,0,0,0,0,1,35,0,57126]
[null,"GUANAJUATO","LOLA751009LC7","LOLA751009MGTPNN06","MA. DE LOS ANGELES LOPEZ LUNA",1,0,0,0,0,0,0,7,35,0,0,0,0,0,0,0,1,35,0,54806]
[null,"GUANAJUATO","CAGR650930FB6","CAGR650930HGTLYB04","RUBEN CALDERON GAYTAN",1,0,0,0,0,0,0,7,35,0,0,0,0,0,0,0,1,35,0,55290]
[null,"GUANAJUATO","BACA640430UIA","BACA640430HGTLRN06","ANTONIO BALTAZAR CORTES",1,0,0,0,0,0,0,7,35,0,0,0,0,0,0,0,1,35,0,55947]
[null,"GUANAJUATO","AURA5705038S9","AURA570503HGTGND03","JOSE ADOLFO AGUILERA RENDON",1,0,0,0,0,0,0,7,35,0,0,0,0,0,0,0,1,35,0,59342]
[null,"GUANAJUATO","QULJ710417B39","QULJ710417HDFRPN08","JUAN BERNARDO QUIROZ LOPEZ",1,0,0,0,0,0,0,7,35,0,0,0,0,0,0,0,1,35,0,53616]
[null,"GUANAJUATO","VARA570811AR0","VARA570811MVZLDN06","ANA YOLANDA VALERIO RODRIGUEZ",1,0,0,0,0,0,0,7,35,0,0,0,0,0,0,0,1,35,0,54117]
[null,"GUANAJUATO","BIRL710430QF2","BIRL710430HGTRZB03","LIBRADO BRICEﾑO RUIZ",1,0,0,0,0,0,0,7,35,0,0,0,0,0,0,0,1,35,0,55925]
[null,"GUANAJUATO","MASV810101DZ8","MASV810101MGTRRR01","VERONICA MARTINEZ SARABIA",1,0,0,0,0,0,0,7,35,0,0,0,0,0,0,0,1,35,0,56484]
[null,"GUANAJUATO","AELM6906275A6","AELR690627MGTRPS15","MA ROSARIO ARREGUIN LOPEZ",1,0,0,0,0,0,0,7,35,0,0,0,0,0,0,0,1,35,0,53916]
[null,"GUANAJUATO","METC6212134V3","METC621213HGTRPS06","CESAR MARTIN MERINO TAPIA",1,0,0,0,0,0,0,7,35,0,0,0,0,0,0,0,1,35,0,54492]
[null,"GUANAJUATO","GAHJ611031AR1","GAHJ611031HGTRRV01","JAVIER GRANADOS HERNANDEZ",1,0,0,0,0,0,0,7,35,0,0,0,0,0,0,0,1,35,0,54210]
[null,"GUANAJUATO","TONL701209CT8","TONL701209MGTRCR09","LAURA MA GUADALUPE TORRES NACHE",1,0,0,0,0,0,0,7,35,0,0,0,0,0,0,0,1,35,0,57900]
[null,"GUANAJUATO","OOPM650124AG1","OOPM650124HGTRRG05","MIGUEL OROZCO PEREZ",1,0,0,0,0,0,0,7,35,0,0,0,0,0,0,0,1,35,0,57340]
[null,"GUANAJUATO","VAQG581212JV2","VAQG581212HGTLJD08","J. GUADALUPE VALENCIA QUIJAS",1,0,0,0,0,0,0,7,35,0,0,0,0,0,0,0,1,35,0,53799]
[null,"GUANAJUATO","ROJJ610420EGA","ROJC610420HGTCMR06","J. CARMEN ROCHA JIMENEZ",1,0,0,0,0,0,0,7,35,0,0,0,0,0,0,0,1,35,0,55296]
[null,"GUANAJUATO","MARC601223340","MARC601223MGTRLC03","CECILIA MARTINEZ RUELAS",1,0,0,0,0,0,0,7,35,0,0,0,0,0,0,0,1,35,0,50942]
[null,"GUANAJUATO","PAQF701109SJ2","PAQF701109HGTRNL00","FILEMON PAREDON QUINTERO",1,0,0,0,0,0,0,7,35,0,0,0,0,0,0,0,1,35,0,56092]
[null,"GUANAJUATO","MUHD640208LB9","MUHD640208MDFXRL08","MARIA DOLORES MUﾑOZ HERRERA",1,0,0,0,0,0,0,7,35,0,0,0,0,0,0,0,1,35,0,56798]
[null,"GUANAJUATO","GOSL721116725","GOSL721116HGTRSS06","LUIS JAVIER GORDILLO SOSA",1,0,0,0,0,0,0,7,35,0,0,0,0,0,0,0,1,35,0,53894]
[null,"GUANAJUATO","JUAA750702KJ9","JUAA750702HGTRRN04","JOSE ANDRES JUAREZ ARROYO",1,0,0,0,0,0,0,7,35,0,0,0,0,0,0,0,1,35,0,56868]
[null,"GUANAJUATO","GUSS6608135L6","GUSS660813MGTRNF04","SOFIA GUERRERO SANDOVAL",1,0,0,0,0,0,0,7,35,0,0,0,0,0,0,0,1,35,0,55200]
[null,"GUANAJUATO","COPG660114BC1","COPG660114HGTNLR03","GERARDO LUIS CONTRERAS PALACIOS",1,0,0,0,0,0,0,7,35,0,0,0,0,0,0,0,1,35,0,56654]
[null,"GUANAJUATO","MOGC720409SJ9","MOGC720409MGTJZL04","CLAUDIA ELISA MOJICA GUZMAN",1,0,0,0,0,0,0,7,35,0,0,0,0,0,0,0,1,35,0,52262]
[null,"GUANAJUATO","BEMS700226KJ6","BEMS700226HGTCNL00","SALVADOR BECERRA MANDUJANO",1,0,0,0,0,0,0,7,35,0,0,0,0,0,0,0,1,35,0,56226]
[null,"GUANAJUATO","VATR761025BJA","VATR761025MDFRRS05","ROSA MARIA VARGAS TRUJILLO",1,0,0,0,0,0,0,7,35,0,0,0,0,0,0,0,1,35,0,58321]
[null,"GUANAJUATO","GARM751031J11","GARM751031HGTRMS07","MOISES GRANADOS RAMOS",1,0,0,0,0,0,0,7,35,0,0,0,0,0,0,0,1,35,0,73329]
[null,"GUANAJUATO","HERG571023MS0","HERG571023MGTRPD07","MA. GUADALUPE JUDITH HERNANDEZ RIPALDA",1,0,0,0,0,0,0,7,35,0,0,0,0,0,0,0,1,35,0,73404]
[null,"GUANAJUATO","HOHL860601124","HOHL860601MGTRRZ09","LUZ ANGELICA HORTA HERNANDEZ",1,0,0,0,0,0,0,7,35,0,0,0,0,0,0,0,1,35,0,59306]
[null,"GUANAJUATO","POLH650106FW2","POLH650106HDFZPG03","HUGO POZADA LOPEZ",1,0,0,0,0,0,0,7,35,0,0,0,0,0,0,0,1,35,0,59306]
[null,"GUANAJUATO","OEGL8003134Z8","OEGL800313MGTRMR09","LAURA AMERICA ORTEGA GAMIﾑO",1,0,0,0,0,0,0,7,35,0,0,0,0,0,0,0,1,35,0,72804]
[null,"GUANAJUATO","MOMR770326563","MOMR770326HGTRRB08","ROBERTO CARLOS MORALES MURO",1,0,0,0,0,0,0,7,35,0,0,0,0,0,0,0,1,35,0,72510]
[null,"GUANAJUATO","HUOR660813PR3","HUOR660813MGTRLS01","ROSA ALICIA HUERTA OLIVARES",1,0,0,0,0,0,0,7,35,0,0,0,0,0,0,0,1,35,0,53441]
[null,"GUANAJUATO","MURE780503RL7","MURE780503MGTXVS02","MARIA ESMERALDA MUﾑOZ RIVERA",1,0,0,0,0,0,0,7,35,0,0,0,0,0,0,0,1,35,0,73104]
[null,"GUANAJUATO","LUPI741127IZ3","LUPI741127MDFNRS02","MARIA ISABEL LUNA PEREZ",1,0,0,0,0,0,0,7,35,0,0,0,0,0,0,0,1,35,0,73104]
[null,"GUANAJUATO","AEPB811216AUA","AEPB811216MGTRLL03","BLANCA BERENICE ARREGUIN PALMA",1,0,0,0,0,0,0,7,35,0,0,0,0,0,0,0,1,35,0,73104]
[null,"GUANAJUATO","HEEE731209HI1","HEEE731209MGTRSS09","ESMERALDA HERNANDEZ ESCOGIDO",1,0,0,0,0,0,0,7,35,0,0,0,0,0,0,0,1,35,0,73179]
[null,"GUANAJUATO","COJP700317TZ9","COJP700317HMNRMD06","PEDRO CORTES JIMENEZ",1,0,0,0,0,0,0,7,35,0,0,0,0,0,0,0,1,35,0,31831]
[null,"GUANAJUATO","NOSV840205QG9","NOSV840205HGTRLC08","VICTOR ALFONSO NORIEGA SILVA",1,0,0,0,0,0,0,7,35,0,0,0,0,0,0,0,1,35,0,39860]
[null,"GUANAJUATO","CALR730329AHA","CALR730329HGTRZB02","RUBEN DARIO CARDENAS LAZARO",1,0,0,0,0,0,0,7,35,0,0,0,0,0,0,0,1,35,0,52075]
[null,"GUANAJUATO","ROBC900904U49","ROBC900904MDFCZT03","CITLALLIN MARGARITA ROCHA BAEZA",1,0,0,0,0,0,0,7,35,0,0,0,0,0,0,0,1,35,0,47730]
[null,"GUANAJUATO","GAEG840418L85","GAEG840418HGTLSS02","GUSTAVO ANTONIO GALLEGOS ESPINOSA",1,0,0,0,0,0,0,0,0,0,0,0,0,8,40,0,1,40,0,91627]
[null,"GUANAJUATO","LIAR601225KG4","LIAR601225HDGCRN09","RENATO LICON ARANDA",1,0,0,0,0,0,0,0,0,0,0,0,0,8,40,0,1,40,0,106280]
[null,"GUANAJUATO","LOPG651225LA9","LOPG651225MDFPRB01","GABRIELA DE JESUS LOPEZ PERERA",1,0,0,0,0,0,0,0,0,0,0,0,0,8,40,0,1,40,0,106310]
[null,"GUANAJUATO","RUCE791216KR2","RUCE791216HGTLRD00","EDUARDO RUELAS CORNEJO",1,0,0,0,0,0,0,0,0,0,0,0,0,8,40,0,1,40,0,106280]
[null,"GUANAJUATO","TAMP860314464","TAMP860314HGTFZL09","JOSE PAUL TAFOYA MEZA",1,0,0,0,0,0,0,0,0,0,0,0,0,8,40,0,1,40,0,106280]
[null,"GUANAJUATO","MURM820910149","MURM820910HGTRDR08","MAURICIO ALEJANDRO MURILLO RODRIGUEZ",1,0,0,0,0,0,0,0,0,0,0,0,0,8,40,0,1,40,0,101453]
[null,"GUANAJUATO","REGJ781111QG6","REGJ781111HGTYRN09","JUAN MANUEL REYES GUERRERO",1,0,0,0,0,0,0,0,0,0,0,0,0,8,40,0,1,40,0,43411]
[null,"GUANAJUATO","CEAE800524DE1","CEAE800524MDFCSL07","ELSA CECEﾑA ASCOBERETA",1,0,0,0,0,0,0,0,0,0,0,0,0,8,40,0,1,40,0,87336]
[null,"GUANAJUATO","ROVR580704ND4","ROVR580704HVZXLB09","ROBERTO ROA VELAZQUEZ",1,0,0,0,0,0,0,0,0,0,0,0,0,8,40,0,1,40,0,106958]
[null,"GUANAJUATO","AUGF640316LK3","AUGF640316HGTGRR05","FRANCISCO JAVIER AGUIRRE GUERRERO",1,0,0,0,0,0,0,0,0,0,0,0,0,8,40,0,1,40,0,49319]
[null,"GUANAJUATO","CAVS681207JX2","CAVS681207HGTNRL04","SALVADOR CANO VARGAS",1,0,0,0,0,0,0,0,0,0,0,0,0,8,40,0,1,40,0,106808]
[null,"GUANAJUATO","MACE770912412","MACE770912HQTRHC07","ECTOR JAVIER MARTINEZ CHAVEZ",1,0,0,0,0,0,0,0,0,0,0,0,0,8,40,0,1,40,0,106688]
[null,"GUANAJUATO","FOQP690616QU0","FOQP690616MGTLVT01","PETRA FLORES QUEVEDO",1,0,0,0,0,0,0,0,0,0,0,0,0,8,40,0,1,40,0,91154]
[null,"GUANAJUATO","DOOM7502039N2","DOOM750203HGTMLN08","MANUEL DOMINGUEZ OLVERA",1,0,0,0,0,0,0,0,0,0,0,0,0,8,40,0,1,40,0,98228]
[null,"GUANAJUATO","RERM7802175Q8","RERM780217MGTYJR00","MARIANA REYES ROJAS",1,0,0,0,0,0,0,0,0,0,0,0,0,8,40,0,1,40,0,96400]
[null,"GUANAJUATO","ROBA860619I59","RXBA860619MDFDRR07","ARIANA RODRIGUEZ BRITO",1,0,0,0,0,0,0,0,0,0,0,0,0,8,40,0,1,40,0,98228]
[null,"GUANAJUATO","HEAD9302028F6","HEAD930202HGTRLN05","DANIEL HERNANDEZ ALDACO",1,0,0,0,0,0,0,0,0,0,0,0,0,8,40,0,1,40,0,28446]
[null,"GUANAJUATO","CEGF8505052A9","CEGF850505HGTLTR01","FERNANDO CELEDON GUTIERREZ",1,0,0,0,0,0,0,0,0,0,0,0,0,8,40,0,1,40,0,121206]
[null,"GUANAJUATO","RULS870916391","RULS870916HGTZPR06","SERGIO ISMAEL RUIZ LOPEZ",1,0,0,0,0,0,0,0,0,0,0,0,0,8,40,0,1,40,0,155536]
[null,"GUANAJUATO","JIAR5906097A6","JIAR590609HVZMNB07","ROBERTO JIMENEZ DEL ANGEL",1,0,0,0,0,0,0,0,0,0,0,0,0,8,40,0,1,40,0,362736]
[null,"Total Personas : ",270,null,null,null,null,null,null,null,null,null,null,null,null,null,null,null,null,null,null,"Total Recursos Ejercidos:",null,null,{"$f":"SUBTOTAL(109,Tabla11[Total de recursos presupuestales ejercidos en servicios personales en el periodo\n(2)])","v":15022280}]
[]
[null,"Fuente : Información proporcionada por las Entidades Federativas."]

{"sheet":"II C y 1_","index":5,"n_rows":291,"n_cols":22,"rows_kept":291,"cut":false,"hidden":false,"merged":[[285,18,285,19],[11,6,12,6],[11,7,12,7],[11,18,11,19],[11,3,12,3],[11,4,12,4],[8,1,8,8],[11,1,12,1],[11,2,12,2],[11,5,12,5],[11,20,12,20],[11,21,12,21],[11,8,12,8],[11,9,11,15],[11,16,12,16],[11,17,12,17]]}
[]
[]
[]
[]
[]
[]
[]
[null,"Formato: Personal Federalizado por Registro Federal de Contribuyentes"]
[null,{"$f":"IF('Caratula Resumen'!D22=\"Elige el Periodo…\",\"\",'Caratula Resumen'!D22)","v":"Fondo de Aportaciones para la Educación Tecnológica y de Adultos/Instituto Nacional para la Educación de los Adultos (FAETA/INEA)"},null,null,null,null,null,null,null,null,null,null,null,null,null,null,null,null,null,null,{"$f":"IF('Caratula Resumen'!D23=\"Elige el Periodo…\",\"\",'Caratula Resumen'!D23)","v":"4to. Trimestre"}]
[]
[]
[null,"Entidad Federativa","Clave CT","Turno","RFC","CURP","Nombre","Funcion Real","Horas que labora en el Centro de Trabajo","Clave Presupuestal",null,null,null,null,null,null,"Tipo de Categoría","Identificador de Contrato de Honorarios","Periodo de efecto de pago en el trimestre",null,"Percepciones pagadas en el Periodo de Comisión con Presupuesto Federal*","Percepciones pagadas en el Periodo de Comisión con Presupuesto de otra fuente*"]
[null,null,null,null,null,null,null,null,null,"Partida Presupuestal","Código de Pago","Clave de Unidad","Clave de Sub Unidad","Clave de Categoría","Horas Semana Mes ","Número de Plaza",null,null,"Inicial","Termino"]
[]
[null,"Entidad Federativa","Clave CT","Turno","RFC","CURP","Nombre","Funcion Real","Horas que labora en el Centro de Trabajo","Partida Presupuestal","Código de Pago","Clave de Unidad","Clave de Sub Unidad","Clave de Categoría","Horas semana mes","Número de plaza","Tipo de Categoría","Identificador de Contrato de Honorarios","Periodo de efecto de pago en el trimestre\nInicial","Periodo de efecto de pago en el trimestre\nTermino","Percepciones pagadas en el Periodo de Comisión con Presupuesto Federal*","Percepciones pagadas en el Periodo de Comisión con Presupuesto de otra fuente*"]
[null,"GUANAJUATO","11EBS0027E",100,"AAGH700108U53","AAGH700108MGTLRR09","HORTENCIA ALMANZA GARCIA","TECNICO DOCENTE",35,83101,1,7,17,"T03820",0,1943,2,null,null,null,55008,0]
[null,"GUANAJUATO","11EBS0027E",100,"AAPR490907F72","AAPR490907MDFLLS06","MA. DEL ROSARIO ROCIO ALMAGRO PALATO","ADMINISTRATIVO ESPECIALIZADO",35,83101,1,7,15,"A01803",0,30,2,null,null,null,42322,0]
[null,"GUANAJUATO","11EBS0027E",100,"AEAJ851118LC0","AEAJ851118HGTRCN00","JUAN CARLOS ARMENTA ACEVEDO","TECNICO DOCENTE",35,83101,1,7,23,"T03820",0,1280,2,null,null,null,51842,0]
[null,"GUANAJUATO","11EBS0027E",100,"AELM6906275A6","AELR690627MGTRPS15","MA ROSARIO ARREGUIN LOPEZ","TECNICO DOCENTE",35,83101,1,7,25,"T03820",0,2195,2,null,null,null,53916,0]
[null,"GUANAJUATO","11EBS0027E",100,"AEPB811216AUA","AEPB811216MGTRLL03","BLANCA BERENICE ARREGUIN PALMA","PROFESIONAL DICTAMINADOR DE SERVICIOS ESPECIALIZADOS",35,83101,1,2,4,"CF21865",0,8,2,null,null,null,73104,0]
[null,"GUANAJUATO","11EBS0027E",100,"AERS660208UT4","AERS660208HGTRYR01","SERGIO ARREDONDO RAYA","TECNICO DOCENTE",35,83101,1,7,13,"T03820",0,2241,2,null,null,null,57092,0]
[null,"GUANAJUATO","11EBS0027E",100,"AILP690120TW9","AILP690120MSPRNT09","PATRICIA DE JESUS ARCIGA LEON","JEFE DE OFICINA",35,83101,1,7,21,"A01807",0,169,2,null,null,null,48917,0]
[null,"GUANAJUATO","11EBS0027E",100,"AOMM651230U5A","AOMM651230MGTBSY06","MA. MAYELA ABOYTES MOSQUEDA","JEFE DE OFICINA",35,83101,1,9,50,"A01807",0,297,2,null,null,null,54711,0]
[null,"GUANAJUATO","11EBS0027E",100,"AUGA6812277W5","AUGA681227MGTGRN03","ANA MARIA AGUILAR GARCIA","ANALISTA ADMINISTRATIVO",35,83101,1,7,19,"A01806",0,450,2,null,null,null,41444,0]
[null,"GUANAJUATO","11EBS0027E",100,"AUGF640316LK3","AUGF640316HGTGRR05","FRANCISCO JAVIER AGUIRRE GUERRERO","COORDINADOR DE ZONA",40,83101,1,7,19,"CF36014",0,522,5,null,null,null,49319,0]
[null,"GUANAJUATO","11EBS0027E",100,"AURA5705038S9","AURA570503HGTGND03","JOSE ADOLFO AGUILERA RENDON","TECNICO DOCENTE",35,83101,1,7,36,"T03820",0,362,2,null,null,null,59342,0]
[null,"GUANAJUATO","11EBS0027E",100,"AURM640517UH3","AURM640517HGTGCR01","MARTIN AGUIRRE RICO","ANALISTA ADMINISTRATIVO",35,83101,1,7,40,"A01806",0,117,2,null,null,null,48427,0]
[null,"GUANAJUATO","11EBS0027E",100,"AUTC7502082I3","AUTC750208MGTGRN15","MA. CONSUELO AGUILAR TIRADO","TECNICO DOCENTE",35,83101,1,7,16,"T03820",0,1623,2,null,null,null,55222,0]
[null,"GUANAJUATO","11EBS0027E",100,"BABM6804276E6","BABM680427MMCXLR01","MARGARITA BAÑOS BAILON","TECNICO MEDIO",35,83101,1,7,23,"T03803",0,92,2,null,null,null,45761,0]
[null,"GUANAJUATO","11EBS0027E",100,"BACA640430UIA","BACA640430HGTLRN06","ANTONIO BALTAZAR CORTES","TECNICO DOCENTE",35,83101,1,7,16,"T03820",0,1739,2,null,null,null,55947,0]
[null,"GUANAJUATO","11EBS0027E",100,"BAGJ5610276T2","BAGC561027HGTLLR02","J. CARMEN BALDERAS GALLEGOS","TECNICO DOCENTE",35,83101,1,7,19,"T03820",0,658,2,null,null,null,50964,0]
[null,"GUANAJUATO","11EBS0027E",100,"BARA6501175H5","BARA650117MGTRDN02","ANTONIA BARRERA RODRIGUEZ","JEFE DE OFICINA",35,83101,1,7,16,"A01807",0,231,2,null,null,null,53781,0]
[null,"GUANAJUATO","11EBS0027E",100,"BAVG670930HU0","BAVG670930MGTRZD05","MA. GUADALUPE BARCENAS VAZQUEZ","TECNICO DOCENTE",35,83101,1,7,35,"T03820",0,664,2,null,null,null,61649,0]
[null,"GUANAJUATO","11EBS0027E",100,"BEBL7508072M7","BEBL750807HQTRRS05","J. LUIS BERRA BORTOLINI","TECNICO DOCENTE",35,83101,1,7,28,"T03820",0,125,2,null,null,null,53820,0]
[null,"GUANAJUATO","11EBS0027E",100,"BEMS700226KJ6","BEMS700226HGTCNL00","SALVADOR BECERRA MANDUJANO","TECNICO DOCENTE",35,83101,1,7,23,"T03820",0,2892,2,null,null,null,56226,0]
[null,"GUANAJUATO","11EBS0027E",100,"BINL4906195XA","BINL490619HDFRGS05","JOSE LUIS BRIBIESCA NEGRETE","JEFE DE OFICINA",35,83101,1,7,21,"A01807",0,132,2,null,null,null,50765,0]
[null,"GUANAJUATO","11EBS0027E",100,"BIRL710430QF2","BIRL710430HGTRZB03","LIBRADO BRICEÑO RUIZ","TECNICO DOCENTE",35,83101,1,7,21,"T03820",0,1590,2,null,null,null,55925,0]
[null,"GUANAJUATO","11EBS0027E",100,"CAAB610110HC5","CAAB610110MGTRRR07","BERTHA ANGELICA CARPIO ARAGON","TECNICO DOCENTE",35,83101,1,7,23,"T03820",0,2463,2,null,null,null,35544,0]
[null,"GUANAJUATO","11EBS0027E",100,"CABF530212GK8","CABF530212HGTNRR05","FRANCISCO JAVIER CANO BARRON","TECNICO DOCENTE",35,83101,1,7,33,"T03820",0,686,2,null,null,null,52160,0]
[null,"GUANAJUATO","11EBS0027E",100,"CACF6710055H4","CACF671005HGTLDR06","FRANCISCO CALDERON CAUDILLO","TECNICO DOCENTE",35,83101,1,7,38,"T03820",0,1102,2,null,null,null,55056,0]
[null,"GUANAJUATO","11EBS0027E",100,"CACP630616HG8","CACP630616MGTLHT16","MA. PATRICIA DOLORES CALDERON CHAVEZ","TECNICO MEDIO",35,83101,1,7,14,"T03803",0,178,2,null,null,null,46135,0]
[null,"GUANAJUATO","11EBS0027E",100,"CAEJ651225BV9","CAEJ651225HVZHSS03","JESUS CHAGALA ESPEJO","TECNICO DOCENTE",35,83101,1,7,26,"T03820",0,2946,2,null,null,null,49829,0]
[null,"GUANAJUATO","11EBS0027E",100,"CAGR650930FB6","CAGR650930HGTLYB04","RUBEN CALDERON GAYTAN","TECNICO DOCENTE",35,83101,1,7,25,"T03820",0,1269,2,null,null,null,55290,0]
[null,"GUANAJUATO","11EBS0027E",100,"CAGR690302HRA","CAGR690302MGTMMS03","MA. DEL ROSARIO CAMPOS GOMEZ","SECRETARIA C",35,83101,1,7,23,"A03804",0,300,2,null,null,null,47019,0]
[null,"GUANAJUATO","11EBS0027E",100,"CAGY820417182","CAGY820417MGTRTJ03","YAJAHIRA CARDENAS GUTIERREZ","TECNICO MEDIO",35,83101,1,7,24,"T03803",0,32,2,null,null,null,37647,0]
[null,"GUANAJUATO","11EBS0027E",100,"CAJU6804082V6","CAXJ680408MGTMXN08","JUANA MARIA CAMACHO ","JEFE DE OFICINA",35,83101,1,7,18,"A01807",0,2681,2,null,null,null,52409,0]
[null,"GUANAJUATO","11EBS0027E",100,"CALM860815G43","CALM860815MJCHNY02","MAYRA CAROLINA CHAVEZ DE LEÓN","SECRETARIA C",35,83101,1,7,23,"A03804",0,171,2,null,null,null,39216,0]
[null,"GUANAJUATO","11EBS0027E",100,"CALR730329AHA","CALR730329HGTRZB02","RUBEN DARIO CARDENAS LAZARO","COORD. DE SERVICIOS ESP.",35,83101,1,8,47,"CF33849",0,230,2,null,null,null,52075,0]
[null,"GUANAJUATO","11EBS0027E",100,"CAOD910826S90","CAOD910826MSPNRL03","DULCE VIRIDIANA CANO ORTA","ESPECIALISTA EN PROYECTOS TECNICOS",35,83101,1,7,29,"T03810",0,201,2,null,null,null,37456,0]
[null,"GUANAJUATO","11EBS0027E",100,"CAOE780824GY2","CAOE780824MGTSRM07","EMILIA CASTELLANO ORTEGA","TECNICO MEDIO",35,83101,1,7,21,"T03803",0,3742,2,null,null,null,46192,0]
[null,"GUANAJUATO","11EBS0027E",100,"CAPJ840105CE0","CAPJ840105HGTMRL00","JULIO CESAR CAMACHO PRADO","TECNICO DOCENTE",35,83101,1,7,27,"T03820",0,1116,2,null,null,null,46675,0]
[null,"GUANAJUATO","11EBS0027E",100,"CARA730215VE3","CARA730215MGTHJL00","ALMA DELIA CHAVEZ ROJAS","TECNICO MEDIO",35,83101,1,7,24,"T03803",0,7,2,null,null,null,46452,0]
[null,"GUANAJUATO","11EBS0027E",100,"CARJ550620A19","CARJ550620HGTSDM09","JAIME CASTILLO RODRIGUEZ","TECNICO DOCENTE",35,83101,1,7,17,"T03820",0,794,2,null,null,null,59667,0]
[null,"GUANAJUATO","11EBS0027E",100,"CASR640104TEA","CASR640104MGTBNS05","ROSA MARIA CABRERA SANCHEZ","ESPECIALISTA EN PROYECTOS TECNICOS",35,83101,1,8,44,"T03810",0,2212,2,null,null,null,44677,0]
[null,"GUANAJUATO","11EBS0027E",100,"CATE6508044X6","CATE650804MGTRRS04","ESPERANZA CARRILLO TORRES","TECNICO DOCENTE",35,83101,1,7,16,"T03820",0,622,2,null,null,null,55243,0]
[null,"GUANAJUATO","11EBS0027E",100,"CAVA651011TB7","CAVA651011HGTLRL04","JOSE ALFREDO CALDERON VARELA","TECNICO MEDIO",35,83101,1,7,15,"T03803",0,20,2,null,null,null,49140,0]
[null,"GUANAJUATO","11EBS0027E",100,"CAVJ620328P75","CAVG620328HGTHRD03","J. GUADALUPE CHAVEZ VARGAZ","TECNICO DOCENTE",35,83101,1,7,15,"T03820",0,2591,2,null,null,null,57012,0]
[null,"GUANAJUATO","11EBS0027E",100,"CAVS681207JX2","CAVS681207HGTNRL04","SALVADOR CANO VARGAS","COORDINADOR DE ZONA",40,83101,1,7,15,"CF36014",0,45,5,null,null,null,106808,0]
[null,"GUANAJUATO","11EBS0027E",100,"CEAE800524DE1","CEAE800524MDFCSL07","ELSA CECEÑA ASCOBERETA","COORDINADOR DE ZONA",40,83101,1,2,4,"CF36014",0,349,5,null,null,null,87336,0]
[null,"GUANAJUATO","11EBS0027E",100,"CEGF8505052A9","CEGF850505HGTLTR01","FERNANDO CELEDON GUTIERREZ","JEFE DE DEPARTAMENTO",40,83101,1,8,46,"CF01059",0,361,5,null,null,null,121206,0]
[null,"GUANAJUATO","11EBS0027E",100,"CIVM630826EF1","CIVR630826MGTSRS09","MA. DEL ROSARIO CISNEROS VERDIN","TECNICO DOCENTE",35,83101,1,7,23,"T03820",0,1959,2,null,null,null,51855,0]
[null,"GUANAJUATO","11EBS0027E",100,"COBA780319BUA","COBA780319HGTRTN00","JOSE ANTONIO CORDOBA BAUTISTA","ESPECIALISTA EN PROYECTOS TECNICOS",35,83101,1,7,16,"T03810",0,3572,2,null,null,null,40362,0]
[null,"GUANAJUATO","11EBS0027E",100,"COCB750608U65","COCB750608MGTRRL08","BLANCA RAQUEL CORONEL CARBAJAL","TECNICO DOCENTE",35,83101,1,7,38,"T03820",0,1867,2,null,null,null,53768,0]
[null,"GUANAJUATO","11EBS0027E",100,"COJP700317TZ9","COJP700317HMNRMD06","PEDRO CORTES JIMENEZ","PROFESIONAL DICTAMINADOR DE SERVICIOS ESPECIALIZADOS",35,83101,1,1,3,"CF21865",0,2,2,null,null,null,31831,0]
[null,"GUANAJUATO","11EBS0027E",100,"COMM660914G87","COMR660914MGTNDC09","MA. DEL ROCIO CONCHA MEDINA","TECNICO DOCENTE",35,83101,1,5,12,"T03820",0,151,2,null,null,null,49142,0]
[null,"GUANAJUATO","11EBS0027E",100,"COOD541119637","COOD541119MGTNRL00","DULCE MARIA ELIZABETH CONTRERAS ORDUÑA","JEFE DE OFICINA",35,83101,1,9,52,"A01807",0,578,2,null,null,null,50368,0]
[null,"GUANAJUATO","11EBS0027E",100,"COOM721217SVA","COOM721217MGTNLN02","MA. MANUELA CONTRERAS OLMOS","TECNICO DOCENTE",35,83101,1,7,22,"T03820",0,207,2,null,null,null,56012,0]
[null,"GUANAJUATO","11EBS0027E",100,"COOS660919CRA","COOS660919MGTNLS08","SUSANA ISABEL CONTRERAS OLMOS","TECNICO MEDIO",35,83101,1,7,22,"T03803",0,1631,2,null,null,null,44097,0]
[null,"GUANAJUATO","11EBS0027E",100,"COPC760616J13","COPC760616HGTRTR05","CARLOS ALBERTO CORDOBA PATIÑO","OFICIAL DE SERVICIOS Y MANTEN.",35,83101,1,2,5,"S01803",0,117,2,null,null,null,42555,0]
[null,"GUANAJUATO","11EBS0027E",100,"COPG660114BC1","COPG660114HGTNLR03","GERARDO LUIS CONTRERAS PALACIOS","TECNICO DOCENTE",35,83101,1,7,19,"T03820",0,281,2,null,null,null,56654,0]
[null,"GUANAJUATO","11EBS0027E",100,"COSY800415BF0","COSY800415MGTRVN04","YUNERY CORTES SAAVEDRA","ADMINISTRATIVO ESPECIALIZADO",35,83101,1,7,15,"A01803",0,152,2,null,null,null,42027,0]
[null,"GUANAJUATO","11EBS0027E",100,"CUPM810513D93","CUPM810513HGTRRR00","MARTIN ANTONIO CRUZ PEREZ","TECNICO DOCENTE",35,83101,1,7,25,"T03820",0,942,2,null,null,null,53250,0]
[null,"GUANAJUATO","11EBS0027E",100,"CUPS720728BN7","CUPS720728MGTVSL06","SILVIA CUEVAS PESCADOR","ESPECIALISTA EN PROYECTOS TECNICOS",35,83101,1,7,14,"T03810",0,2482,2,null,null,null,43888,0]
[null,"GUANAJUATO","11EBS0027E",100,"DOOM7502039N2","DOOM750203HGTMLN08","MANUEL DOMINGUEZ OLVERA","JEFE DE DEPARTAMENTO",40,83101,1,2,4,"CF01059",0,133,5,null,null,null,98228,0]
[null,"GUANAJUATO","11EBS0027E",100,"DOVL720318BXA","DOVL720318HGTMLS06","JOSE LUIS DOMINGUEZ VALDES","TECNICO DOCENTE",35,83101,1,7,38,"T03820",0,1701,2,null,null,null,53724,0]
[null,"GUANAJUATO","11EBS0027E",100,"DOVR6304095Y7","DOVR630409MBCMZS05","MARIA DEL ROSARIO DOMINGUEZ VAZQUEZ","TECNICO DOCENTE",35,83101,1,7,27,"T03820",0,1449,2,null,null,null,56518,0]
[null,"GUANAJUATO","11EBS0027E",100,"DULR740520184","DULR740520HGTRPY01","JOSE REYES DURAN LOPEZ","TECNICO DOCENTE",35,83101,1,7,27,"T03820",0,4511,2,null,null,null,54366,0]
[null,"GUANAJUATO","11EBS0027E",100,"DUVE540209Q63","DUVE540209HGTRLR06","ERNESTO DURAN VALDIVIA","TECNICO DOCENTE",35,83101,1,7,27,"T03820",0,1242,2,null,null,null,62130,0]
[null,"GUANAJUATO","11EBS0027E",100,"EASG700512IU9","EASG700512MCMSNR00","GRACIELA ESCAMILLA SANCHEZ","SECRETARIA C",35,83101,1,7,21,"A03804",0,3741,2,null,null,null,47592,0]
[null,"GUANAJUATO","11EBS0027E",100,"EIRJ6812089I5","EIRC681208HGTNMR05","J. CARLOS ENRIQUEZ RAMIREZ","TECNICO DOCENTE",35,83101,1,7,18,"T03820",0,1561,2,null,null,null,55925,0]
[null,"GUANAJUATO","11EBS0027E",100,"FAHI7401088Z2","FAHI740108HGTBRV04","IVAN FABELA HERNANDEZ","TECNICO DOCENTE",35,83101,1,7,33,"T03820",0,1793,2,null,null,null,54449,0]
[null,"GUANAJUATO","11EBS0027E",100,"FEET711003EB8","FEET711003MGTLSR05","TERESA FELIX ESTRELLA","ANALISTA ADMINISTRATIVO",35,83101,1,7,22,"A01806",0,283,2,null,null,null,49838,0]
[null,"GUANAJUATO","11EBS0027E",100,"FICJ7603185H9","FICT760318HGTRSR03","J. TRINIDAD FRIAS CASTAÑEDA","TECNICO DOCENTE",35,83101,1,7,40,"T03820",0,2114,2,null,null,null,40261,0]
[null,"GUANAJUATO","11EBS0027E",100,"FOGF6810217L0","FOGF681021HGTLRR06","JOSE FERNANDO FLORES GARCIA","TECNICO DOCENTE",35,83101,1,7,16,"T03820",0,703,2,null,null,null,61143,0]
[null,"GUANAJUATO","11EBS0027E",100,"FOMJ7811187W8","FOMJ781118HGTLDN07","JUAN PABLO FLORES MEDINA","TECNICO DOCENTE",35,83101,1,7,28,"T03820",0,128,2,null,null,null,51636,0]
[null,"GUANAJUATO","11EBS0027E",100,"FOMO6906162N2","FOMO690616HGTNDS05","OSCAR FONSECA MEDRANO","TECNICO DOCENTE",35,83101,1,7,27,"T03820",0,65,2,null,null,null,54084,0]
[null,"GUANAJUATO","11EBS0027E",100,"FONO7308067J5","FOXN730806MGTLXR04","NORMA LILIA FLORES ","TECNICO MEDIO",35,83101,1,7,19,"T03803",0,24,2,null,null,null,46707,0]
[null,"GUANAJUATO","11EBS0027E",100,"FOQL7110275I8","FOQL711027MGTLVN02","LEONOR FLORES QUEVEDO","TECNICO MEDIO",35,83101,1,7,41,"T03803",0,22,2,null,null,null,39663,0]
[null,"GUANAJUATO","11EBS0027E",100,"FOQP690616QU0","FOQP690616MGTLVT01","PETRA FLORES QUEVEDO","COORDINADOR DE ZONA",40,83101,1,7,22,"CF36014",0,44,5,null,null,null,91154,0]
[null,"GUANAJUATO","11EBS0027E",100,"GACC7402201D0","GACC740220MVZRYL09","CLAUDIA GARCIA CAYETANO","TECNICO DOCENTE",35,83101,1,7,27,"T03820",0,142,2,null,null,null,46675,0]
[null,"GUANAJUATO","11EBS0027E",100,"GAEG840418L85","GAEG840418HGTLSS02","GUSTAVO ANTONIO GALLEGOS ESPINOSA","COORDINADOR DE ZONA",40,83101,1,7,27,"CF36014",0,46,5,null,null,null,91627,0]
[null,"GUANAJUATO","11EBS0027E",100,"GAHJ611031AR1","GAHJ611031HGTRRV01","JAVIER GRANADOS HERNANDEZ","TECNICO DOCENTE",35,83101,1,7,40,"T03820",0,2447,2,null,null,null,54210,0]
[null,"GUANAJUATO","11EBS0027E",100,"GALA740123JB8","GALA740123MGTLPL08","ALMA ROSA GALINDO LOPEZ","ESPECIALISTA EN PROYECTOS TECNICOS",35,83101,1,7,23,"T03810",0,187,2,null,null,null,39789,0]
[null,"GUANAJUATO","11EBS0027E",100,"GAMJ711118AJ8","GAMJ711118HGTRCC07","JACOBO GARCIA MICHACA","TECNICO DOCENTE",35,83101,1,7,18,"T03820",0,1932,2,null,null,null,54470,0]
[null,"GUANAJUATO","11EBS0027E",100,"GAML720417UE8","GAML720417HGTRRS07","LUIS ALBERTO GARCIA MARTINEZ","TECNICO DOCENTE",35,83101,1,7,35,"T03820",0,2754,2,null,null,null,55842,0]
[null,"GUANAJUATO","11EBS0027E",100,"GAPE660401EX7","GAPE660401HDFRRD03","EDUARDO GARCIA PEREZ","TECNICO DOCENTE",35,83101,1,7,14,"T03820",0,1431,2,null,null,null,48300,0]
[null,"GUANAJUATO","11EBS0027E",100,"GARM751031J11","GARM751031HGTRMS07","MOISES GRANADOS RAMOS","PROFESIONAL DICTAMINADOR DE SERVICIOS ESPECIALIZADOS",35,83101,1,8,47,"CF21865",0,5,2,null,null,null,73329,0]
[null,"GUANAJUATO","11EBS0027E",100,"GARR860218GD7","GARR860218HGTRJL03","JOSE RAUL GRANADOS ROJAS","SECRETARIA C",35,83101,1,9,51,"A03804",0,602,2,null,null,null,37647,0]
[null,"GUANAJUATO","11EBS0027E",100,"GOAA581209FLA","GOAA581209MGTNGL08","ALICIA GONZALEZ AGUIRRE","ESPECIALISTA EN PROYECTOS TECNICOS",35,83101,1,7,22,"T03810",0,201,2,null,null,null,46665,0]
[null,"GUANAJUATO","11EBS0027E",100,"GOAS751103PH7","GOAS751103MGTNRL01","SILVIA SANTOS GONZALEZ ARANDA","TECNICO DOCENTE",35,83101,1,7,13,"T03820",0,1656,2,null,null,null,52650,0]
[null,"GUANAJUATO","11EBS0027E",100,"GOGA680110DL7","GOGA680110MGTNYN00","ANA BERTHA GONZALEZ GAYTAN","TECNICO DOCENTE",35,83101,1,7,25,"T03820",0,757,2,null,null,null,56864,0]
[null,"GUANAJUATO","11EBS0027E",100,"GOGE831013479","GOGE831013MGTNRL03","ELIA JUDITH GONZALEZ GUERRA","ESPECIALISTA EN PROYECTOS TECNICOS",35,83101,1,9,50,"T03810",0,198,2,null,null,null,37879,0]
[null,"GUANAJUATO","11EBS0027E",100,"GOGL670809V8A","GOGL670809HGTNRS00","LUIS ALBERTO GONZALEZ GARCIA","TECNICO DOCENTE",35,83101,1,7,25,"T03820",0,383,2,null,null,null,57890,0]
[null,"GUANAJUATO","11EBS0027E",100,"GOGR650725KF1","GOGR650725HGTNRB02","ROBERTO GONZALEZ GARCIA","TECNICO DOCENTE",35,83101,1,7,21,"T03820",0,235,2,null,null,null,56632,0]
[null,"GUANAJUATO","11EBS0027E",100,"GOMI721001DE2","GOMI721001MDFNJN03","INES ROSARIO GONZALEZ MUJICA","ANALISTA ADMINISTRATIVO",35,83101,1,7,15,"A01806",0,420,2,null,null,null,45619,0]
[null,"GUANAJUATO","11EBS0027E",100,"GOMM610218KG4","GOMM610218MGTNRR05","MARTA PATRICIA GONZALEZ MORENO","SECRETARIA C",35,83101,1,7,23,"A03804",0,4412,2,null,null,null,45370,0]
[null,"GUANAJUATO","11EBS0027E",100,"GOND6504247RA","GOND650424MGTNXL03","DALIA SONIA GONZALEZ NIÑO","SECRETARIA C",35,83101,1,7,17,"A03804",0,135,2,null,null,null,44677,0]
[null,"GUANAJUATO","11EBS0027E",100,"GOPS8011178I3","GOPS801117MGTMRN09","MARIA SANDRA GOMEZ PEREZ","SECRETARIA C",35,83101,1,7,20,"A03804",0,2221,2,null,null,null,38186,0]
[null,"GUANAJUATO","11EBS0027E",100,"GORE840602N47","GORE840602HGTNDM00","EMMANUEL GONZALEZ RODRIGUEZ","TECNICO DOCENTE",35,83101,1,7,27,"T03820",0,2520,2,null,null,null,50226,0]
[null,"GUANAJUATO","11EBS0027E",100,"GOSL721116725","GOSL721116HGTRSS06","LUIS JAVIER GORDILLO SOSA","TECNICO DOCENTE",35,83101,1,7,28,"T03820",0,3037,2,null,null,null,53894,0]
[null,"GUANAJUATO","11EBS0027E",100,"GOTJ781129KP5","GOTJ781129MGTMPC08","JACQUELINE GOMEZ TAPIA","ESPECIALISTA EN PROYECTOS TECNICOS",35,83101,1,7,17,"T03810",0,3702,2,null,null,null,44333,0]
[null,"GUANAJUATO","11EBS0027E",100,"GUAA541207PD5","GUAA541207MGTTVL07","ALMA ROSA GUTIERREZ AVILES","JEFE DE OFICINA",35,83101,1,7,19,"A01807",0,4231,2,null,null,null,45229,0]
[null,"GUANAJUATO","11EBS0027E",100,"GUGJ8305032WA","GUGJ830503HGTTVN06","JUAN JESUS GUTIERREZ GUEVARA","TECNICO DOCENTE",35,83101,1,7,20,"T03820",0,263,2,null,null,null,45819,0]
[null,"GUANAJUATO","11EBS0027E",100,"GUHA770213FQ8","GUHA770213MGTVRL02","ALMA ROSA GUEVARA HERNANDEZ","TECNICO DOCENTE",35,83101,1,7,23,"T03820",0,2046,2,null,null,null,56436,0]
[null,"GUANAJUATO","11EBS0027E",100,"GUMA6701215Q1","GUMA670121MGTTRN09","ANA GUTIERREZ MORENO","TECNICO DOCENTE",35,83101,1,7,24,"T03820",0,700,2,null,null,null,55768,0]
[null,"GUANAJUATO","11EBS0027E",100,"GUMC6804029G4","GUMC680402MGTZNR09","MARIA DEL CARMEN GUZMAN MANZANILLA","TECNICO DOCENTE",35,83101,1,7,38,"T03820",0,1911,2,null,null,null,57126,0]
[null,"GUANAJUATO","11EBS0027E",100,"GUOA740914U2A","GUOA740914MMNDRN06","MA. DE LOS ANGELES GUDIÑO ORDAZ","SECRETARIA C",35,83101,1,9,49,"A03804",0,16,2,null,null,null,44855,0]
[null,"GUANAJUATO","11EBS0027E",100,"GURR6007275B3","GURR600727HSPLMD06","RODOLFO GUEL RAMIREZ","TECNICO DOCENTE",35,83101,1,7,30,"T03820",0,2478,2,null,null,null,54920,0]
[null,"GUANAJUATO","11EBS0027E",100,"GURV740105E98","GURV740105MGTRDR07","VERONICA GUERRERO RODRIGUEZ","SECRETARIA C",35,83101,1,7,23,"A03804",0,393,2,null,null,null,45731,0]
[null,"GUANAJUATO","11EBS0027E",100,"GUSS6608135L6","GUSS660813MGTRNF04","SOFIA GUERRERO SANDOVAL","TECNICO DOCENTE",35,83101,1,7,23,"T03820",0,590,2,null,null,null,55200,0]
[null,"GUANAJUATO","11EBS0027E",100,"HEAD9302028F6","HEAD930202HGTRLN05","DANIEL HERNANDEZ ALDACO","JEFE DE DEPARTAMENTO",40,83101,1,8,46,"CF01059",0,21,5,null,null,null,28446,0]
[null,"GUANAJUATO","11EBS0027E",100,"HEAE670513TV7","HEAE670513HGTRGD08","EDUARDO HERNANDEZ AGUADO","ANALISTA ADMINISTRATIVO",35,83101,1,3,7,"A01806",0,552,2,null,null,null,47425,0]
[null,"GUANAJUATO","11EBS0027E",100,"HECA7404077F6","HECA740407MGTRND08","ADRIANA HERNANDEZ CANTERO","TECNICO MEDIO",35,83101,1,7,26,"T03803",0,311,2,null,null,null,47060,0]
[null,"GUANAJUATO","11EBS0027E",100,"HECE750420552","HECE750420MGTRRM01","MA. EMILIA HERNANDEZ CARDENAS","JEFE DE OFICINA",35,83101,1,7,18,"A01807",0,410,2,null,null,null,51293,0]
[null,"GUANAJUATO","11EBS0027E",100,"HECG7209202C4","HECG720920MGTRRR07","GRISELDA HERRERA CERVANTES","SECRETARIA C",35,83101,1,7,24,"A03804",0,80,2,null,null,null,46848,0]
[null,"GUANAJUATO","11EBS0027E",100,"HECR621219RI5","HECR621219MGTRRS02","MARIA DEL ROSARIO HERNANDEZ CARDENAS","JEFE DE OFICINA",35,83101,1,7,18,"A01807",0,2481,2,null,null,null,51747,0]
[null,"GUANAJUATO","11EBS0027E",100,"HECS730303TG6","HECS730303MGTRNS05","SUSANA TERESA HERNANDEZ CANTERO","TECNICO MEDIO",35,83101,1,7,14,"T03803",0,1921,2,null,null,null,47592,0]
[null,"GUANAJUATO","11EBS0027E",100,"HEDM871214861","HEDM871214HGTRLN04","JOSE MANUEL HERNANDEZ DELGADO","TECNICO MEDIO",35,83101,1,9,51,"T03803",0,512,2,null,null,null,40362,0]
[null,"GUANAJUATO","11EBS0027E",100,"HEEE731209HI1","HEEE731209MGTRSS09","ESMERALDA HERNANDEZ ESCOGIDO","PROFESIONAL DICTAMINADOR DE SERVICIOS ESPECIALIZADOS",35,83101,1,9,52,"CF21865",0,6,2,null,null,null,73179,0]
[null,"GUANAJUATO","11EBS0027E",100,"HELM750417G75","HELM750417MGTRZG00","MARIA MAGDALENA HERNANDEZ LAZO","TECNICO DOCENTE",35,83101,1,7,19,"T03820",0,122,2,null,null,null,46799,0]
[null,"GUANAJUATO","11EBS0027E",100,"HEMM781102T78","HEMM781102MGTRNR07","MARISELA HERNANDEZ MONTOYA","TECNICO DOCENTE",35,83101,1,7,35,"T03820",0,1999,2,null,null,null,53724,0]
[null,"GUANAJUATO","11EBS0027E",100,"HEPC690801P80","HEPC690801MGTRRR08","MA. DEL CARMEN HERNANDEZ PEREZ","TECNICO DOCENTE",35,83101,1,7,27,"T03820",0,1221,2,null,null,null,55907,0]
[null,"GUANAJUATO","11EBS0027E",100,"HERA790725FQ8","HERA790725MGTRDL08","ALEJANDRA HERNANDEZ RODRIGUEZ","ANALISTA ADMINISTRATIVO",35,83101,1,7,15,"A01806",0,1523,2,null,null,null,44043,0]
[null,"GUANAJUATO","11EBS0027E",100,"HERG571023MS0","HERG571023MGTRPD07","MA. GUADALUPE JUDITH HERNANDEZ RIPALDA","PROFESIONAL DICTAMINADOR DE SERVICIOS ESPECIALIZADOS",35,83101,1,1,1,"CF21865",0,1,2,null,null,null,73404,0]
[null,"GUANAJUATO","11EBS0027E",100,"HERL8008128A5","HERL800812MGTRSR15","LAURA ELENA HERRERA RIOS","TECNICO DOCENTE",35,83101,1,7,20,"T03820",0,4411,2,null,null,null,46453,0]
[null,"GUANAJUATO","11EBS0027E",100,"HESF670102636","HESF670102HGTRLR07","FERMIN HERNANDEZ SILVA","JEFE DE OFICINA",35,83101,1,7,35,"A01807",0,405,2,null,null,null,53153,0]
[null,"GUANAJUATO","11EBS0027E",100,"HOHL860601124","HOHL860601MGTRRZ09","LUZ ANGELICA HORTA HERNANDEZ","PROFESIONAL DICTAMINADOR DE SERVICIOS ESPECIALIZADOS",35,83101,1,2,4,"CF21865",0,4,2,null,null,null,59306,0]
[null,"GUANAJUATO","11EBS0027E",100,"HUED670420517","HUED670420HDFRSV00","DAVID HUERTA ESTRADA","TECNICO DOCENTE",35,83101,1,7,14,"T03820",0,699,2,null,null,null,56160,0]
[null,"GUANAJUATO","11EBS0027E",100,"HUOR660813PR3","HUOR660813MGTRLS01","ROSA ALICIA HUERTA OLIVARES","PROFESIONAL DICTAMINADOR DE SERVICIOS ESPECIALIZADOS",35,83101,1,9,51,"CF21865",0,3,2,null,null,null,53441,0]
[null,"GUANAJUATO","11EBS0027E",100,"JIAR5906097A6","JIAR590609HVZMNB07","ROBERTO JIMENEZ DEL ANGEL","DELEGADO",40,83101,1,5,12,"CF14070",0,32,5,null,null,null,362736,0]
[null,"GUANAJUATO","11EBS0027E",100,"JUAA750702KJ9","JUAA750702HGTRRN04","JOSE ANDRES JUAREZ ARROYO","TECNICO DOCENTE",35,83101,1,7,19,"T03820",0,3033,2,null,null,null,56868,0]
[null,"GUANAJUATO","11EBS0027E",100,"JUON6804281K2","JUON680428HGTRRX00","NOE JUAREZ ORTEGA","TECNICO DOCENTE",35,83101,1,7,41,"T03820",0,2582,2,null,null,null,56654,0]
[null,"GUANAJUATO","11EBS0027E",100,"LAMZ780504N49","LAMZ780504MSLRNN01","ZINTIA DENISE LARA MENDIVIL","TECNICO DOCENTE",35,83101,1,7,24,"T03820",0,2744,2,null,null,null,48313,0]
[null,"GUANAJUATO","11EBS0027E",100,"LAOJ8212131K9","LAOJ821213HGTRLS09","JESUS SAMUEL LARA OLMOS","TECNICO DOCENTE",35,83101,1,7,22,"T03820",0,1573,2,null,null,null,51296,0]
[null,"GUANAJUATO","11EBS0027E",100,"LERF661028KV3","LERF661028HGTNZR04","FERNANDO LEON RUIZ","TECNICO MEDIO",35,83101,1,8,44,"T03803",0,184,2,null,null,null,43756,0]
[null,"GUANAJUATO","11EBS0027E",100,"LERM7308264B5","LERM730826MGTDSN09","MONICA LEDESMA ROSALES","TECNICO DOCENTE",35,83101,1,7,13,"T03820",0,1757,2,null,null,null,52313,0]
[null,"GUANAJUATO","11EBS0027E",100,"LIAR601225KG4","LIAR601225HDGCRN09","RENATO LICON ARANDA","COORDINADOR DE ZONA",40,83101,1,7,14,"CF36014",0,2581,5,null,null,null,106280,0]
[null,"GUANAJUATO","11EBS0027E",100,"LOCJ8109121HA","LOCJ810912HDFPRN00","JUAN CARLOS LOPEZ CRUZ","SECRETARIA C",35,83101,1,7,27,"A03804",0,2592,2,null,null,null,45907,0]
[null,"GUANAJUATO","11EBS0027E",100,"LOGC850904FK8","LOGC850904HGTPRR05","CARLOS ALBERTO LOPEZ GARCIA","TECNICO DOCENTE",35,83101,1,7,24,"T03820",0,67,2,null,null,null,46247,0]
[null,"GUANAJUATO","11EBS0027E",100,"LOLA751009LC7","LOLA751009MGTPNN06","MA. DE LOS ANGELES LOPEZ LUNA","TECNICO DOCENTE",35,83101,1,7,25,"T03820",0,1951,2,null,null,null,54806,0]
[null,"GUANAJUATO","11EBS0027E",100,"LOLB681130LWA","LOLB681130MGTPLT03","BEATRIZ LOPEZ LLANOS","TECNICO DOCENTE",35,83101,1,7,36,"T03820",0,282,2,null,null,null,50158,0]
[null,"GUANAJUATO","11EBS0027E",100,"LOPG651225LA9","LOPG651225MDFPRB01","GABRIELA DE JESUS LOPEZ PERERA","COORDINADOR DE ZONA",40,83101,1,7,38,"CF36014",0,378,5,null,null,null,106310,0]
[null,"GUANAJUATO","11EBS0027E",100,"LOSS570105T33","LOSS570105MTSZLS00","SUSANA ENRIQUETA LOZANO SALCEDO","ANALISTA ADMINISTRATIVO",35,83101,1,9,52,"A01806",0,116,2,null,null,null,44349,0]
[null,"GUANAJUATO","11EBS0027E",100,"LOVE3907178K6","LOVE390717MGTPZS07","MA. ESTELA LOPEZ VAZQUEZ","JEFE DE OFICINA",35,83101,1,7,20,"A01807",0,340,2,null,null,null,51137,0]
[null,"GUANAJUATO","11EBS0027E",100,"LOVH74031691A","LOVH740316HDFPNG06","HUGO LOPEZ VENEGAS","TECNICO DOCENTE",35,83101,1,7,19,"T03820",0,2029,2,null,null,null,54536,0]
[null,"GUANAJUATO","11EBS0027E",100,"LUMR751129U75","LUMR751129HGTGTC02","RICARDO ERNESTO LUGO MATA","TECNICO DOCENTE",35,83101,1,7,30,"T03820",0,109,2,null,null,null,47745,0]
[null,"GUANAJUATO","11EBS0027E",100,"LUOE610116R96","LUOE610116HDGNLM05","EMILIO LUNA OLAGUE","TECNICO DOCENTE",35,83101,1,7,14,"T03820",0,1922,2,null,null,null,56610,0]
[null,"GUANAJUATO","11EBS0027E",100,"LUPI741127IZ3","LUPI741127MDFNRS02","MARIA ISABEL LUNA PEREZ","PROFESIONAL DICTAMINADOR DE SERVICIOS ESPECIALIZADOS",35,83101,1,3,10,"CF21865",0,9,2,null,null,null,73104,0]
[null,"GUANAJUATO","11EBS0027E",100,"LURF6001292T1","LURF600129HGTNMR01","FRANCISCO JAVIER LUNA RAMIREZ","TECNICO DOCENTE",35,83101,1,7,26,"T03820",0,200,2,null,null,null,56666,0]
[null,"GUANAJUATO","11EBS0027E",100,"MAAC750325Q52","MAAC750325MGTLLR02","MA. DEL CARMEN MALDONADO ALMANZA","SECRETARIA C",35,83101,1,1,1,"A03804",0,1522,2,null,null,null,42112,0]
[null,"GUANAJUATO","11EBS0027E",100,"MAAC750527A26","MAAC750527MGTRGR07","CAROLINA MARTINEZ AGREDA","ESPECIALISTA EN PROYECTOS TECNICOS",35,83101,1,8,44,"T03810",0,266,2,null,null,null,40450,0]
[null,"GUANAJUATO","11EBS0027E",100,"MAAL680513MP3","MAAL680513MMNRNZ01","MARIA DE LA LUZ MARTINEZ ANDRADE","TECNICO MEDIO",35,83101,1,7,13,"T03803",0,53,2,null,null,null,48702,0]
[null,"GUANAJUATO","11EBS0027E",100,"MACE770912412","MACE770912HQTRHC07","ECTOR JAVIER MARTINEZ CHAVEZ","COORDINADOR DE ZONA",40,83101,1,7,28,"CF36014",0,351,5,null,null,null,106688,0]
[null,"GUANAJUATO","11EBS0027E",100,"MADT730323NL2","MADT730323MGTTVR17","TERESITA DE JESUS MATA DAVALOS","ESPECIALISTA EN PROYECTOS TECNICOS",35,83101,1,7,21,"T03810",0,466,2,null,null,null,48615,0]
[null,"GUANAJUATO","11EBS0027E",100,"MAGE550714NZ1","MAGE550714HGTRNS03","ESTEBAN MARTINEZ GONZALEZ","TECNICO DOCENTE",35,83101,1,7,30,"T03820",0,127,2,null,null,null,57209,0]
[null,"GUANAJUATO","11EBS0027E",100,"MAGE551119NR4","MAGE551119MGTYRD05","EDITH MAYCOTTE GRANADOS","TECNICO DOCENTE",35,83101,1,7,16,"T03820",0,1630,2,null,null,null,55947,0]
[null,"GUANAJUATO","11EBS0027E",100,"MAGE751103B16","MAGE751103MGTYTR08","ERIKA GUADALUPE MAYCOTTE GUTIERREZ","ANALISTA ADMINISTRATIVO",35,83101,1,7,16,"A01806",0,534,2,null,null,null,48427,0]
[null,"GUANAJUATO","11EBS0027E",100,"MAGM6404092N1","MAGM640409MGTNNR08","MARTA MANDUJANO GONZALEZ","TECNICO DOCENTE",35,83101,1,7,37,"T03820",0,749,2,null,null,null,60785,0]
[null,"GUANAJUATO","11EBS0027E",100,"MALA730704I26","MALA730704HGTRPR02","ARNULFO MARQUEZ LOPEZ","TECNICO DOCENTE",35,83101,1,7,27,"T03820",0,832,2,null,null,null,53767,0]
[null,"GUANAJUATO","11EBS0027E",100,"MAOL731125E39","MAOL731125MGTLRC03","LUCINA MALDONADO ORDUÑO","JEFE DE OFICINA",35,83101,1,9,49,"A01807",0,598,2,null,null,null,51210,0]
[null,"GUANAJUATO","11EBS0027E",100,"MARC601223340","MARC601223MGTRLC03","CECILIA MARTINEZ RUELAS","TECNICO DOCENTE",35,83101,1,7,33,"T03820",0,475,2,null,null,null,50942,0]
[null,"GUANAJUATO","11EBS0027E",100,"MASV810101DZ8","MASV810101MGTRRR01","VERONICA MARTINEZ SARABIA","TECNICO DOCENTE",35,83101,1,7,21,"T03820",0,269,2,null,null,null,56484,0]
[null,"GUANAJUATO","11EBS0027E",100,"MEGG6409203P0","MEGG640920HGTDLR04","GERARDO MEDINA GALVAN","SECRETARIA C",35,83101,1,9,51,"A03804",0,2171,2,null,null,null,44503,0]
[null,"GUANAJUATO","11EBS0027E",100,"MELR640522PX9","MELR640522MGTNNT06","RITA MENDEZ LEON","TECNICO DOCENTE",35,83101,1,7,24,"T03820",0,456,2,null,null,null,54750,0]
[null,"GUANAJUATO","11EBS0027E",100,"MENC680926QE2","MENC680926MGTDVR02","MARIA DEL CARMEN MEDEL NAVARRETE","TECNICO DOCENTE",35,83101,1,7,20,"T03820",0,1929,2,null,null,null,54898,0]
[null,"GUANAJUATO","11EBS0027E",100,"METC6212134V3","METC621213HGTRPS06","CESAR MARTIN MERINO TAPIA","TECNICO DOCENTE",35,83101,1,7,15,"T03820",0,2186,2,null,null,null,54492,0]
[null,"GUANAJUATO","11EBS0027E",100,"MEVG630915G81","MEVG630915MGTRRD08","MA. GUADALUPE MERCADO VARELA","TECNICO DOCENTE",35,83101,1,7,37,"T03820",0,951,2,null,null,null,58121,0]
[null,"GUANAJUATO","11EBS0027E",100,"MISR800307LH4","MISR800307MGTRLS07","ROSAURA MIRANDA SALAZAR","ANALISTA ADMINISTRATIVO",35,83101,1,7,15,"A01806",0,4232,2,null,null,null,49602,0]
[null,"GUANAJUATO","11EBS0027E",100,"MIYA600511Q72","MIYA600511MGTRRN01","MA. ANTONIA MIRANDA YERENA","ANALISTA ADMINISTRATIVO",35,83101,1,7,26,"A01806",0,298,2,null,null,null,44024,0]
[null,"GUANAJUATO","11EBS0027E",100,"MOCK900306NE6","MOCK900306MDFRSR15","KAREN ANEL MORENO CASTILLO","TECNICO DOCENTE",35,83101,1,7,27,"T03820",0,1228,2,null,null,null,46675,0]
[null,"GUANAJUATO","11EBS0027E",100,"MOGC720409SJ9","MOGC720409MGTJZL04","CLAUDIA ELISA MOJICA GUZMAN","TECNICO DOCENTE",35,83101,1,7,13,"T03820",0,2819,2,null,null,null,52262,0]
[null,"GUANAJUATO","11EBS0027E",100,"MOMR770326563","MOMR770326HGTRRB08","ROBERTO CARLOS MORALES MURO","PROFESIONAL DICTAMINADOR DE SERVICIOS ESPECIALIZADOS",35,83101,1,9,51,"CF21865",0,13,2,null,null,null,72510,0]
[null,"GUANAJUATO","11EBS0027E",100,"MORM7609166F8","MORC760916MMCNZR07","MA. DEL CARMEN MONTES DE OCA REZA","TECNICO DOCENTE",35,83101,1,7,16,"T03820",0,2525,2,null,null,null,46461,0]
[null,"GUANAJUATO","11EBS0027E",100,"MOSR650129V62","MOSR650129MGTRNF09","MA. DEL REFUGIO MORONES SANCHEZ","TECNICO DOCENTE",35,83101,1,7,27,"T03820",0,914,2,null,null,null,56549,0]
[null,"GUANAJUATO","11EBS0027E",100,"MOTE6904283LA","MOTE690428MGTRRL09","ELVIRA MORALES TORRES","TECNICO DOCENTE",35,83101,1,7,24,"T03820",0,1715,2,null,null,null,54322,0]
[null,"GUANAJUATO","11EBS0027E",100,"MUHD640208LB9","MUHD640208MDFXRL08","MARIA DOLORES MUÑOZ HERRERA","TECNICO DOCENTE",35,83101,1,7,13,"T03820",0,3030,2,null,null,null,56798,0]
[null,"GUANAJUATO","11EBS0027E",100,"MURE780503RL7","MURE780503MGTXVS02","MARIA ESMERALDA MUÑOZ RIVERA","PROFESIONAL DICTAMINADOR DE SERVICIOS ESPECIALIZADOS",35,83101,1,8,44,"CF21865",0,11,2,null,null,null,73104,0]
[null,"GUANAJUATO","11EBS0027E",100,"MURM820910149","MURM820910HGTRDR08","MAURICIO ALEJANDRO MURILLO RODRIGUEZ","COORDINADOR DE ZONA",40,83101,1,7,21,"CF36014",0,2222,5,null,null,null,101453,0]
[null,"GUANAJUATO","11EBS0027E",100,"NAHL730801RV8","NAHL730801MGTVRR01","MARIA DE LOURDES NAVARRO HERNANDEZ","ANALISTA ADMINISTRATIVO",35,83101,1,7,26,"A01806",0,490,2,null,null,null,45907,0]
[null,"GUANAJUATO","11EBS0027E",100,"NAMS5306098W6","NAMS530609MGTRRL00","SILVIA LAURA NARVAEZ MORA","TECNICO DOCENTE",35,83101,1,7,16,"T03820",0,1619,2,null,null,null,60243,0]
[null,"GUANAJUATO","11EBS0027E",100,"NEAC740715LD9","NEAC740715HGTGRR02","CRISTOBAL NEGRETE ARIAS","TECNICO DOCENTE",35,83101,1,7,20,"T03820",0,1990,2,null,null,null,57612,0]
[null,"GUANAJUATO","11EBS0027E",100,"NEGM641224M74","NEGM641224MGTGVR06","MARTINA NEGRETE GOVEA","TECNICO DOCENTE",35,83101,1,7,23,"T03820",0,2894,2,null,null,null,48078,0]
[null,"GUANAJUATO","11EBS0027E",100,"NEPR690831KW1","NEPR690831HGTGDM08","RAMON GUILLERMO NEGRETE PADRON","TECNICO DOCENTE",35,83101,1,7,23,"T03820",0,264,2,null,null,null,51851,0]
[null,"GUANAJUATO","11EBS0027E",100,"NIMU831228318","NIMU831228MGTXRR02","URSULA MACARENA NIÑO MARTINEZ","TECNICO DOCENTE",35,83101,1,7,33,"T03820",0,570,2,null,null,null,48728,0]
[null,"GUANAJUATO","11EBS0027E",100,"NOSV840205QG9","NOSV840205HGTRLC08","VICTOR ALFONSO NORIEGA SILVA","ANALISTA ADMINISTRATIVO",35,83101,1,1,3,"CF34810",0,31,2,null,null,null,39860,0]
[null,"GUANAJUATO","11EBS0027E",100,"OAGM681221I42","OAGM681221MGTRRR09","MARICRUZ ORDAZ GRANADOS","TECNICO MEDIO",35,83101,1,7,17,"T03803",0,42,2,null,null,null,34580,0]
[null,"GUANAJUATO","11EBS0027E",100,"OEGL8003134Z8","OEGL800313MGTRMR09","LAURA AMERICA ORTEGA GAMIÑO","PROFESIONAL DICTAMINADOR DE SERVICIOS ESPECIALIZADOS",35,83101,1,9,50,"CF21865",0,12,2,null,null,null,72804,0]
[null,"GUANAJUATO","11EBS0027E",100,"OELM6606116J8","OELM660611MGTRRR05","MARTINA ORNELAS LARA","TECNICO DOCENTE",35,83101,1,7,23,"T03820",0,1746,2,null,null,null,52252,0]
[null,"GUANAJUATO","11EBS0027E",100,"OEMJ730208CX6","OEMM730208HGTJDR00","J. MERCED OJEDA MEDINA","TECNICO DOCENTE",35,83101,1,7,27,"T03820",0,299,2,null,null,null,52270,0]
[null,"GUANAJUATO","11EBS0027E",100,"OOPM650124AG1","OOPM650124HGTRRG05","MIGUEL OROZCO PEREZ","TECNICO DOCENTE",35,83101,1,7,16,"T03820",0,413,2,null,null,null,57340,0]
[null,"GUANAJUATO","11EBS0027E",100,"PACL700401SI9","PACL700401MGTRHR04","LAURA PRADO CHAVEZ","ANALISTA ADMINISTRATIVO",35,83101,1,7,23,"A01806",0,388,2,null,null,null,49620,0]
[null,"GUANAJUATO","11EBS0027E",100,"PACP681127IL7","PACP681127MGTRHT00","PATRICIA PRADO CHAVEZ","SECRETARIA C",35,83101,1,7,13,"A03804",0,25,2,null,null,null,48557,0]
[null,"GUANAJUATO","11EBS0027E",100,"PAGG860302DX9","PAGG860302MDFDRB08","GABRIELA PADILLA GUERRERO","ESPECIALISTA EN PROYECTOS TECNICOS",35,83101,1,9,52,"T03810",0,369,2,null,null,null,37497,0]
[null,"GUANAJUATO","11EBS0027E",100,"PAGT5911092P8","PAGT591109HGTLRD01","TEODORO PALMERIN GARCIA","TECNICO DOCENTE",35,83101,1,7,16,"T03820",0,2211,2,null,null,null,56632,0]
[null,"GUANAJUATO","11EBS0027E",100,"PAQF701109SJ2","PAQF701109HGTRNL00","FILEMON PAREDON QUINTERO","TECNICO DOCENTE",35,83101,1,7,19,"T03820",0,2780,2,null,null,null,56092,0]
[null,"GUANAJUATO","11EBS0027E",100,"PEAR630107AT2","PEAR630107HMCXRY08","JOSE REY PEÑA ARRIAGA","ANALISTA ADMINISTRATIVO",35,83101,1,9,51,"A01806",0,115,2,null,null,null,45170,0]
[null,"GUANAJUATO","11EBS0027E",100,"PECA660503AR0","PECA660503MGTRBN07","ANTONIA PEREZ CABELLO","ESPECIALISTA EN PROYECTOS TECNICOS",35,83101,1,7,20,"T03810",0,129,2,null,null,null,45933,0]
[null,"GUANAJUATO","11EBS0027E",100,"PECC830605V49","PECC830605MNEXSN04","CINTHYA PEÑALOZA CISNEROS","TECNICO MEDIO",35,83101,1,7,27,"T03803",0,114,2,null,null,null,42528,0]
[null,"GUANAJUATO","11EBS0027E",100,"PEDM7406101Q5","PEDM740610MDFRMR01","MARGARITA PERALTA DOMINGUEZ","TECNICO DOCENTE",35,83101,1,7,26,"T03820",0,2562,2,null,null,null,52331,0]
[null,"GUANAJUATO","11EBS0027E",100,"PEEM590530399","PEEM590530HDFRSN06","MANUEL ANGEL PEREZ ESCAMILLA","TECNICO DOCENTE",35,83101,1,7,29,"T03820",0,3292,2,null,null,null,56462,0]
[null,"GUANAJUATO","11EBS0027E",100,"PELL620125LZ0","PELL620125MVZRLR03","MARIA DE LOURDES PEREZ LLANOS","TECNICO DOCENTE",35,83101,1,7,15,"T03820",0,1096,2,null,null,null,54680,0]
[null,"GUANAJUATO","11EBS0027E",100,"POLH650106FW2","POLH650106HDFZPG03","HUGO POZADA LOPEZ","PROFESIONAL DICTAMINADOR DE SERVICIOS ESPECIALIZADOS",35,83101,1,7,19,"CF21865",0,7,2,null,null,null,59306,0]
[null,"GUANAJUATO","11EBS0027E",100,"QULC671003EH8","QULC671003MDFRPL03","CLAUDIA REYNA QUIROZ LOPEZ","TECNICO DOCENTE",35,83101,1,7,16,"T03820",0,2177,2,null,null,null,54964,0]
[null,"GUANAJUATO","11EBS0027E",100,"QULJ710417B39","QULJ710417HDFRPN08","JUAN BERNARDO QUIROZ LOPEZ","TECNICO DOCENTE",35,83101,1,7,42,"T03820",0,1530,2,null,null,null,53616,0]
[null,"GUANAJUATO","11EBS0027E",100,"RAAG660220BC0","RAAG660220MGTMVD07","MA. GUADALUPE RUTH RAMOS AVILA","TECNICO DOCENTE",35,83101,1,7,35,"T03820",0,327,2,null,null,null,57291,0]
[null,"GUANAJUATO","11EBS0027E",100,"RABA570323E11","RABA570323MDFVSN07","ANA MARIA RAVELO BUSTAMANTE","TECNICO DOCENTE",35,83101,1,7,16,"T03820",0,1638,2,null,null,null,54060,0]
[null,"GUANAJUATO","11EBS0027E",100,"RACR700730AH9","RACR700730MGTZNB06","REBECA RAZO CANO","TECNICO DOCENTE",35,83101,1,7,20,"T03820",0,2702,2,null,null,null,53060,0]
[null,"GUANAJUATO","11EBS0027E",100,"RAJC810331LAA","RAJC810331MGTMRL02","CLAUDIA JACQUELINE RAMIREZ JARAMILLO","TECNICO MEDIO",35,83101,1,7,13,"T03803",0,10,2,null,null,null,47003,0]
[null,"GUANAJUATO","11EBS0027E",100,"RALE870501NL5","RALE870501MGTMYL02","MARIA ELENA RAMOS LOYOLA","TECNICO DOCENTE",35,83101,1,7,30,"T03820",0,118,2,null,null,null,46033,0]
[null,"GUANAJUATO","11EBS0027E",100,"RAMD681211IP3","RAMD681211HMCMRN05","DANIEL RAMIREZ MARTINEZ","TECNICO DOCENTE",35,83101,1,7,18,"T03820",0,1567,2,null,null,null,56353,0]
[null,"GUANAJUATO","11EBS0027E",100,"RAML6801057F2","RAML680105MMNMCN00","LINDA RAMIREZ MACEDO","TECNICO DOCENTE",35,83101,1,7,23,"T03820",0,468,2,null,null,null,51842,0]
[null,"GUANAJUATO","11EBS0027E",100,"RAOM680518SX1","RAOM680518MMNNCR06","MARIBEL RANGEL OCHOA","JEFE DE OFICINA",35,83101,1,9,50,"A01807",0,174,2,null,null,null,49072,0]
[null,"GUANAJUATO","11EBS0027E",100,"RARC7011229A3","RARC701122MGTNDR00","MA. CARLOTA PATRICIA RANGEL RODRIGUEZ","TECNICO DOCENTE",35,83101,1,7,14,"T03820",0,1926,2,null,null,null,54938,0]
[null,"GUANAJUATO","11EBS0027E",100,"RARC7301176A2","RARC730117MGTMVR07","MA. CARINA ALEJANDRA RAMIREZ RIVAS","TECNICO DOCENTE",35,83101,1,7,14,"T03820",0,2815,2,null,null,null,51466,0]
[null,"GUANAJUATO","11EBS0027E",100,"RATM581224UF9","RATM581224HGTMRN03","JOSE MANUEL RAMOS TORRES","TECNICO DOCENTE",35,83101,1,7,16,"T03820",0,972,2,null,null,null,50986,0]
[null,"GUANAJUATO","11EBS0027E",100,"RATR611023E56","RATR611023MGTMRS03","ROSA MAGDALENA RAMIREZ TRONCOSO","TECNICO DOCENTE",35,83101,1,7,22,"T03820",0,66,2,null,null,null,58637,0]
[null,"GUANAJUATO","11EBS0027E",100,"REGJ781111QG6","REGJ781111HGTYRN09","JUAN MANUEL REYES GUERRERO","COORDINADOR DE ZONA",40,83101,1,7,13,"CF36014",0,82,5,null,null,null,43411,0]
[null,"GUANAJUATO","11EBS0027E",100,"REPC540808QI9","REPC540808MGTNRN06","MARIA CONCEPCION RENTERIA PEREZ","TECNICO DOCENTE",35,83101,1,3,7,"T03820",0,1339,2,null,null,null,61295,0]
[null,"GUANAJUATO","11EBS0027E",100,"RERM7802175Q8","RERM780217MGTYJR00","MARIANA REYES ROJAS","JEFE DE DEPARTAMENTO",40,83101,1,5,12,"CF01059",0,52,5,null,null,null,96400,0]
[null,"GUANAJUATO","11EBS0027E",100,"RICR7705149U3","RICR770514HGTVRB05","ROBERTO CARLOS RIVERA CORONILLA","TECNICO DOCENTE",35,83101,1,7,18,"T03820",0,2934,2,null,null,null,55798,0]
[null,"GUANAJUATO","11EBS0027E",100,"RIHM750221AD5","RIHM750221HGTSRG01","MIGUEL DAMICIO RIOS HERNANDEZ","TECNICO DOCENTE",35,83101,1,7,18,"T03820",0,2174,2,null,null,null,53898,0]
[null,"GUANAJUATO","11EBS0027E",100,"RIRJ650926ED3","RIRJ650926HGTCMX07","J.JESUS RICO RAMIREZ","SECRETARIA C",35,83101,1,9,51,"A03804",0,3291,2,null,null,null,45535,0]
[null,"GUANAJUATO","11EBS0027E",100,"RIRS751216TU4","RIRS751216MDFSMN07","SONIA RIOS RAMOS","TECNICO DOCENTE",35,83101,1,7,35,"T03820",0,2558,2,null,null,null,54205,0]
[null,"GUANAJUATO","11EBS0027E",100,"ROBA860619I59","RXBA860619MDFDRR07","ARIANA RODRIGUEZ BRITO","JEFE DE DEPARTAMENTO",40,83101,1,5,12,"CF01059",0,241,5,null,null,null,98228,0]
[null,"GUANAJUATO","11EBS0027E",100,"ROBC900904U49","ROBC900904MDFCZT03","CITLALLIN MARGARITA ROCHA BAEZA","COORD. DE SERVICIOS ESP.",35,83101,1,1,3,"CF33849",0,296,2,null,null,null,47730,0]
[null,"GUANAJUATO","11EBS0027E",100,"ROCR541120D22","ROCR541120HGTSVC07","RICARDO FEDERICO ROSALES COVARRUBIAS","TECNICO DOCENTE",35,83101,1,7,38,"T03820",0,2665,2,null,null,null,54130,0]
[null,"GUANAJUATO","11EBS0027E",100,"ROJJ610420EGA","ROJC610420HGTCMR06","J. CARMEN ROCHA JIMENEZ","TECNICO DOCENTE",35,83101,1,7,35,"T03820",0,472,2,null,null,null,55296,0]
[null,"GUANAJUATO","11EBS0027E",100,"ROJJ671130GY1","ROJJ671130HGTDMS06","JOSE RODRIGUEZ JIMENEZ","TECNICO DOCENTE",35,83101,1,7,17,"T03820",0,1322,2,null,null,null,55265,0]
[null,"GUANAJUATO","11EBS0027E",100,"ROLA760606566","ROLA760606HGTJPN03","JOSE ANTONIO ROJAS LOPEZ","TECNICO DOCENTE",35,83101,1,7,19,"T03820",0,1162,2,null,null,null,53746,0]
[null,"GUANAJUATO","11EBS0027E",100,"ROPE881009G46","ROPE881009MGTDRV05","EVELIN GUADALUPE RODRIGUEZ PEREZ","SECRETARIA C",35,83101,1,2,4,"A03804",0,112,2,null,null,null,37647,0]
[null,"GUANAJUATO","11EBS0027E",100,"ROPP680417AU8","ROPP680417MGTDRT05","PATRICIA RODRIGUEZ PEREZ","TECNICO DOCENTE",35,83101,1,7,23,"T03820",0,2715,2,null,null,null,53894,0]
[null,"GUANAJUATO","11EBS0027E",100,"RORC700828A28","RORC700828MGTMML06","CLAUDIA IMELDA ROMERO RAMOS","TECNICO DOCENTE",35,83101,1,7,15,"T03820",0,459,2,null,null,null,58282,0]
[null,"GUANAJUATO","11EBS0027E",100,"ROSJ600516BL3","ROSJ600516MGTBNN05","JUANA ROBLES SANTANA","TECNICO DOCENTE",35,83101,1,7,28,"T03820",0,1952,2,null,null,null,53872,0]
[null,"GUANAJUATO","11EBS0027E",100,"ROSR7704116C6","ROSR770411MGTDLS01","MARIA DEL ROSARIO RODRIGUEZ SALGADO","TECNICO DOCENTE",35,83101,1,7,13,"T03820",0,1104,2,null,null,null,54016,0]
[null,"GUANAJUATO","11EBS0027E",100,"ROVR580704ND4","ROVR580704HVZXLB09","ROBERTO ROA VELAZQUEZ","COORDINADOR DE ZONA",40,83101,1,7,17,"CF36014",0,472,5,null,null,null,106958,0]
[null,"GUANAJUATO","11EBS0027E",100,"RUCE791216KR2","RUCE791216HGTLRD00","EDUARDO RUELAS CORNEJO","COORDINADOR DE ZONA",40,83101,1,7,26,"CF36014",0,48,5,null,null,null,106280,0]
[null,"GUANAJUATO","11EBS0027E",100,"RULS870916391","RULS870916HGTZPR06","SERGIO ISMAEL RUIZ LOPEZ","COORDINADOR REGIONAL",40,83101,1,1,1,"CF36014",0,21,5,null,null,null,155536,0]
[null,"GUANAJUATO","11EBS0027E",100,"SAAL700325CX2","SAAL700325MGTNGT00","LETICIA SANDOVAL AGUAYO","TECNICO DOCENTE",35,83101,1,7,38,"T03820",0,1614,2,null,null,null,53614,0]
[null,"GUANAJUATO","11EBS0027E",100,"SAAP650303N74","SAAP650303MGTNLT02","PATRICIA SANCHEZ ALVARADO","ESPECIALISTA EN PROYECTOS TECNICOS",35,83101,1,7,27,"T03810",0,286,2,null,null,null,45193,0]
[null,"GUANAJUATO","11EBS0027E",100,"SACA4609287F8","SACA460928MGTNRL03","MA. ALEJANDRINA CARMEN SANCHEZ CARRASCO","ESPECIALISTA EN PROYECTOS TECNICOS",35,83101,1,7,16,"T03810",0,214,2,null,null,null,48042,0]
[null,"GUANAJUATO","11EBS0027E",100,"SACM760716KV0","SACM760716MJCNSN08","MONICA DEL CARMEN SANDOVAL CASTELLON","ADMINISTRATIVO ESPECIALIZADO",35,83101,1,7,13,"A01803",0,27,2,null,null,null,45907,0]
[null,"GUANAJUATO","11EBS0027E",100,"SAME750520NR8","SAME750520MGTNJR05","ERIKA SANCHEZ MEJIA","TECNICO DOCENTE",35,83101,1,7,41,"T03820",0,192,2,null,null,null,48942,0]
[null,"GUANAJUATO","11EBS0027E",100,"SAMM750910419","SAMM750910MGTCRR00","MERCEDES ELENA SAUCEDO MORENO","TECNICO DOCENTE",35,83101,1,7,24,"T03820",0,54,2,null,null,null,54126,0]
[null,"GUANAJUATO","11EBS0027E",100,"SEER810904RN6","SEER810904HGTRSF07","RAFAEL SERRATO ESPINOSA","ESPECIALISTA EN PROYECTOS TECNICOS",35,83101,1,7,25,"T03810",0,220,2,null,null,null,43843,0]
[null,"GUANAJUATO","11EBS0027E",100,"SOSM750119S26","SOSM750119MGTRTR02","MARTHA SORIA SOTO","ANALISTA ADMINISTRATIVO",35,83101,1,7,19,"A01806",0,3701,2,null,null,null,45538,0]
[null,"GUANAJUATO","11EBS0027E",100,"TAML5306213J5","TAML530621HGTPRS02","JOSE LUIS TAPIA MARTINEZ","SECRETARIA C",35,83101,1,9,51,"A03804",0,315,2,null,null,null,44416,0]
[null,"GUANAJUATO","11EBS0027E",100,"TAMP860314464","TAMP860314HGTFZL09","JOSE PAUL TAFOYA MEZA","COORDINADOR DE ZONA",40,83101,1,7,20,"CF36014",0,310,5,null,null,null,106280,0]
[null,"GUANAJUATO","11EBS0027E",100,"TEMM661201D47","TEMG661201MGTRRD06","MA. GUADALUPE TREJO MARTINEZ","JEFE DE OFICINA",35,83101,1,3,7,"A01807",0,1521,2,null,null,null,50176,0]
[null,"GUANAJUATO","11EBS0027E",100,"TEMY831012PC7","TEMY831012MGTRDD05","YADIRA ELISA TERAN MEDINA","OFICIAL DE SERVICIOS Y MANTEN.",35,83101,1,7,16,"S01803",0,150,2,null,null,null,46589,0]
[null,"GUANAJUATO","11EBS0027E",100,"TOAN630405S63","TOXA630405HGTLXN01","JOSE ANTONIO TOLENTINO ","TECNICO DOCENTE",35,83101,1,7,17,"T03820",0,295,2,null,null,null,55488,0]
[null,"GUANAJUATO","11EBS0027E",100,"TOMG850829D80","TOMG850829HGTRRD08","JOSE GUADALUPE DE LA TORRE MARQUEZ","OFICIAL DE SERVICIOS Y MANTEN.",35,83101,1,7,27,"S01803",0,146,2,null,null,null,45334,0]
[null,"GUANAJUATO","11EBS0027E",100,"TONL701209CT8","TONL701209MGTRCR09","LAURA MA GUADALUPE TORRES NACHE","TECNICO DOCENTE",35,83101,1,7,13,"T03820",0,2251,2,null,null,null,57900,0]
[null,"GUANAJUATO","11EBS0027E",100,"TOSH760727J54","TOSH760727HGTRNC04","HECTOR DANIEL TORRES SAENEZ","TECNICO DOCENTE",35,83101,1,7,27,"T03820",0,119,2,null,null,null,51894,0]
[null,"GUANAJUATO","11EBS0027E",100,"UORV800303CD1","UORV800303MGTLNR08","VERONICA ULLOA RANGEL","SECRETARIA C",35,83101,1,1,3,"A03804",0,91,2,null,null,null,41955,0]
[null,"GUANAJUATO","11EBS0027E",100,"VAGL591217DU7","VAGL591217MGTRRL06","LILIA VARGAS GARCIDUEÑAS","TECNICO DOCENTE",35,83101,1,7,38,"T03820",0,69,2,null,null,null,57401,0]
[null,"GUANAJUATO","11EBS0027E",100,"VALF830903IU4","VALF830903HGTLNR07","FRANCISCO JAVIER VALDEZ LANDIN","TECNICO DOCENTE",35,83101,1,7,23,"T03820",0,766,2,null,null,null,44267,0]
[null,"GUANAJUATO","11EBS0027E",100,"VANR620916TF0","VANR620916HGTRGG03","ROGELIO VARGAS NEGRETE","TECNICO DOCENTE",35,83101,1,7,36,"T03820",0,6162,2,null,null,null,55582,0]
[null,"GUANAJUATO","11EBS0027E",100,"VAPR690730J94","VAPR690730MGTZNS03","ROSA LAURA VAZQUEZ PONCE","JEFE DE OFICINA",35,83101,1,7,19,"A01807",0,261,2,null,null,null,52769,0]
[null,"GUANAJUATO","11EBS0027E",100,"VAQE630516EZ8","VAQE630516MGTRVS07","ESTHELA VARGAS QUEVEDO","JEFE DE OFICINA",35,83101,1,7,22,"A01807",0,2231,2,null,null,null,51510,0]
[null,"GUANAJUATO","11EBS0027E",100,"VAQG581212JV2","VAQG581212HGTLJD08","J. GUADALUPE VALENCIA QUIJAS","TECNICO DOCENTE",35,83101,1,7,41,"T03820",0,511,2,null,null,null,53799,0]
[null,"GUANAJUATO","11EBS0027E",100,"VARA570811AR0","VARA570811MVZLDN06","ANA YOLANDA VALERIO RODRIGUEZ","TECNICO DOCENTE",35,83101,1,7,13,"T03820",0,2812,2,null,null,null,54117,0]
[null,"GUANAJUATO","11EBS0027E",100,"VARA71012288A","VARA710122MGTRMN01","MARIA DE LOS ANGELES VARGAS RAMIREZ","TECNICO DOCENTE",35,83101,1,7,17,"T03820",0,1655,2,null,null,null,60012,0]
[null,"GUANAJUATO","11EBS0027E",100,"VARL750211VB2","VARL750211MGTRMR07","MARIA LOURDES VARGAS RAMIREZ","TECNICO MEDIO",35,83101,1,7,17,"T03803",0,344,2,null,null,null,46625,0]
[null,"GUANAJUATO","11EBS0027E",100,"VATR761025BJA","VATR761025MDFRRS05","ROSA MARIA VARGAS TRUJILLO","TECNICO SUPERIOR",35,83101,1,8,43,"T03823",0,941,2,null,null,null,58321,0]
[null,"GUANAJUATO","11EBS0027E",100,"VEPE671201NI6","VEPE671201MGTGRG04","MARIA EUGENIA VEGA PAREDES","TECNICO DOCENTE",35,83101,1,7,16,"T03820",0,1632,2,null,null,null,53340,0]
[null,"GUANAJUATO","11EBS0027E",100,"VIGO710314HSA","VIGO710314HGTLNS05","OSCAR JACOBO VILLICAÑA GONZALEZ","TECNICO DOCENTE",35,83101,1,7,41,"T03820",0,1185,2,null,null,null,49842,0]
[null,"GUANAJUATO","11EBS0027E",100,"VILR670220CZ3","VILR670220MGTLNM04","RAMONA VILLANUEVA LUNA","TECNICO DOCENTE",35,83101,1,7,36,"T03820",0,2191,2,null,null,null,59370,0]
[null,"GUANAJUATO","11EBS0027E",100,"VIMG771213D20","VIMG771213MGTLNB08","GABRIELA VILLANUEVA MENDOZA","JEFE DE OFICINA",35,83101,1,9,50,"A01807",0,6161,2,null,null,null,47262,0]
[null,"GUANAJUATO","11EBS0027E",100,"VINF7009219V8","VINF700921HGTLXR06","FRANCISCO ALFONSO VILCHES NUÑEZ","TECNICO DOCENTE",35,83101,1,7,27,"T03820",0,705,2,null,null,null,56506,0]
[null,"GUANAJUATO","11EBS0027E",100,"VIRM731126CL3","VIRM731126MGTLMN06","MARIA MONICA VILLANUEVA RAMIREZ","ANALISTA ADMINISTRATIVO",35,83101,1,2,5,"A01806",0,51,2,null,null,null,47022,0]
[null,"GUANAJUATO","11EBS0027E",100,"YEPV780203IU0","YEPV780203MGTBVR00","VERONICA ADRIANA YEBRA PAVON","TECNICO DOCENTE",35,83101,1,7,21,"T03820",0,1985,2,null,null,null,48084,0]
[null,"GUANAJUATO","11EBS0027E",100,"ZACR521017I51","ZACR521017HGTMRG01","ROGELIO ARTURO ZAMARRIPA CRUZ","TECNICO DOCENTE",35,83101,1,7,15,"T03820",0,77,2,null,null,null,57974,0]
[null,"GUANAJUATO","11EBS0027E",100,"ZAGB700228KX3","ZAGB700228MGTVMT03","BEATRIZ ZAVALA GOMEZ","TECNICO DOCENTE",35,83101,1,7,25,"T03820",0,180,2,null,null,null,53960,0]
[null,"GUANAJUATO","11EBS0027E",100,"ZAGJ830623IG5","ZAGJ830623MGTVLN06","JUANA ZAVALA GALLEGOS","ESPECIALISTA EN PROYECTOS TECNICOS",35,83101,1,9,52,"T03810",0,144,2,null,null,null,40813,0]
[null,"GUANAJUATO","11EBS0027E",100,"ZAMH6907077M4","ZAMH690707MGTVRR00","MARIA HERLINDA ZAVALA MARTINEZ","TECNICO DOCENTE",35,83101,1,7,13,"T03820",0,923,2,null,null,null,54563,0]
[null,"Total Personas : ",null,null,null,null,null,null,null,null,null,null,null,"Total Plazas : ",null,270,null,null,"Total Pto. Federal",null,{"$f":"SUBTOTAL(109,Tabla12[Percepciones pagadas en el Periodo de Comisión con Presupuesto Federal*])","v":15022280}]
[]
[null,null,null,null,null,null,null,null,null,null,null,null,null,null,null,null,null,null,"Total Ppto. Otras Fuentes:",null,null,{"$f":"SUM(V16:V287)","v":0}]
[]
[null,"*Total de Percepciones reportadas por la Entidad Federativa como pagadas al trabajador durante la comisión."]
[null,"Fuente : Información proporcionada por las Entidades Federativas"]

{"sheet":"II D) 2","index":6,"n_rows":209,"n_cols":19,"rows_kept":209,"cut":false,"hidden":false,"merged":[[8,1,8,9],[11,0,12,0],[11,1,12,1],[11,5,12,5],[11,2,12,2],[11,3,12,3],[11,4,12,4],[11,16,12,16],[11,15,12,15],[11,17,12,17],[11,18,12,18],[11,6,11,12],[11,13,12,13],[11,14,12,14]]}
[]
[]
[]
[]
[]
[]
[]
[null,"Formato: Movimientos de Plazas"]
[null,{"$f":"IF('Caratula Resumen'!D22=\"Elige el Periodo…\",\"\",'Caratula Resumen'!D22)","v":"Fondo de Aportaciones para la Educación Tecnológica y de Adultos/Instituto Nacional para la Educación de los Adultos (FAETA/INEA)"},null,null,null,null,null,null,null,null,null,null,null,null,null,null,null,{"$f":"IF('Caratula Resumen'!D23=\"Elige el Periodo…\",\"\",'Caratula Resumen'!D23)","v":"4to. Trimestre"}]
[]
[]
[null,"Entidad Federativa","RFC","CURP","Nombre","Origen Presupuestal\n de la plazas","Clave Presupuestal",null,null,null,null,null,null,"Clave de nivel de puesto","Clave de nivel de sueldo","Zona Económica","Tipo de movimiento","Quincena Inicial","Quincena Final"]
[null,null,null,null,null,null,"Partida Presupuestal","Código de Pago","Clave de Unidad","Clave de Sub Unidad","Clave de Categoría","Horas Semana Mes ","Número de Plaza"]
[]
[null,"Entidad Federativa","RFC","CURP","Nombbre","Origen Presupuestal\n de la plazas","Partida Presupuestal","Código de Pago","Clave de Unidad","Clave de Sub Unidad","Clave de Categoría","Horas semana mes","Número de plaza","Clave de nivel de puesto","Clave de nivel de sueldo","Zona Económica","Tipo de movimiento","Quincena Inicial","Quincena Final"]
[null,"GUANAJUATO","EALA490401P51","EALA490401HGTSGL06","ALFREDO ESPAÑA LAGUNAS",1,"831011726T0382000.0000531",83101,7,26,"T03820",0,531,82,7,"B",3,201502,201502]
[null,"GUANAJUATO","LURF6001292T1","LURF600129HGTNMR01","FRANCISCO JAVIER LUNA RAMIREZ",1,"831011726T0382000.000200",83101,7,26,"T03820",0,200,82,7,"B",3,201502,201502]
[null,"GUANAJUATO","OOPM650124AG1","OOPM650124HGTRRG05","MIGUEL OROZCO PEREZ",1,"831011716T0382000.000413",83101,7,16,"T03820",0,413,82,7,"B",3,201502,201502]
[null,"GUANAJUATO","GOGA680110DL7","GOGA680110MGTNYN00","ANA BERTHA GONZALEZ GAYTAN",1,"831011725T0382000.000757",83101,7,25,"T03820",0,757,82,7,"B",3,201502,201502]
[null,"GUANAJUATO","LOSS570105T33","LOSS570105MTSZLS00","SUSANA ENRIQUETA LOZANO SALCEDO",1,"831011952A0180600.0000116",83101,9,52,"A01806",0,116,70,3,"B",3,201502,201502]
[null,"GUANAJUATO","RATM581224UF9","RATM581224HGTMRN03","JOSE MANUEL RAMOS TORRES",1,"831011716T0382000.000972",83101,7,16,"T03820",0,972,82,7,"B",3,201502,201502]
[null,"GUANAJUATO","ROSJ600516BL3","ROSJ600516MGTBNN05","JUANA ROBLES SANTANA",1,"831011728T0382000.0001952",83101,7,28,"T03820",0,1952,82,7,"B",3,201502,201502]
[null,"GUANAJUATO","GOSL721116725","GOSL721116HGTRSS06","LUIS JAVIER GORDILLO SOSA",1,"831011728T0382000.003037",83101,7,28,"T03820",0,3037,82,7,"B",3,201502,201502]
[null,"GUANAJUATO","RIHM750221AD5","RIHM750221HGTSRG01","MIGUEL DAMICIO RIOS HERNANDEZ",1,"831011718T0382000.002174",83101,7,18,"T03820",0,2174,82,7,"B",3,201502,201502]
[null,"GUANAJUATO","BAAL701128HC5","BAAL701128HTSRLN01","LEANDRO BARRON ALONSO",1,"831011718T0382000.002887",83101,7,18,"T03820",0,2887,82,7,"B",3,201502,201502]
[null,"GUANAJUATO","SOSM750119S26","SOSM750119MGTRTR02","MARTHA SORIA SOTO",1,"831011719A0180600.0003701",83101,7,19,"A01806",0,3701,70,3,"B",3,201502,201502]
[null,"GUANAJUATO","CAGR650930FB6","CAGR650930HGTLYB04","RUBEN CALDERON GAYTAN",1,"831011725T0382000.001269",83101,7,25,"T03820",0,1269,82,7,"B",3,201502,201502]
[null,"GUANAJUATO","QULJ710417B39","QULJ710417HDFRPN08","JUAN BERNARDO QUIROZ LOPEZ",1,"831011742T0382000.001530",83101,7,42,"T03820",0,1530,82,7,"B",3,201502,201502]
[null,"GUANAJUATO","AELM6906275A6","AELR690627MGTRPS15","MA ROSARIO ARREGUIN LOPEZ",1,"831011725T0382000.002195",83101,7,25,"T03820",0,2195,82,7,"B",3,201502,201502]
[null,"GUANAJUATO","RABA570323E11","RABA570323MDFVSN07","ANA MARIA RAVELO BUSTAMANTE",1,"831011716T0382000.001638",83101,7,16,"T03820",0,1638,82,7,"B",3,201502,201502]
[null,"GUANAJUATO","AUTC7502082I3","AUTC750208MGTGRN15","MA. CONSUELO AGUILAR TIRADO",1,"831011716T0382000.001623",83101,7,16,"T03820",0,1623,82,7,"B",3,201502,201502]
[null,"GUANAJUATO","FOGE730721216","FOGE730721HGTLRS04","ESTEBAN FLORES GARCIA",1,"831011725T0382000.000149",83101,7,25,"T03820",0,149,82,7,"B",3,201502,201502]
[null,"GUANAJUATO","CATE6508044X6","CATE650804MGTRRS04","ESPERANZA CARRILLO TORRES",1,"831011716T0382000.000622",83101,7,16,"T03820",0,622,82,7,"B",3,201502,201502]
[null,"GUANAJUATO","CUPM810513D93","CUPM810513HGTRRR00","MARTIN ANTONIO CRUZ PEREZ",1,"831011725T0382000.0000942",83101,7,25,"T03820",0,942,82,7,"B",3,201502,201502]
[null,"GUANAJUATO","VEPE671201NI6","VEPE671201MGTGRG04","MARIA EUGENIA VEGA PAREDES",1,"831011716T0382000.0001632",83101,7,16,"T03820",0,1632,82,7,"B",3,201502,201502]
[null,"GUANAJUATO","AAOA620408HW1","AAOA620408HGTRLL09","ALBERTO ARANA OLIVARES",1,"831011728T0382000.001202",83101,7,28,"T03820",0,1202,82,7,"B",3,201502,201502]
[null,"GUANAJUATO","GOAS751103PH7","GOAS751103MGTNRL01","SILVIA SANTOS GONZALEZ ARANDA",1,"831011713T0382000.001656",83101,7,13,"T03820",0,1656,82,7,"B",3,201502,201502]
[null,"GUANAJUATO","GOAS751103PH7","GOAS751103MGTNRL01","SILVIA SANTOS GONZALEZ ARANDA",1,"831011713T0382000.001656",83101,7,13,"T03820",0,1656,82,7,"B",3,201502,201502]
[null,"GUANAJUATO","FOMJ7811187W8","FOMJ781118HGTLDN07","JUAN PABLO FLORES MEDINA",1,"831011728T0382000.000128",83101,7,28,"T03820",0,128,82,7,"B",3,201502,201502]
[null,"GUANAJUATO","RACS650614RH2","RACS650614MZSMLS05","SUSANA RAMIREZ CALDERON",1,"831011713CF3601400.000349",83101,7,13,"CF36014",0,349,92,"OA1","A",3,201502,201502]
[null,"GUANAJUATO","LEGA720906CE8","LEGA720906MCLLNR04","ARIADNE LEAL GONZALEZ",1,"831011727CF3601400.0003701",83101,7,27,"CF36014",0,3701,92,"OA1","B",3,201502,201502]
[null,"GUANAJUATO","RUCE791216KR2","RUCE791216HGTLRD00","EDUARDO RUELAS CORNEJO",1,"831011726CF3601400.0003701",83101,7,26,"CF36014",0,3701,92,"OA1","A",3,201502,201502]
[null,"GUANAJUATO","MURM820910149","MURM820910HGTRDR08","MAURICIO ALEJANDRO MURILLO RODRIGUEZ",1,"831011721CF3601400.0002222",83101,7,21,"CF36014",0,2222,92,"OA1","A",2,201502,201502]
[null,"GUANAJUATO","ROMG6809143N6","ROMG680914MGTJLR05","GEORGINA ROJAS MELGOZA",1,"831011728T0382000.000176",83101,7,28,"T03820",0,176,82,7,"B",3,201502,201502]
[null,"GUANAJUATO","PAPM8010185P8","PAPM801018MGTRNR06","MARIBEL PRADO PANTOJA",1,"831011735T0382000.001735",83101,7,35,"T03820",0,1735,82,7,"B",3,201502,201502]
[null,"GUANAJUATO","CUME820306JF6","CUME820306HPLRRS07","ESTEBAN DE LA CRUZ MORALES",1,"831011718A0380400.0003701",83101,7,18,"A03804",0,3701,43,2,"B",3,201502,201502]
[null,"GUANAJUATO","LUMR751129U75","LUMR751129HGTGTC02","RICARDO ERNESTO LUGO MATA",1,"831011730T0382000.000109",83101,7,30,"T03820",0,109,82,7,"B",3,201502,201502]
[null,"GUANAJUATO","RALE870501NL5","RALE870501MGTMYL02","MARIA ELENA RAMOS LOYOLA",1,"831011730T0382000.0000118",83101,7,30,"T03820",0,118,82,7,"B",3,201502,201502]
[null,"GUANAJUATO","AECI701001637","AECI701001MGTRNM05","IMELDA AREVALO CONSTANTINO",1,"831011713CF3601400.0002222",83101,7,13,"CF36014",0,2222,92,"OA1","A",1,201502,201502]
[null,"GUANAJUATO","CAGY820417182","CAGY820417MGTRTJ03","YAJAHIRA CARDENAS GUTIERREZ",1,"831011724T0380300.0000032",83101,7,24,"T03803",0,32,47,2,"B",1,201502,201502]
[null,"GUANAJUATO","ROPE881009G46","ROPE881009MGTDRV05","EVELIN GUADALUPE RODRIGUEZ PEREZ",1,"83101124A0380400.0000112",83101,2,4,"A03804",0,112,43,2,"B",1,201502,201502]
[null,"GUANAJUATO","CAOD910826S90","CAOD910826MSPNRL03","DULCE VIRIDIANA CANO ORTA",1,"831011729T0381000.0000201",83101,7,29,"T03810",0,201,39,2,"B",1,201502,201502]
[null,"GUANAJUATO","GARR860218GD7","GARR860218HGTRJL03","JOSE RAUL GRANADOS ROJAS",1,"831011951A0380400.0000602",83101,9,51,"A03804",0,602,43,2,"B",1,201502,201502]
[null,"GUANAJUATO","HEMR630129LH6","HEMR630129MGTRRY04","MA. DEL RAYO HERNANDEZ MORALES",1,"83101137T0381000.0004512",83101,3,7,"T03810",0,4512,39,2,"B",3,201503,201503]
[null,"GUANAJUATO","MUFS691006FC3","MUFS691006HGTRLR09","SERGIO ALEJANDRO MURILLO FLORES",1,"831011844T0381000.000151",83101,8,44,"T03810",0,151,39,2,"B",3,201503,201503]
[null,"GUANAJUATO","HEAE670513TV7","HEAE670513HGTRGD08","EDUARDO HERNANDEZ AGUADO",1,"83101137A0180600.000552",83101,3,7,"A01806",0,552,70,3,"B",3,201503,201503]
[null,"GUANAJUATO","HECF8509083P5","HECF850908MGTRLT09","FATIMA ADRIANA HERNANDEZ CALDERON",1,"831011722A0180300.000041",83101,7,22,"A01803",0,41,29,2,"B",2,201503,201503]
[null,"GUANAJUATO","PEAJ870606KY9","PEAJ870606HGTSRS04","JOSUE DAVIDPESCADOR ARREDONDO",1,"831011717T0382000.000617",83101,7,17,"T03820",0,617,82,7,"B",2,201503,201503]
[null,"GUANAJUATO","AILP690120TW9","AILP690120MSPRNT09","PATRICIA DE JESUS ARCIGA LEON",1,"831011721A0180700.000169",83101,7,21,"A01807",0,169,81,5,"B",1,201504,201504]
[null,"GUANAJUATO","HEMA700108F11","HEMA700108HVZRRR01","ARTURO HERNANDEZ MARTINEZ",1,"831011742T0382000.001686",83101,7,42,"T03820",0,1686,82,7,"B",2,201504,201504]
[null,"GUANAJUATO","VINM871130FV5","VINM871130MGTLVN04","MARIA MONTSERRAT VILLAFAÑA NAVA",1,"831011950CF3384900.000122",83101,9,50,"CF33849",0,122,88,8,"B",3,201504,201504]
[null,"GUANAJUATO","SAMM8709097V3","SAMM870909HGTNNR04","MARIO OSCAR SANCHEZ MANDUJANO",1,"831011951T0381000.000219",83101,9,51,"T03810",0,219,39,2,"B",3,201504,201504]
[null,"GUANAJUATO","POML751010N61","POML751010MMCNRZ08","LUZ ALICIA PONCE DE LEON MIRELES",1,"831011512CF3384900.0002701",83101,5,12,"CF33849",0,2701,88,8,"B",3,201504,201504]
[null,"GUANAJUATO","GARR860218GD7","GARR860218HGTRJL03","JOSE RAUL GRANADOS ROJAS",1,"831011951A0380400.0000602",83101,9,51,"A03804",0,602,43,2,"B",3,201504,201504]
[null,"GUANAJUATO","CAPS760203A30","CAPS760203HGTRXB01","SEBASTIAN CARRANCO PIÑON",1,"831011729T0382000.002462",83101,7,29,"T03820",0,2462,82,7,"B",2,201505,201505]
[null,"GUANAJUATO","CALM860815G43","CALM860815MJCHNY02","MAYRA CAROLINA CHAVEZ DE LEON",1,"831011723A0380400.000171",83101,7,23,"A03804",0,171,43,2,"B",3,201506,201506]
[null,"GUANAJUATO","HERL8008128A5","HERL800812MGTRSR15","LAURA ELENA HERRERA RIOS",1,"831011720T0382000.0004411",83101,7,20,"T03820",0,4411,82,7,"B",2,201507,201507]
[null,"GUANAJUATO","MURM820910149","MURM820910HGTRDR08","MAURICIO ALEJANDRO MURILLO RODRIGUEZ",1,"831011721CF3601400.0002222",83101,7,21,"CF36014",0,2222,92,"OA1","A",1,201507,201507]
[null,"GUANAJUATO","MURM820910149","MURM820910HGTRDR08","MAURICIO ALEJANDRO MURILLO RODRIGUEZ",1,"831011721CF3601400.0002222",83101,7,21,"CF36014",0,2222,92,"OA1","A",3,201507,201507]
[null,"GUANAJUATO","AECI701001637","AECI701001MGTRNM05","IMELDA AREVALO CONSTANTINO",1,"831011713CF3601400.0002222",83101,7,13,"CF36014",0,2222,92,"OA1","A",2,201507,201507]
[null,"GUANAJUATO","LUVF490323PD9","LUVF490323HHGCRD03","FIDEL DE LUCIO VARGAS",1,"83101137CF0105900.000021",83101,3,7,"CF01059",0,21,93,"OA1","A",2,201508,201508]
[null,"GUANAJUATO","REMI5703035I8","REMI590303HDFYNG07","JOSE IGNACIO REYES MANCILLA",1,"83101124CF0105900.000133",83101,2,4,"CF01059",0,133,93,"OA1","A",2,201508,201508]
[null,"GUANAJUATO","ROHC730108AV9","ROHC730108MGTJRL01","CLAUDIA PATRICIA ROJANO HERNANDEZ",1,"831011848CF2186500.00003",83101,8,48,"CF21865",0,3,1,"QB","B",2,201508,201508]
[null,"GUANAJUATO","GOMG670522TLA","GOMG670522MGTNRB09","MARIA GABRIELA GONZALEZ MARTINEZ",1,"83101112CF2186500.00002",83101,1,2,"CF21865",0,2,1,"QB","B",2,201508,201508]
[null,"GUANAJUATO","ROVC730623LQA","ROVC730623MGTSLC06","CECILIA FELIPA ROSALES VELAZQUEZ",1,"831011949CF0105900.0000052",83101,9,49,"CF01059",0,52,93,"OA1","A",2,201508,201508]
[null,"GUANAJUATO","NIAC730506CK6","NIAC730506MGTTGL09","CLAUDIA JUDITH NIETO AGUILERA",1,"83101125CF2186500.00004",83101,2,5,"CF21865",0,4,1,"QB","B",2,201508,201508]
[null,"GUANAJUATO","SETG700331TM7","SETG700331MGTRRD01","MA. GUADALUPE SERRANO TREJO",1,"83101124CF3384900.000296",83101,2,4,"CF33849",0,296,88,8,"B",2,201508,201508]
[null,"GUANAJUATO","GACN720401359","GACN720401MTCRMR08","NURY GARCIA CAMACHO",1,"831011843CF0105900.000241",83101,8,43,"CF01059",0,241,93,"OA1","A",2,201508,201508]
[null,"GUANAJUATO","HECE710503NQ5","HECE710503HGTRLS02","ESTEBAN HERNANDEZ CUELLAR",1,"831011951CF2186500.00007",83101,9,51,"CF21865",0,7,1,"QB","B",2,201508,201508]
[null,"GUANAJUATO","RULS870916391","RULS870916HGTZPR06","SERGIO ISMAEL RUIZ LOPEZ",1,"83101111CF3601400.000032",83101,1,1,"CF36014",0,32,95,"OA1","A",3,201508,201508]
[null,"GUANAJUATO","NISN8002155D7","NISN800215MGTVNN03","NANCY GABRIELA NIEVES SAENZ",1,"83101137CF2186500.00010",83101,3,7,"CF21865",0,10,1,"QB","B",2,201508,201508]
[null,"GUANAJUATO","JIAR5906097A6","JIAR590609HVZMNB07","ROBERTO JIMENEZ DEL ANGEL",1,"831011512CF1407000.000032",83101,5,12,"CF14070",0,32,97,"MB2","A",2,201508,201508]
[null,"GUANAJUATO","RIMA61053132A","RIMA610531MGTVNL04","ALEJANDRA RIVERA MENDOZA",1,"831011713T0381000.000083",83101,7,13,"T03810",0,83,39,2,"B",2,201509,201509]
[null,"GUANAJUATO","LEGA720906CE8","LEGA720906MCLLNR04","ARIADNE LEAL GONZALEZ",1,"831011727CF3601400.000046",83101,7,27,"CF36014",0,46,92,"OA1","B",2,201509,201509]
[null,"GUANAJUATO","VALF830903IU4","VALF830903HGTLNR07","FRANCISCO JAVIER VALDEZ LANDIN",1,"831011723T0382000.000766",83101,7,23,"T03820",0,766,82,7,"B",2,201510,201510]
[null,"GUANAJUATO","PAPM8010185P8","PAPM801018MGTRNR06","MARIBEL PRADO PANTOJA",1,"831011735T0382000.001735",83101,7,35,"T03820",0,1735,82,7,"B",2,201510,201510]
[null,"GUANAJUATO","FOGJ601017FG2","FOGJ601017HGTLRN01","JUAN MANUEL FLORES GARCIA",1,"831011716CF3601400.000082",83101,7,16,"CF36014",0,82,92,"OA1","A",3,201511,201511]
[null,"GUANAJUATO","MASV810101DZ8","MASV810101MGTRRR01","VERONICA MARTINEZ SARABIA",1,"831011721T0382000.000269",83101,7,21,"T03820",0,269,82,7,"B",3,201511,201511]
[null,"GUANAJUATO","SEER810904RN6","SEER810904HGTRSF07","RAFAEL SERRATO ESPINOZA",1,"831011725T0381000.000220",83101,7,25,"T03810",0,220,39,2,"B",2,201511,201511]
[null,"GUANAJUATO","RACS650614RH2","RACS650614MZSMLS05","SUSANA RAMIREZ CALDERON",1,"831011713CF3601400.000349",83101,7,13,"CF36014",0,349,92,"OA1","A",3,201511,201511]
[null,"GUANAJUATO","RUCE791216KR2","RUCE791216HGTLRD00","EDUARDO RUELAS CORNEJO",1,"831011726CF3601400.000048",83101,7,26,"CF36014",0,48,92,"OA1","A",3,201511,201511]
[null,"GUANAJUATO","EAMS8812032H4","EAMS881203MGTSRN00","SANDRA JUDITH ESTRADA MIRANDA",1,"831011733CF3601400.000044",83101,7,33,"CF36014",0,44,92,"OA1","A",3,201511,201511]
[null,"GUANAJUATO","CUME820306JF6","CUME820306HPLRRS07","ESTEBAN DE LA CRUZ MORALES",1,"831011718A0380400.000143",83101,7,18,"A03804",0,143,43,2,"B",3,201511,201511]
[null,"GUANAJUATO","MAAC750325Q52","MAAC750325MGTLLR02","MA. DEL CARMEN MALDONADO ALMANZA",1,"83101111A0380400.0001522",83101,1,1,"A03804",0,1522,43,2,"B",3,201511,201511]
[null,"GUANAJUATO","GAEG840418L85","GAEG840418HGTLSS02","GUSTAVO ANTONIO GALLEGOS ESPINOZA",1,"831011727CF3601400.000046",83101,7,27,"CF36014",0,46,92,"OA1","B",1,201511,201511]
[null,"GUANAJUATO","CEAE800524DE1","CEAE800524MDFCSL07","ELSA CECEÑA ASCOBERETA",1,"83101124CF3601400.00002",83101,2,4,"CF36014",0,2,92,"OA1","A",1,201511,201511]
[null,"GUANAJUATO","VALF830903IU4","VALF830903HGTLNR07","FRANCISCO JAVIER VALDEZ LANDIN",1,"831011723T0382000.000766",83101,7,23,"T03820",0,766,82,7,"B",1,201512,201512]
[null,"GUANAJUATO","CAOC891124C87","CAOC891124HGTSRR07","CRISTOPHER ISRAEL CASTRO OROZCO",1,"831011724T0382000.000062",83101,7,24,"T03820",0,62,82,7,"B",2,201512,201512]
[null,"GUANAJUATO","OOFL740119GS6","OOFL740119HGTRRS01","LUIS GABRIEL OROPEZA FERRER",1,"831011715T0382000.002880",83101,7,15,"T03820",0,2880,82,7,"B",2,201512,201512]
[null,"GUANAJUATO","RASG830326T84","RASG830326MGTMNB01","GABRIELA SARAI RAMIREZ SANTIAGO",1,"831011724T0382000.0001101",83101,7,24,"T03820",0,1101,82,7,"B",2,201512,201512]
[null,"GUANAJUATO","OIMP891018RY1","OIMP891018MGTRNT17","PATSY ORTIZ MENDEZ",1,"831011724T0382000.000708",83101,7,24,"T03820",0,708,82,7,"B",2,201512,201512]
[null,"GUANAJUATO","HOHL860601124","HOHL860601MGTRRZ09","LUZ ANGELICA HORTA HERNANDEZ",1,"83101124CF2186500.00004",83101,2,4,"CF21865",0,4,1,"QB","B",1,201512,201512]
[null,"GUANAJUATO","POLH650106FW2","POLH650106HDFZPG03","HUGO POZADA LOPEZ",1,"831011719CF2186500.00007",83101,7,19,"CF21865",0,7,1,"QB","B",1,201512,201512]
[null,"GUANAJUATO","SEER810904RN6","SEER810904HGTRSF07","RAFAEL SERRATO ESPINOZA",1,"831011725T0381000.000220",83101,7,25,"T03810",0,220,39,2,"B",1,201513,201513]
[null,"GUANAJUATO","RULS870916391","RULS870916HGTZPR06","SERGIO ISMAEL RUIZ LOPEZ",1,"83101111CF3601400.0000021",83101,1,1,"CF36014",0,21,95,"OA1","A",3,201513,201513]
[null,"GUANAJUATO","RACS650614RH2","RACS650614MZSMLS05","SUSANA RAMIREZ CALDERON",1,"831011713CF3601400.000349",83101,7,13,"CF36014",0,349,92,"OA1","A",2,201513,201513]
[null,"GUANAJUATO","EAMS8812032H4","EAMS881203MGTSRN00","SANDRA JUDITH ESTRADA MIRANDA",1,"831011733CF3601400.000044",83101,7,33,"CF36014",0,44,92,"OA1","A",2,201513,201513]
[null,"GUANAJUATO","JIAR5906097A6","JIAR590609HVZMNB07","ROBERTO JIMENEZ DEL ANGEL",1,"831011512CF1407000.000032",83101,5,12,"CF14070",0,32,97,"MB2","A",1,201513,201513]
[null,"GUANAJUATO","ROBA860619I59","RXBA860619MDFDRR07","ARIANA RODRIGUEZ BRITO",1,"831011512CF0105900.000241",83101,5,12,"CF01059",0,241,93,"OA1","A",1,201513,201513]
[null,"GUANAJUATO","DOOM7502039N2","DOOM750203HGTMLN08","MANUEL DOMINGUEZ OLVERA",1,"83101124CF0105900.000133",83101,2,4,"CF01059",0,133,93,"OA1","A",1,201513,201513]
[null,"GUANAJUATO","GAAJ7304176P5","GAAG730417HGTRVD03","J. GUADALUPE GARCIA AVALOS",1,"831011725T0381000.0001102",83101,7,25,"T03810",0,1102,39,2,"B",2,201514,201514]
[null,"GUANAJUATO","RERM7802175Q8","RERM780217MGTYJR00","MARIANA REYES ROJAS",1,"831011512CF0105900.0000052",83101,5,12,"CF01059",0,52,93,"OA1","A",1,201514,201514]
[null,"GUANAJUATO","PERA560115384","PEXR560115HGTRXL09","RAUL PEREZ",1,"831011844A0180600.0000153",83101,8,44,"A01806",0,153,70,3,"B",2,201515,201515]
[null,"GUANAJUATO","CUSG780213V57","CUSG780213HGTRVL03","GUILIBALDO CRUZ SAAVEDRA",1,"831011742T0382000.000675",83101,7,42,"T03820",0,675,82,7,"B",2,201515,201515]
[null,"GUANAJUATO","HECF8509083P5","HECF850908MGTRLT09","FATIMA ADRIANA HERNANDEZ CALDERON",1,"831011722A0180300.000041",83101,7,22,"A01803",0,41,29,2,"B",1,201515,201515]
[null,"GUANAJUATO","CEAE800524DE1","CEAE800524MDFCSL07","ELSA CECEÑA ASCOBERETA",1,"83101124CF3601400.000349",83101,2,4,"CF36014",0,349,92,"OA1","A",3,201515,201515]
[null,"GUANAJUATO","MEGT6910136Q3","MEGT691013MGTLMR05","MARIA TERESA MELECIO GOMEZ",1,"831011846A0180700.000526",83101,8,46,"A01807",0,526,81,5,"B",2,201516,201516]
[null,"GUANAJUATO","FOQP690616QU0","FOQP690616MGTLVT01","PETRA FLORES QUEVEDO",1,"831011722CF3601400.000044",83101,7,22,"CF36014",0,44,92,"OA1","A",3,201516,201516]
[null,"GUANAJUATO","CAPS760203A30","CAPS760203HGTRXB01","SEBASTIAN CARRANCO PIÑON",1,"831011729T0382000.002462",83101,7,29,"T03820",0,2462,82,7,"B",1,201516,201516]
[null,"GUANAJUATO","ROSJ720103RL1","ROSJ720103HGTCGS19","J. JESUS ROCHA SEGURA",1,"831011729T0382000.001171",83101,7,29,"T03820",0,1171,82,7,"B",2,201516,201516]
[null,"GUANAJUATO","HERL8008128A5","HERL800812MGTRSR15","LAURA ELENA HERRERA RIOS",1,"831011720T0382000.0004411",83101,7,20,"T03820",0,4411,82,7,"B",1,201516,201516]
[null,"GUANAJUATO","HECF8509083P5","HECF850908MGTRLT09","FATIMA ADRIANA HERNANDEZ CALDERON",1,"831011722A0180300.000041",83101,7,22,"A01803",0,41,29,2,"B",2,201516,201516]
[null,"GUANAJUATO","REGJ781111QG6","REGJ781111HGTYRN09","JUAN MANUEL REYES GUERRERO",1,"831011713CF3601400.000276",83101,7,13,"CF36014",0,276,92,"OA1","A",2,201516,201516]
[null,"GUANAJUATO","ROBC900904U49","ROBC900904MDFCZT03","CITLALLIN MARGARITA ROCHA BAEZA",1,"83101113CF3384900.000296",83101,1,3,"CF33849",0,296,88,8,"B",3,201516,201516]
[null,"GUANAJUATO","MURM820910149","MURM820910HGTRDR08","MAURICIO ALEJANDRO MURILLO RODRIGUEZ",1,"831011721CF3601400.0002222",83101,7,21,"CF36014",0,2222,92,"OA1","A",3,201516,201516]
[null,"GUANAJUATO","HUOR660813PR3","HUOR660813MGTRLS01","ROSA ALICIA HUERTA OLIVARES",1,"831011951CF2186500.00003",83101,9,51,"CF21865",0,3,1,"QB","B",1,201516,201516]
[null,"GUANAJUATO","QUZL8105122Y1","QUZL810512MGTRVL09","LILIANA QUIROZ ZAVALA",1,"831011952CF0105900.000021",83101,9,52,"CF01059",0,21,93,"OA1","A",1,201517,201517]
[null,"GUANAJUATO","YEPV780203IU0","YEPV780203MGTBVR00","VERONICA ADRIANA YEBRA PAVON",1,"831011721T0382000.001985",83101,7,21,"T03820",0,1985,82,7,"B",2,201518,201518]
[null,"GUANAJUATO","QUZL8105122Y1","QUZL810512MGTRVL09","LILIANA QUIROZ ZAVALA",1,"831011952CF0105900.000021",83101,9,52,"CF01059",0,21,93,"OA1","A",2,201518,201518]
[null,"GUANAJUATO","JAMC611108NJ3","JAMC611108MGTRNR00","MARIA CARMEN JARALEÑO MANCERA",1,"831011310T0382300.000410",83101,3,10,"T03823",0,410,85,7,"B",2,201519,201519]
[null,"GUANAJUATO","FOGJ601017FG2","FOGJ601017HGTLRN01","JUAN MANUEL FLORES GARCIA",1,"831011716CF3601400.000082",83101,7,16,"CF36014",0,82,92,"OA1","A",2,201519,201519]
[null,"GUANAJUATO","MAOG7603243PA","MAOG760324MGTRCL00","GLORIA MARTINEZ OCHOA",1,"831011512CF2186500.00010",83101,5,12,"CF21865",0,10,1,"QB","B",1,201519,201519]
[null,"GUANAJUATO","YEPV780203IU0","YEPV780203MGTBVR00","VERONICA ADRIANA YEBRA PAVON",1,"831011721T0382000.001985",83101,7,21,"T03820",0,1985,82,7,"B",1,201520,201520]
[null,"GUANAJUATO","MASE530517JN0","MASE530517HGTRNR09","ERNESTO MARTINEZ SANCHEZ",1,"831011738T0382000.001779",83101,7,38,"T03820",0,1779,82,7,"B",2,201520,201520]
[null,"GUANAJUATO","CICC580720PX4","CICC580720HGTHNR06","CARLOS CHIMAL CONTRERAS",1,"831011733T0382000.000704",83101,7,33,"T03820",0,704,82,7,"B",2,201520,201520]
[null,"GUANAJUATO","HECF8509083P5","HECF850908MGTRLT09","FATIMA ADRIANA HERNANDEZ CALDERON",1,"831011722A0180300.000041",83101,7,22,"A01803",0,41,29,2,"B",2,201520,201520]
[null,"GUANAJUATO","OEMS820902SDA","OEMS820902HGTLNR01","SERGIO EDUARDO OLVERA MENDEZ",1,"831011719CF3601400.0000522",83101,7,19,"CF36014",0,522,92,"OA1","A",2,201520,201520]
[null,"GUANAJUATO","CAAB610110HC5","CAAB610110MGTRRR07","BERTHA ANGELICA CARPIO ARAGON",1,"831011723T0382000.002463",83101,7,23,"T03820",0,2463,82,7,"B",2,201520,201520]
[null,"GUANAJUATO","CAAB610110HC5","CAAB610110MGTRRR07","BERTHA ANGELICA CARPIO ARAGON",1,"831011723T0382000.002463",83101,7,23,"T03820",0,2463,82,7,"B",1,201520,201520]
[null,"GUANAJUATO","PERC861007CU1","PERC861007HGTDZH03","CHRISTIAN EMMANUEL PEDROZA RUIZ",1,"831011721T0380300.0002172",83101,7,21,"T03803",0,2172,47,2,"B",2,201520,201520]
[null,"GUANAJUATO","JUPL550226Q12","JUPL550226MGTRTR07","LAURA JUAREZ PATIÑO",1,"831011714A0180700.000168",83101,7,14,"A01807",0,168,81,5,"B",2,201521,201521]
[null,"GUANAJUATO","CAPS760203A30","CAPS760203HGTRXB01","SEBASTIAN CARRANCO PIÑON",1,"831011729T0382000.002462",83101,7,29,"T03820",0,2462,82,7,"B",2,201521,201521]
[null,"GUANAJUATO","COJP700317TZ9","COJP700317HMNRMD06","PEDRO CORTES JIMENEZ",1,"83101113CF2186500.00002",83101,1,3,"CF21865",0,2,1,"QB","B",1,201521,201521]
[null,"GUANAJUATO","COJP700317TZ9","COJP700317HMNRMD06","PEDRO CORTES JIMENEZ",1,"83101113CF2186500.00002",83101,1,3,"CF21865",0,2,1,"QB","B",3,201521,201521]
[null,"GUANAJUATO","AUGF640316LK3","AUGF640316HGTGRR05","FRANCISCO JAVIER AGUIRRE GUERRERO",1,"831011719CF3601400.0000522",83101,7,19,"CF36014",0,522,92,"OA1","A",1,201521,201521]
[null,"GUANAJUATO","REGJ781111QG6","REGJ781111HGTYRN09","JUAN MANUEL REYES GUERRERO",1,"831011713CF3601400.000276",83101,7,13,"CF36014",0,276,92,"OA1","A",1,201522,201522]
[null,"GUANAJUATO","REGJ781111QG6","REGJ781111HGTYRN09","JUAN MANUEL REYES GUERRERO",1,"831011713CF3601400.000082",83101,7,13,"CF36014",0,82,92,"OA1","A",3,201522,201522]
[null,"GUANAJUATO","MAOG7603243PA","MAOG760324MGTRCL00","GLORIA MARTINEZ OCHOA",1,"831011512CF2186500.00010",83101,5,12,"CF21865",0,10,1,"QB","B",2,201522,201522]
[null,"GUANAJUATO","SARF551229BE0","SARF551229HMNNDR06","FRANCISCO SANCHEZ RODRIGUEZ",1,"831011718CF3601400.000084",83101,7,18,"CF36014",0,84,92,"OA1","A",2,201523,201523]
[null,"GUANAJUATO","ROMG6809143N6","ROMG680914MGTJLR05","GEORGINA ROJAS MELGOZA",1,"831011728T0382000.000176",83101,7,28,"T03820",0,176,82,7,"B",2,201523,201523]
[null,"GUANAJUATO","HEAD9302028F6","HEAD930202HGTRLN05","DANIEL HERNANDEZ ALDACO",1,"831011846CF0105900.000021",83101,8,46,"CF01059",0,21,93,"OA1","A",1,201523,201523]
[null,"GUANAJUATO","ZARD580813557","ZARD580813MGTRQL01","DULCE MARIA ZARAGOZA Y ROQUE",1,"831011714T0382000.000892",83101,7,14,"T03820",0,892,82,7,"B",2,201524,201524]
[null,"GUANAJUATO","LUCD570725LD8","LUCD570725MGTNNL07","MARIA DOLORES LUNA CONTRERAS",1,"831011714T0382000.0000118",83101,7,14,"T03820",0,118,82,7,"B",2,201524,201524]
[null,"GUANAJUATO","AAMG6104186S7","AAMG610418MGTLRD01","MA. GUADALUPE ALVAREZ MORALES",1,"831011714A0180700.0000191",83101,7,14,"A01807",0,191,81,5,"B",2,201524,201524]
[null,"GUANAJUATO","GUCF620610MM6","GUCF620610MGTZRL09","MARIA FELIX GUZMAN CORTES",1,"831011726A0180700.000066",83101,7,26,"A01807",0,66,81,5,"B",2,201524,201524]
[null,"GUANAJUATO","CAHM560531ME5","CAHM560531HGTBRX03","MAXIMINO CABRERA HERNANDEZ",1,"831011951A0180300.0000471",83101,9,51,"A01803",0,471,29,2,"B",2,201524,201524]
[null,"GUANAJUATO","MAJJ661027V24","MAJS661027HGTNML04","J. SALUD MANCERA JIMENEZ",1,"83101113A0180600.000008",83101,1,3,"A01806",0,8,70,3,"B",2,201524,201524]
[null,"GUANAJUATO","PEMS581104EH2","PEMS581104MGTRRL01","SILVIA PEREZ MARTINEZ",1,"831011718A0180600.000252",83101,7,18,"A01806",0,252,70,3,"B",2,201524,201524]
[null,"GUANAJUATO","MECA550721BGA","MECA550721MGTNLN07","MA. DE LOS ANGELES MENDEZ CELESTIN",1,"83101124T0382300.000138",83101,2,4,"T03823",0,138,85,7,"B",2,201524,201524]
[null,"GUANAJUATO","MEGD640702CJ9","MEGD640702HGTNMV07","DAVID MENDOZA GOMEZ",1,"831011714T0382000.000122",83101,7,14,"T03820",0,122,82,7,"B",2,201524,201524]
[null,"GUANAJUATO","RICF590424FQ5","RICF590424HGTVSD03","FIDEL RIVERA CASTILLO",1,"831011720T0381000.000116",83101,7,20,"T03810",0,116,39,2,"B",2,201524,201524]
[null,"GUANAJUATO","BASD650419PC6","BASD650419MGTRNL06","MA. DOLORES BARCENAS SANCHEZ",1,"83101126A0180700.000457",83101,2,6,"A01807",0,457,81,5,"B",2,201524,201524]
[null,"GUANAJUATO","RORO630106MU5","ROXR630106MGTDXS03","MA. ROSALBA RODRIGUEZ",1,"831011714A0180700.000469",83101,7,14,"A01807",0,469,81,5,"B",2,201524,201524]
[null,"GUANAJUATO","TORL440723TS8","TORL440723HDFRMB02","LIBORIO TORRES RAMIREZ",1,"831011951A0380400.000137",83101,9,51,"A03804",0,137,43,2,"B",2,201524,201524]
[null,"GUANAJUATO","DESR580403369","DESR580403HMNLRB01","ROBERTO DELGADO SERRATO",1,"831011713T0382000.000367",83101,7,13,"T03820",0,367,82,7,"B",2,201524,201524]
[null,"GUANAJUATO","PUHM710228MP4","PUHM710228MGTGRR04","MARTHA PATRICIA PUGA HUERTA",1,"831011950A0180700.000501",83101,9,50,"A01807",0,501,81,5,"B",2,201524,201524]
[null,"GUANAJUATO","MESJ640111M38","MESJ640111HGTDNM00","JAIME MEDINA SANCHEZ",1,"831011844T0382300.0002232",83101,8,44,"T03823",0,2232,85,7,"B",2,201524,201524]
[null,"GUANAJUATO","TEQJ7107275Z4","TEQJ710727MGTRND05","JUDITH TREJO QUINTERO",1,"831011951A0180700.000172",83101,9,51,"A01807",0,172,81,5,"B",2,201524,201524]
[null,"GUANAJUATO","HEMR630129LH6","HEMR630129MGTRRY04","MA. DEL RAYO HERNANDEZ MORALES",1,"83101137T0381000.0004512",83101,3,7,"T03810",0,4512,39,2,"B",2,201524,201524]
[null,"GUANAJUATO","PAVA730326G70","PAVA730326MGTZLL01","ALEJANDRA PAZ VILLANUEVA",1,"83101112A0180600.0001951",83101,1,2,"A01806",0,1951,70,3,"B",2,201524,201524]
[null,"GUANAJUATO","MUFS691006FC3","MUFS691006HGTRLR09","SERGIO ALEJANDRO MURILLO FLORES",1,"831011844T0381000.000151",83101,8,44,"T03810",0,151,39,2,"B",2,201524,201524]
[null,"GUANAJUATO","RAAB6501253K8","RAAB650125HGTYRN02","JOSE BONIFACIO RAYON ARANDA",1,"831011951T0380300.000029",83101,9,51,"T03803",0,29,47,2,"B",2,201524,201524]
[null,"GUANAJUATO","MOVA660624EE4","MOVA660624HSPRLL01","ALEJANDRO MORALES VELASQUEZ",1,"831011718T0382300.000066",83101,7,18,"T03823",0,66,85,7,"B",2,201524,201524]
[null,"GUANAJUATO","GAAM691031CP4","GAAM691031HGTRRR06","MARCELINO GARCIA ARAUJO",1,"831011741T0382000.00686",83101,7,41,"T03820",0,686,82,7,"B",2,201524,201524]
[null,"GUANAJUATO","EEAL680616KE5","EEAL680616MGTSRZ04","LUZ MARIA ESTRELLA ARIAS",1,"83101126A0180600.000066",83101,2,6,"A01806",0,66,70,3,"B",2,201524,201524]
[null,"GUANAJUATO","ROLE580119DM2","ROLE580119MGTJPL09","ELVIRA ROJAS LOPEZ",1,"831011844A0380400.000066",83101,8,44,"A03804",0,66,43,2,"B",2,201524,201524]
[null,"GUANAJUATO","GOPR500214N78","GOPR500214HGTNNL05","RAUL GONZALEZ PANTOJA",1,"831011843A0180700.000312",83101,8,43,"A01807",0,312,81,5,"B",2,201524,201524]
[null,"GUANAJUATO","GARR740115NHA","GARR740115MGTLCC19","MA DEL ROCIO GALLARDO RICO",1,"831011733T0382000.000066",83101,7,33,"T03820",0,66,82,7,"B",2,201524,201524]
[null,"GUANAJUATO","CACL710727SP5","CACL710727MGTSMR01","MARIA LAURA SAN JUAN CASTAÑEDA CAMPOS",1,"831011720A0380400.000371",83101,7,20,"A03804",0,371,43,2,"B",2,201524,201524]
[null,"GUANAJUATO","GAES770928K33","GAES770928MGTRSS02","SUSANA GARCIA ESTRADA",1,"831011949A0180700.000066",83101,9,49,"A01807",0,66,81,5,"B",2,201524,201524]
[null,"GUANAJUATO","TEAS630908BX9","TEAS630908MMNLVR08","SARA TELLEZ AVILA",1,"83101124T0381000.000066",83101,2,4,"T03810",0,66,39,2,"B",2,201524,201524]
[null,"GUANAJUATO","SASM7509053E4","SASM750905MGTNLY05","MAYRA SANCHEZ SALINAS",1,"83101137A0380400.000066",83101,3,7,"A03804",0,66,43,2,"B",2,201524,201524]
[null,"GUANAJUATO","MEOJ640619171","MEOJ640619HGTNLS12","J. JESUS MENDEZ OLIVA",1,"831011729T0382000.002916",83101,7,29,"T03820",0,2916,82,7,"B",2,201524,201524]
[null,"GUANAJUATO","OEMA5308307K6","OEMA530830MMNRRL00","ALEJANDRA OREGEL MARTINEZ",1,"831011727CF3601400.000351",83101,7,27,"CF36014",0,351,92,"OA1","B",2,201524,201524]
[null,"GUANAJUATO","BAAL701128HC5","BAAL701128HTSRLN01","LEANDRO BARRON ALONSO",1,"831011718T0382000.002887",83101,7,18,"T03820",0,2887,82,7,"B",2,201524,201524]
[null,"GUANAJUATO","SETG700331TM7","SETG700331MGTRRD01","MA. GUADALUPE SERRANO TREJO",1,"83101124CF3384900.000296",83101,2,4,"CF33849",0,296,88,8,"B",1,201524,201524]
[null,"GUANAJUATO","QULJ710417B39","QULJ710417HDFRPN08","JUAN BERNARDO QUIROZ LOPEZ",1,"831011742T0382000.001530",83101,7,42,"T03820",0,1530,82,7,"B",3,201524,201524]
[null,"GUANAJUATO","AARJ690708F16","AARJ690708HGTLDS05","JOSE ALVAREZ RODRIGUEZ",1,"831011722T0382000.000435",83101,7,22,"T03820",0,435,82,7,"B",2,201524,201524]
[null,"GUANAJUATO","MACE770912412","MACE770912HQTRHC07","ECTOR JAVIER MARTINEZ CHAVEZ",1,"831011728CF3601400.000351",83101,7,28,"CF36014",0,351,92,"OA1","B",3,201524,201524]
[null,"GUANAJUATO","GARM791222RR9","GARM791222MGTLDR08","MARIA MAURA GALVAN RODRIGUEZ",1,"831011843A0180700.000066",83101,8,43,"A01807",0,66,81,5,"B",2,201524,201524]
[null,"GUANAJUATO","COMC760615F26","COMC760615HGTRRR06","CRISTOBAL ARTURO CORTES MARTINEZ",1,"83101124T0380300.000066",83101,2,4,"T03803",0,66,47,2,"B",2,201524,201524]
[null,"GUANAJUATO","OAGJ780602JQ7","OAGJ780602MVZCLR09","JERAMEEL OCAÑA GALINDO",1,"831011843S0180300.000066",83101,8,43,"S01803",0,66,21,2,"B",2,201524,201524]
[null,"GUANAJUATO","GOSF780306TW7","GOSF780306MGTNLL09","MA. FELICITAS GONZALEZ SALAS",1,"831011722T0382000.000391",83101,7,22,"T03820",0,391,82,7,"B",2,201524,201524]
[null,"GUANAJUATO","GAEF781007FQ9","GAEF781007HASRSR06","FRANCISCO JAVIER GARCIA ESQUIVEL",1,"831011729T0382000.000915",83101,7,29,"T03820",0,915,82,7,"B",2,201524,201524]
[null,"GUANAJUATO","LUPI741127IZ3","LUPI741127MDFNRS02","MARIA ISABEL LUNA PEREZ",1,"831011310CF2186500.00009",83101,3,10,"CF21865",0,9,1,"QB","B",3,201524,201524]
[null,"GUANAJUATO","VINM871130FV5","VINM871130MGTLVN04","MARIA MONTSERRAT VILLAFAÑA NAVA",1,"831011950CF3384900.000066",83101,9,50,"CF33849",0,66,88,8,"B",2,201524,201524]
[null,"GUANAJUATO","CAAB610110HC5","CAAB610110MGTRRR07","BERTHA ANGELICA CARPIO ARAGON",1,"831011723T0382000.002463",83101,7,23,"T03820",0,2463,82,7,"B",1,201524,201524]
[null,"GUANAJUATO","SAMM8709097V3","SAMM870909HGTNNR04","MARIO OSCAR SANCHEZ MANDUJANO",1,"831011951T0381000.000066",83101,9,51,"T03810",0,66,39,2,"B",2,201524,201524]
[null,"GUANAJUATO","SAMM8709097V3","SAMM870909HGTNNR04","MARIO OSCAR SANCHEZ MANDUJANO",1,"831011951T0381000.000219",83101,9,51,"T03810",0,219,39,2,"B",3,201524,201524]
[null,"GUANAJUATO","CUME820306JF6","CUME820306HPLRRS07","ESTEBAN DE LA CRUZ MORALES",1,"831011718A0380400.000143",83101,7,18,"A03804",0,143,43,2,"B",2,201524,201524]
[null,"GUANAJUATO","NOSV840205QG9","NOSV840205HGTRLC08","VICTOR ALFONSO NORIEGA SILVA",1,"83101113CF3481000.0000031",83101,1,3,"CF34810",0,31,70,3,"B",3,201524,201524]
[null,"GUANAJUATO","REML5601235F5","REML560123MGTYRT00","MARIA LETICIA REYNOSA MORENO",1,"831011844A0380400.000066",83101,8,44,"A03804",0,66,43,2,"B",2,201524,201524]
[null,"GUANAJUATO","POML751010N61","POML751010MMCNRZ08","LUZ ALICIA PONCE DE LEON MIRELES",1,"831011512CF3384900.000066",83101,5,12,"CF33849",0,66,88,8,"B",2,201524,201524]
[null,"GUANAJUATO","NACC800204L10","NACC800204MGTVHL05","CLAUDIA GABRIELA NAVARRO CHAVEZ",1,"831011951A0380400.000066",83101,9,51,"A03804",0,66,43,2,"B",2,201524,201524]
[null,"Total Personas : ",189,null,null,null,null,null,null,null,"Total Plazas : ",null,189]
[]
[]
[]
[null,"Fuente : Información proporcionada por las Entidades Federativas"]

{"sheet":"II D) 4","index":7,"n_rows":27,"n_cols":17,"rows_kept":27,"cut":false,"hidden":false,"merged":[[23,13,23,14],[12,0,13,0],[12,6,13,6],[12,7,12,13],[12,14,12,15],[12,2,13,2],[12,1,13,1],[12,16,13,16],[12,5,13,5],[12,4,13,4],[12,3,13,3],[9,1,9,9]]}
[]
[]
[]
[]
[]
[]
[]
[]
[null,"Formato: Trabajadores Jubilados en el Periodo"]
[null,{"$f":"IF('Caratula Resumen'!D22=\"Elige el Periodo…\",\"\",'Caratula Resumen'!D22)","v":"Fondo de Aportaciones para la Educación Tecnológica y de Adultos/Instituto Nacional para la Educación de los Adultos (FAETA/INEA)"},null,null,null,null,null,null,null,null,null,null,null,null,null,{"$f":"IF('Caratula Resumen'!D23=\"Elige el Periodo…\",\"\",'Caratula Resumen'!D23)","v":"4to. Trimestre"}]
[]
[]
[null,"Entidad Federativa","R.F.C.","CURP","NOMBRE","Clave CT","Última(s) ó Penultima(s) Plaza(s) Ocupada(s)\n(*)","Clave Presupuestal de la Jubilación",null,null,null,null,null,null,"Periodo ocupado",null,"Quincena de inicio de jubilación"]
[null,null,null,null,null,null,null,"Partida Presupuestal","Código de Pago","Clave de Unidad","Clave de Sub Unidad","Clave de Categoría","Horas Semana Mes ","Número de Plaza","Inicio","Conclusión"]
[]
[null,"Entidad Federativa","R.F.C.","CURP","NOMBRE","Clave Centro de Trabajo","Última(s) ó Penultima(s) Plaza(s) Ocupada(s)\n(*)","Partida Presupuestal","Código de Pago","Clave de Unidad","Clave de Sub Unidad","Clave de Categoría","Horas Semana Mes ","Número de Plaza","Periodo ocupado\nInicio","Periodo ocupado\nConclusión","Quincena de inicio de jubilación"]
[]
[]
[]
[]
[]
[null,"Total Personas : ",null,null,null,null,null,null,null,null,null,"Total Plazas : "]
[]
[]
[]
[null,"Fuente : Información proporcionada por las Entidades Federativas"]
[null,"(*) Si  el trabajador se jubila con más de una clave presupuestal, por cada plaza se debe llenar un registro hasta que se haya informado acerca de todas las plazas del trabajador."]

{"sheet":"II D) 4 A","index":8,"n_rows":27,"n_cols":18,"rows_kept":27,"cut":false,"hidden":false,"merged":[[21,13,21,14],[9,1,9,7],[23,13,23,14],[12,17,13,17],[12,1,13,1],[12,2,13,2],[12,3,13,3],[12,4,13,4],[12,5,13,5],[12,6,12,12],[12,13,12,14],[12,15,13,15],[12,16,13,16]]}
[]
[]
[]
[]
[]
[]
[]
[]
[null,"Formato: Trabajadores que Tramitaron Licencia Prejubilatoria en el Periodo"]
[null,{"$f":"IF('Caratula Resumen'!D22=\"Elige el Periodo…\",\"\",'Caratula Resumen'!D22)","v":"Fondo de Aportaciones para la Educación Tecnológica y de Adultos/Instituto Nacional para la Educación de los Adultos (FAETA/INEA)"},null,null,null,null,null,null,null,null,null,null,null,null,null,null,null,{"$f":"IF('Caratula Resumen'!D23=\"Elige el Periodo…\",\"\",'Caratula Resumen'!D23)","v":"4to. Trimestre"}]
[]
[]
[null,"Entidad Federativa","R.F.C.","CURP","NOMBRE","Clave integrada","Clave Presupuestal",null,null,null,null,null,null,"Periodo Licencia",null,"Percepciones pagadas con Presupuesto Federal en el  Periodo reportado*","Percepciones pagadas con Presupuesto de otra Fuente en el  Periodo reportado*","Clave CT Origen"]
[null,null,null,null,null,null,"Partida Presupuestal","Código de Pago","Clave de Unidad","Clave de Sub Unidad","Clave de Categoría","Horas Semana Mes ","Número de Plaza","Inicio","Conclusión"]
[]
[null,"Entidad Federativa","R.F.C.","CURP","NOMBRE","Clave integrada","Partida Presupuestal","Código de Pago","Clave de Unidad","Clave de Sub Unidad","Clave de Categoría","Horas Semana Mes ","Número de Plaza","Periodo Licencia\nInicio","Periodo Licencia\nConclusión","Percepciones pagadas con Presupuesto Federal en el  Periodo reportado*","Percepciones pagadas con Presupuesto de otra Fuente en el  Periodo reportado*","Clave CT Origen"]
[]
[]
[]
[]
[]
[null,"Total Personas : ",null,null,null,null,null,null,null,null,"Total Plazas : ",null,null,"Total Pto. Federal"]
[]
[null,null,null,null,null,null,null,null,null,null,null,null,null,"Total Ppto. Otras Fuentes"]
[]
[null,"*Total de Percepciones reportadas por la Entidad Federativa como pagadas en el periodo "]
[null,"Fuente : Información proporcionada por las Entidades Federativas"]

{"sheet":"II D) 6","index":9,"n_rows":34,"n_cols":13,"rows_kept":34,"cut":false,"hidden":false,"merged":[[10,1,10,6],[13,12,14,12],[13,9,13,10],[13,11,14,11],[13,1,14,1],[13,2,14,2],[13,3,14,3],[13,4,14,4],[13,5,14,5],[13,6,14,6],[13,7,13,8]]}
[]
[]
[]
[]
[]
[]
[]
[]
[]
[null,"Formato: Trabajadores Contratados por Honorarios en el Periodo"]
[null,{"$f":"IF('Caratula Resumen'!D22=\"Elige el Periodo…\",\"\",'Caratula Resumen'!D22)","v":"Fondo de Aportaciones para la Educación Tecnológica y de Adultos/Instituto Nacional para la Educación de los Adultos (FAETA/INEA)"},null,null,null,null,null,null,null,null,null,null,{"$f":"IF('Caratula Resumen'!D23=\"Elige el Periodo…\",\"\",'Caratula Resumen'!D23)","v":"4to. Trimestre"}]
[]
[]
[null,"Entidad Federativa","Clave Centro de Trabajo","R.F.C.","CURP","Nombre","Identificador del Contrato","Equivalencia",null,"Periodo de Contratación",null,"Función","Percepciones pagadas dentro del periodo reportado"]
[null,null,null,null,null,null,null,"Clave de Categoría","Horas Semana Mes ","Inicio","Conclusión"]
[]
[null,"Entidad Federativa","Clave Centro de Trabajo","R.F.C.","CURP","Nombre","Identificador del Contrato","Clave de Categoría","Horas Semana Mes ","Periodo de Contratación\nInicio","Periodo de Contratación\nConclusión","Función","Percepciones pagadas dentro del periodo reportado"]
[null,"GUANAJUATO","11EBS6627E","BEGE910301GS3","BEGE910301MGTSTN05","MARIA ENRIQUETA BESOY GUTIERREZ ",1,2896863418,0,20150323,20151215,"TURNAR Y CONTESTAR OFICIOS PARA DAR SEGUIMIENTO OPORTUNO A LOS TRAMITES ASI COMO REALIZAR OTRAS ACTIVIDADES ADMINISTRATIVOAS",{"$f":"2750*9","v":24750}]
[null,"GUANAJUATO","11EBS6627E","ROHS931122HC1","ROHS931122MGTDRL00","SILVIA RODRIGUEZ HERNANDEZ ",1,2896863426,0,20150416,20151215,"TURNAR Y CONTESTAR OFICIOS PARA DAR SEGUIMIENTO OPORTUNO A LOS TRAMITES ASI COMO REALIZAR OTRAS ACTIVIDADES ADMINISTRATIVOAS",{"$f":"2750*8","v":22000}]
[null,"GUANAJUATO","11EBS6627E","ZAVL881022CS3","ZAVL881022MGTVRR05","LAURA ESTHELA ZAVALA VERA ",1,2896863434,0,20150413,20151215,"SUPERVISION SEGUIMIENTO Y CUMPLIMENTO DE LOS INDICADORES DE INDICADORES DE EFICIENCIA OPERATIVA DEFINIDOS POR LA DIRECCION REGIONAL PARA LAS COORDINACIONES DE LA REGION SUPERVISION ",{"$f":"5500*8","v":44000}]
[null,"GUANAJUATO","11EBS6627E","RIMJ951204211","RIMJ951204HGTNJR09","JAIRO RINCON MEJIA ",1,1469949240,0,20150406,20151215,"RECLUTAR ASESORES PARA LA IMPARTICION DE LAS ASESORIAS Y ASEGURAR LA ADECUADAOPERACION DE LOS PROGRMAS DEL INAEBA",{"$f":"3900*8","v":31200}]
[null,"GUANAJUATO","11EBS6627E","GUMC861020514","GUMC861020HGTRNS04","CESAR GUERRERO MENDEZ ",1,2678754233,0,20150701,20151215,"SUPERVISION SEGUIMIENTO Y CUMPLIMENTO DE LOS INDICADORES DE INDICADORES DE EFICIENCIA OPERATIVA DEFINIDOS POR LA DIRECCION REGIONAL PARA LAS COORDINACIONES DE LA REGION SUPERVISION ",{"$f":"5500*5","v":27500}]
[null,"GUANAJUATO","11EBS6627E","ROBD731212SF4","ROBD731212MGTXRL08","DULCE MARIA GUADALUPE ROA BARRON",1,2662756226,0,20150807,20151215,"TURNAR Y CONTESTAR OFICIOS PARA DAR SEGUIMIENTO OPORTUNO A LOS TRAMITES ASI COMO REALIZAR OTRAS ACTIVIDADES ADMINISTRATIVOAS",{"$f":"5500*4","v":22000}]
[null,"GUANAJUATO","11EBS6627E","MEAX550223TH8","MXAR550223HGTNLF00","RAFAEL MENDEZ ALCANTAR",1,1441181467,0,20150906,20151215,"DIRIGIR Y ASEGURAR QUE SE REALICEN ADECUADAMENTE LAS ACCIONES OPERATIVAS Y EDUCATIVAS QUE CONTRIBUYAN A DISMINUIR EL ANALFABETISMO Y EL REZAGO EDUCATIVO EN SU ZONA DE INFLUENCIA.",{"$f":"11259*3","v":33777}]
[null,"GUANAJUATO","11EBS6627E","GAAL7606041B0","GAAL760604MGTRGL04","LILIANA GARCIDUEÑAS AGUILAR",1,2896863396,0,20151001,20151215,"TURNAR Y CONTESTAR OFICIOS PARA DAR SEGUIMIENTO OPORTUNO A LOS TRAMITES ASI COMO REALIZAR OTRAS ACTIVIDADES ADMINISTRATIVOAS",{"$f":"5500*2","v":11000}]
[null,"GUANAJUATO","11EBS6627E","RUMA951109CV5","RUMA951109MGTDXL00","ALMA ROSA RUEDA MUÑOZ",1,2745119693,0,20151101,20151215,"TURNAR Y CONTESTAR OFICIOS PARA DAR SEGUIMIENTO OPORTUNO A LOS TRAMITES ASI COMO REALIZAR OTRAS ACTIVIDADES ADMINISTRATIVOAS",{"$f":"13750*2","v":27500}]
[null,"GUANAJUATO","11EBS6627E","MAGA911123BP0","MAGA911123MGTRYL08","ALMA MARTINEZ GAYTAN ",1,0,0,20151101,20151215,"TURNAR Y CONTESTAR OFICIOS PARA DAR SEGUIMIENTO OPORTUNO A LOS TRAMITES ASI COMO REALIZAR OTRAS ACTIVIDADES ADMINISTRATIVOAS",{"$f":"8250*2","v":16500}]
[null,"GUANAJUATO","11EBS6627E","HEOS861101KQ5","HEOS861101MGTRTR07","SARA HERNANDEZ OTERO ",1,2896863191,0,20151101,20151215,"TURNAR Y CONTESTAR OFICIOS PARA DAR SEGUIMIENTO OPORTUNO A LOS TRAMITES ASI COMO REALIZAR OTRAS ACTIVIDADES ADMINISTRATIVOAS",{"$f":"11700*2","v":23400}]
[null,"Total Entidad Federativa Personas : ",null,11,null,null,null,null,null,null,null,"Subtotal Monto Pagado en el Periodo:",{"$f":"SUBTOTAL(109,Tabla14[Percepciones pagadas dentro del periodo reportado])","v":283627}]
[]
[]
[null,null,null,null,null,null,null,null,null,"Total   Percepciones :",null,{"$f":"M29","v":283627}]
[]
[null,"Fuente : Información proporcionada por las Entidades Federativas"]

{"sheet":"II D) 7 1","index":10,"n_rows":37,"n_cols":19,"rows_kept":37,"cut":false,"hidden":false,"merged":[[33,16,33,17],[12,18,13,18],[12,13,13,13],[12,14,13,14],[12,15,13,15],[12,16,13,16],[8,17,8,18],[9,1,9,9],[12,6,13,6],[12,7,12,9],[12,10,13,10],[12,11,13,11],[12,12,13,12],[12,1,13,1],[12,2,13,2],[12,3,13,3],[12,4,13,4],[12,5,13,5],[12,17,13,17]]}
[]
[]
[]
[]
[]
[]
[]
[]
[null,"Formato: Analítico de Categorías / Plazas Autorizadas con su Tabulador",null,null,null,null,null,null,null,null,null,null,null,null,null,null,"Entidad Federativa:",{"$f":"IF('Caratula Resumen'!D21=\"Elige el Periodo…\",\"\",'Caratula Resumen'!D21)","v":" GUANAJUATO "}]
[null,{"$f":"IF('Caratula Resumen'!D22=\"Elige el Periodo…\",\"\",'Caratula Resumen'!D22)","v":"Fondo de Aportaciones para la Educación Tecnológica y de Adultos/Instituto Nacional para la Educación de los Adultos (FAETA/INEA)"},null,null,null,null,null,null,null,null,null,null,null,null,null,null,null,null,{"$f":"IF('Caratula Resumen'!D23=\"Elige el Periodo…\",\"\",'Caratula Resumen'!D23)","v":"4to. Trimestre"}]
[]
[]
[null,"Clave Tipo educativo","Clave Nivel educativo","Clave Subnivel educativo","Descripción Nivel / Subnivel","Tipo Financiamiento","Partida Presupuestal","CATEGORIA",null,null,"Zona Económica","Nivel Puesto","Nivel Sueldo","Tipo Contratación","Monto mensual\npor plaza jornada","Monto mensual\nPor Plaza HSM","Número de Plazas Jornada","Número de Plazas HSM","Monto total autorizado"]
[null,null,null,null,null,null,null,"Tipo de Categoría"," Categoría","Descripción"]
[]
[null,"Clave Tipo educativo","Clave Nivel educativo","Clave Subnivel educativo","Descripción Nivel / Subnivel","Tipo Financiamiento","Partida Presupestal","Tipo de Categoría"," Categoría","Descripción","Zona Económica","Nivel Puesto","Nivel Sueldo","Tipo Contratación","Monto mensual\npor plaza jornada","Monto mensual\nPor Plaza HSM","Número de Plazas Jornada","Número de Plazas HSM","Monto total autorizado"]
[null,6,61,64,"PRIMARIA, SECUNDARIA Y CAPACITACION PARA EL TRABAJO","FAETA",83101,5,"CF36014","COORDINADOR DE ZONA","A",92,"OA1","P",4190.88,0,10,0,41908.800000000003]
[null,6,61,64,"PRIMARIA, SECUNDARIA Y CAPACITACION PARA EL TRABAJO","FAETA",83101,5,"CF01059","JEFE DE DEPARTAMENTO","A",93,"OA1","P",5164.51,0,5,0,25822.55]
[null,6,61,64,"PRIMARIA, SECUNDARIA Y CAPACITACION PARA EL TRABAJO","FAETA",83101,5,"CF36014","COORDINADOR DE ZONA","A",95,"OA1","P",5164.5200000000004,0,1,0,5164.5200000000004]
[null,6,61,64,"PRIMARIA, SECUNDARIA Y CAPACITACION PARA EL TRABAJO","FAETA",83101,5,"CF14070","DELEGADO","A",97,"MB2","P",14611.06,0,1,0,14611.06]
[null,6,61,64,"PRIMARIA, SECUNDARIA Y CAPACITACION PARA EL TRABAJO","FAETA",83101,5,"CF21865","PROFESIONAL DICTAMINADOR","B",1,"QB","P",6498.9,0,12,0,77986.8]
[null,6,61,64,"PRIMARIA, SECUNDARIA Y CAPACITACION PARA EL TRABAJO","FAETA",83101,2,"S01803","OFICIAL DE SERVICIOS Y MANTENIMIENTO","B",21,2,"P",5731,0,3,0,17193]
[null,6,61,64,"PRIMARIA, SECUNDARIA Y CAPACITACION PARA EL TRABAJO","FAETA",83101,2,"A01803","ADMINSITRATIVO ESPECIALIZADO","B",29,2,"P",5731,0,3,0,17193]
[null,6,61,64,"PRIMARIA, SECUNDARIA Y CAPACITACION PARA EL TRABAJO","FAETA",83101,2,"T03810","ESPECIALISTA EN PROYECTOS TECNICOS","B",39,2,"P",5731,0,16,0,91696]
[null,6,61,64,"PRIMARIA, SECUNDARIA Y CAPACITACION PARA EL TRABAJO","FAETA",83101,2,"A03804","SECRETARIA C","B",43,2,"P",5731,0,18,0,103158]
[null,6,61,64,"PRIMARIA, SECUNDARIA Y CAPACITACION PARA EL TRABAJO","FAETA",83101,2,"T03803","TECNICO MEDIO","B",47,2,"P",5731,0,18,0,103158]
[null,6,61,64,"PRIMARIA, SECUNDARIA Y CAPACITACION PARA EL TRABAJO","FAETA",83101,2,"A01806","ANALISTA ADMINISTRATIVO","B",70,3,"P",5883.93,0,15,0,88258.95]
[null,6,61,64,"PRIMARIA, SECUNDARIA Y CAPACITACION PARA EL TRABAJO","FAETA",83101,2,"CF34810","ANALISTA ADMINISTRATIVO","B",70,3,"P",5883.93,0,1,0,5883.93]
[null,6,61,64,"PRIMARIA, SECUNDARIA Y CAPACITACION PARA EL TRABAJO","FAETA",83101,2,"A01807","JEFE DE OFICINA","B",81,5,"P",6204.78,0,17,0,105481.26]
[null,6,61,64,"PRIMARIA, SECUNDARIA Y CAPACITACION PARA EL TRABAJO","FAETA",83101,2,"T03820","TECNICO DOCENTE","B",82,7,"P",6418.76,0,144,0,924301.44]
[null,6,61,64,"PRIMARIA, SECUNDARIA Y CAPACITACION PARA EL TRABAJO","FAETA",83101,2,"T03823","TECNICO SUPERIOR","B",85,7,"P",6418.76,0,1,0,6418.76]
[null,6,61,64,"PRIMARIA, SECUNDARIA Y CAPACITACION PARA EL TRABAJO","FAETA",83101,2,"CF33849","COORD. DE SERVICIOS ESP.","B",88,8,"P",6495.05,0,2,0,12990.1]
[null,6,61,64,"PRIMARIA, SECUNDARIA Y CAPACITACION PARA EL TRABAJO","FAETA",83101,2,"CF36014","COORINADOR DE ZONA","B",92,"OA1","P",4328.8500000000004,0,3,0,12986.55]
[null,null,null,null,null,null,null,null,null,null,null,null,null,"Total Jornada:",{"$f":"SUBTOTAL(109,Tabla15[Monto mensual\npor plaza jornada])","v":105918.93000000001},null,"Total Autorizado:",null,{"$f":"SUBTOTAL(109,Tabla15[Monto total autorizado])","v":1654212.7200000002}]
[null,null,null,null,null,null,null,null,null,null,null,null,null,"Total HSM",null,{"$f":"SUM(O39)","v":0}]
[]
[null,"Fuente : Información proporcionada por las Entidades Federativas"]

{"sheet":"II D) 7 2 ","index":11,"n_rows":214,"n_cols":18,"rows_kept":214,"cut":false,"hidden":false,"merged":[[14,8,15,8],[14,9,14,13],[14,14,14,16],[10,16,10,17],[11,1,11,9],[14,1,15,1],[14,2,15,2],[14,3,15,3],[14,17,15,17],[14,6,15,6],[14,7,15,7],[14,4,15,4],[14,5,15,5]]}
[]
[]
[]
[]
[]
[]
[]
[]
[]
[]
[null,"Formato: Catálogo de Categorías y Tabuladores",null,null,null,null,null,null,null,null,null,null,null,null,null,"Entidad Federativa:",{"$f":"IF('Caratula Resumen'!D21=\"Elige el Periodo…\",\"\",'Caratula Resumen'!D21)","v":" GUANAJUATO "}]
[null,{"$f":"IF('Caratula Resumen'!D22=\"Elige el Periodo…\",\"\",'Caratula Resumen'!D22)","v":"Fondo de Aportaciones para la Educación Tecnológica y de Adultos/Instituto Nacional para la Educación de los Adultos (FAETA/INEA)"},null,null,null,null,null,null,null,null,null,null,null,null,null,null,null,{"$f":"IF('Caratula Resumen'!D23=\"Elige el Periodo…\",\"\",'Caratula Resumen'!D23)","v":"4to. Trimestre"}]
[]
[]
[null,"Identificador origen presupuestal de la plaza","Clave de categoría","Descripción de la categoría","Tipo de contratación","Tipo de categoría","Clave de concepto de pago","Clave de nivel de puesto","Clave de nivel de sueldo","Sueldo asignado por zona económica",null,null,null,null,"Datos adicionales de horas",null,null,"Fecha de actualización"]
[null,null,null,null,null,null,null,null,null,"Inicio de vigencia del sueldo","Fin de vigencia del sueldo","Monto Mensual Jornada ó de HSM\nZona A","Monto Mensual Jornada ó de HSM\nZona B","Monto Mensual Jornada ó de HSM\nZona C","Horas \nde compatibilidad","Horas de servicio (HSM)","Horas de docencia"]
[]
[null,"Identificador origen presupuestal de la plaza","Clave de categoría","Descripción de la categoría","Tipo de contratación","Tipo de categoría","Clave de concepto de pago","Clave de nivel de puesto","Clave de nivel de sueldo","Inicio de vigencia del sueldo","Fin de vigencia del sueldo","Monto Mensual Jornada ó de HSM\nZona A","Monto Mensual Jornada ó de HSM\nZona B","Monto Mensual Jornada ó de HSM\nZona C","Horas \nde compatibilidad","Horas de servicio (HSM)","Horas de docencia","Fecha de actualización"]
[null,1,"CF21865","PROFESIONAL DICTAMINADOR DE SERVICIOS ESPECIALIZADOS","P",2,1,1,"QB",201207,999999,0,0,6498.9,35,35,0,20160112]
[null,1,"CF21865","PROFESIONAL DICTAMINADOR DE SERVICIOS ESPECIALIZADOS","P",2,2,1,"QB",201207,999999,0,0,415,35,35,0,20160112]
[null,1,"CF21865","PROFESIONAL DICTAMINADOR DE SERVICIOS ESPECIALIZADOS","P",2,3,1,"QB",201207,999999,0,0,5866.4,35,35,0,20160112]
[null,1,"CF21865","PROFESIONAL DICTAMINADOR DE SERVICIOS ESPECIALIZADOS","P",2,9,1,"QB",201207,999999,0,0,465,35,35,0,20160112]
[null,1,"CF21865","PROFESIONAL DICTAMINADOR DE SERVICIOS ESPECIALIZADOS","P",2,12,1,"QB",201207,999999,0,0,385,35,35,0,20160112]
[null,1,"CF21865","PROFESIONAL DICTAMINADOR DE SERVICIOS ESPECIALIZADOS","P",2,20,1,"QB",201207,999999,0,0,1300,35,35,0,20160112]
[null,1,"CF21865","PROFESIONAL DICTAMINADOR DE SERVICIOS ESPECIALIZADOS","P",2,106,1,"QB",201207,999999,0,0,200,35,35,0,20160112]
[null,1,"S01803","OFICIAL DE SERVICIOS Y MANTEN.","P",2,1,21,2,201207,999999,0,0,5731,35,35,0,20160112]
[null,1,"S01803","OFICIAL DE SERVICIOS Y MANTEN.","P",2,4,21,2,201207,999999,0,0,100,35,35,0,20160112]
[null,1,"S01803","OFICIAL DE SERVICIOS Y MANTEN.","P",2,9,21,2,201207,999999,0,0,365,35,35,0,20160112]
[null,1,"S01803","OFICIAL DE SERVICIOS Y MANTEN.","P",2,11,21,2,201207,999999,0,0,365,35,35,0,20160112]
[null,1,"S01803","OFICIAL DE SERVICIOS Y MANTEN.","P",2,14,21,2,201207,999999,0,0,335,35,35,0,20160112]
[null,1,"S01803","OFICIAL DE SERVICIOS Y MANTEN.","P",2,20,21,2,201207,999999,0,0,1200,35,35,0,20160112]
[null,1,"S01803","OFICIAL DE SERVICIOS Y MANTEN.","P",2,50,21,2,201207,999999,0,0,186.56,35,35,0,20160112]
[null,1,"S01803","OFICIAL DE SERVICIOS Y MANTEN.","P",2,63,21,2,201207,999999,0,0,659.06,35,35,0,20160112]
[null,1,"S01803","OFICIAL DE SERVICIOS Y MANTEN.","P",2,68,21,2,201207,999999,0,0,734.86,35,35,0,20160112]
[null,1,"A01803","ADMINISTRATIVO ESPECIALIZADO","P",2,1,29,2,201207,999999,0,0,5731,35,35,0,20160112]
[null,1,"A01803","ADMINISTRATIVO ESPECIALIZADO","P",2,4,29,2,201207,999999,0,0,225,35,35,0,20160112]
[null,1,"A01803","ADMINISTRATIVO ESPECIALIZADO","P",2,9,29,2,201207,999999,0,0,365,35,35,0,20160112]
[null,1,"A01803","ADMINISTRATIVO ESPECIALIZADO","P",2,11,29,2,201207,999999,0,0,365,35,35,0,20160112]
[null,1,"A01803","ADMINISTRATIVO ESPECIALIZADO","P",2,14,29,2,201207,999999,0,0,335,35,35,0,20160112]
[null,1,"A01803","ADMINISTRATIVO ESPECIALIZADO","P",2,20,29,2,201207,999999,0,0,1200,35,35,0,20160112]
[null,1,"A01803","ADMINISTRATIVO ESPECIALIZADO","P",2,50,29,2,201207,999999,0,0,520.04,35,35,0,20160112]
[null,1,"A01803","ADMINISTRATIVO ESPECIALIZADO","P",2,63,29,2,201207,999999,0,0,659.06,35,35,0,20160112]
[null,1,"A01803","ADMINISTRATIVO ESPECIALIZADO","P",2,68,29,2,201207,999999,0,0,734.86,35,35,0,20160112]
[null,1,"T03810","ESPECIALISTA EN PROYECTOS TECNICOS","P",2,1,39,2,201207,999999,0,0,5731,35,35,0,20160112]
[null,1,"T03810","ESPECIALISTA EN PROYECTOS TECNICOS","P",2,4,39,2,201207,999999,0,0,200,35,35,0,20160112]
[null,1,"T03810","ESPECIALISTA EN PROYECTOS TECNICOS","P",2,9,39,2,201207,999999,0,0,365,35,35,0,20160112]
[null,1,"T03810","ESPECIALISTA EN PROYECTOS TECNICOS","P",2,11,39,2,201207,999999,0,0,365,35,35,0,20160112]
[null,1,"T03810","ESPECIALISTA EN PROYECTOS TECNICOS","P",2,14,39,2,201207,999999,0,0,335,35,35,0,20160112]
[null,1,"T03810","ESPECIALISTA EN PROYECTOS TECNICOS","P",2,20,39,2,201207,999999,0,0,1200,35,35,0,20160112]
[null,1,"T03810","ESPECIALISTA EN PROYECTOS TECNICOS","P",2,50,39,2,201207,999999,0,0,1003.52,35,35,0,20160112]
[null,1,"T03810","ESPECIALISTA EN PROYECTOS TECNICOS","P",2,63,39,2,201207,999999,0,0,659.06,35,35,0,20160112]
[null,1,"T03810","ESPECIALISTA EN PROYECTOS TECNICOS","P",2,68,39,2,201207,999999,0,0,734.86,35,35,0,20160112]
[null,1,"T03810","ESPECIALISTA EN PROYECTOS TECNICOS","P",2,13,39,2,201207,999999,0,0,60,35,35,0,20160112]
[null,1,"A03804","SECRETARIA C","P",2,1,43,2,201207,999999,0,0,5731,35,35,0,20160112]
[null,1,"A03804","SECRETARIA C","P",2,4,43,2,201207,999999,0,0,175,35,35,0,20160112]
[null,1,"A03804","SECRETARIA C","P",2,9,43,2,201207,999999,0,0,365,35,35,0,20160112]
[null,1,"A03804","SECRETARIA C","P",2,11,43,2,201207,999999,0,0,365,35,35,0,20160112]
[null,1,"A03804","SECRETARIA C","P",2,14,43,2,201207,999999,0,0,335,35,35,0,20160112]
[null,1,"A03804","SECRETARIA C","P",2,20,43,2,201207,999999,0,0,1200,35,35,0,20160112]
[null,1,"A03804","SECRETARIA C","P",2,50,43,2,201207,999999,0,0,684.66,35,35,0,20160112]
[null,1,"A03804","SECRETARIA C","P",2,63,43,2,201207,999999,0,0,659.06,35,35,0,20160112]
[null,1,"A03804","SECRETARIA C","P",2,68,43,2,201207,999999,0,0,734.86,35,35,0,20160112]
[null,1,"A03804","SECRETARIA C","P",2,13,43,2,201207,999999,0,0,80,35,35,0,20160112]
[null,1,"A03804","SECRETARIA C","P",2,17,43,2,201207,999999,0,0,315.44,35,35,0,20160112]
[null,1,"T03803","TECNICO MEDIO","P",2,1,47,2,201207,999999,0,0,5731,35,35,0,20160112]
[null,1,"T03803","TECNICO MEDIO","P",2,4,47,2,201207,999999,0,0,175,35,35,0,20160112]
[null,1,"T03803","TECNICO MEDIO","P",2,9,47,2,201207,999999,0,0,365,35,35,0,20160112]
[null,1,"T03803","TECNICO MEDIO","P",2,11,47,2,201207,999999,0,0,365,35,35,0,20160112]
[null,1,"T03803","TECNICO MEDIO","P",2,14,47,2,201207,999999,0,0,335,35,35,0,20160112]
[null,1,"T03803","TECNICO MEDIO","P",2,20,47,2,201207,999999,0,0,1200,35,35,0,20160112]
[null,1,"T03803","TECNICO MEDIO","P",2,50,47,2,201207,999999,0,0,1028.52,35,35,0,20160112]
[null,1,"T03803","TECNICO MEDIO","P",2,63,47,2,201207,999999,0,0,659.06,35,35,0,20160112]
[null,1,"T03803","TECNICO MEDIO","P",2,13,47,2,201207,999999,0,0,60,35,35,0,20160112]
[null,1,"T03803","TECNICO MEDIO","P",2,68,47,2,201207,999999,0,0,734.86,35,35,0,20160112]
[null,1,"A01806","ANALISTA ADMINISTRATIVO","P",2,1,70,3,201207,999999,0,0,5883.94,35,35,0,20160112]
[null,1,"A01806","ANALISTA ADMINISTRATIVO","P",2,4,70,3,201207,999999,0,0,175,35,35,0,20160112]
[null,1,"A01806","ANALISTA ADMINISTRATIVO","P",2,9,70,3,201207,999999,0,0,365,35,35,0,20160112]
[null,1,"A01806","ANALISTA ADMINISTRATIVO","P",2,11,70,3,201207,999999,0,0,365,35,35,0,20160112]
[null,1,"A01806","ANALISTA ADMINISTRATIVO","P",2,14,70,3,201207,999999,0,0,335,35,35,0,20160112]
[null,1,"A01806","ANALISTA ADMINISTRATIVO","P",2,20,70,3,201207,999999,0,0,1200,35,35,0,20160112]
[null,1,"A01806","ANALISTA ADMINISTRATIVO","P",2,50,70,3,201207,999999,0,0,825.28,35,35,0,20160112]
[null,1,"A01806","ANALISTA ADMINISTRATIVO","P",2,63,70,3,201207,999999,0,0,676.66,35,35,0,20160112]
[null,1,"A01806","ANALISTA ADMINISTRATIVO","P",2,13,70,3,201207,999999,0,0,60,35,35,0,20160112]
[null,1,"A01806","ANALISTA ADMINISTRATIVO","P",2,68,70,3,201207,999999,0,0,754.48,35,35,0,20160112]
[null,1,"A01806","ANALISTA ADMINISTRATIVO","P",2,29,70,3,201207,999999,0,0,2000,35,35,0,20160112]
[null,1,"A01806","ANALISTA ADMINISTRATIVO","P",2,2,70,3,201207,999999,0,0,415,35,35,0,20160112]
[null,1,"A01806","ANALISTA ADMINISTRATIVO","P",2,12,70,3,201207,999999,0,0,385,35,35,0,20160112]
[null,1,"CF34810","ANALISTA ADMINISTRATIVO","P",2,1,70,3,201207,999999,0,0,5883.94,35,35,0,20160112]
[null,1,"CF34810","ANALISTA ADMINISTRATIVO","P",2,4,70,3,201207,999999,0,0,175,35,35,0,20160112]
[null,1,"CF34810","ANALISTA ADMINISTRATIVO","P",2,9,70,3,201207,999999,0,0,365,35,35,0,20160112]
[null,1,"CF34810","ANALISTA ADMINISTRATIVO","P",2,11,70,3,201207,999999,0,0,365,35,35,0,20160112]
[null,1,"CF34810","ANALISTA ADMINISTRATIVO","P",2,14,70,3,201207,999999,0,0,335,35,35,0,20160112]
[null,1,"CF34810","ANALISTA ADMINISTRATIVO","P",2,20,70,3,201207,999999,0,0,1200,35,35,0,20160112]
[null,1,"CF34810","ANALISTA ADMINISTRATIVO","P",2,50,70,3,201207,999999,0,0,825.28,35,35,0,20160112]
[null,1,"CF34810","ANALISTA ADMINISTRATIVO","P",2,63,70,3,201207,999999,0,0,676.66,35,35,0,20160112]
[null,1,"CF34810","ANALISTA ADMINISTRATIVO","P",2,13,70,3,201207,999999,0,0,60,35,35,0,20160112]
[null,1,"CF34810","ANALISTA ADMINISTRATIVO","P",2,68,70,3,201207,999999,0,0,754.48,35,35,0,20160112]
[null,1,"CF34810","ANALISTA ADMINISTRATIVO","P",2,29,70,3,201207,999999,0,0,2000,35,35,0,20160112]
[null,1,"CF34810","ANALISTA ADMINISTRATIVO","P",2,2,70,3,201207,999999,0,0,415,35,35,0,20160112]
[null,1,"CF34810","ANALISTA ADMINISTRATIVO","P",2,12,70,3,201207,999999,0,0,385,35,35,0,20160112]
[null,1,"A01807","JEFE DE OFICINA","P",2,1,81,5,201207,999999,0,0,6204.78,35,35,0,20160112]
[null,1,"A01807","JEFE DE OFICINA","P",2,4,81,5,201207,999999,0,0,175,35,35,0,20160112]
[null,1,"A01807","JEFE DE OFICINA","P",2,9,81,5,201207,999999,0,0,365,35,35,0,20160112]
[null,1,"A01807","JEFE DE OFICINA","P",2,11,81,5,201207,999999,0,0,365,35,35,0,20160112]
[null,1,"A01807","JEFE DE OFICINA","P",2,14,81,5,201207,999999,0,0,335,35,35,0,20160112]
[null,1,"A01807","JEFE DE OFICINA","P",2,20,81,5,201207,999999,0,0,1200,35,35,0,20160112]
[null,1,"A01807","JEFE DE OFICINA","P",2,50,81,5,201207,999999,0,0,817.76,35,35,0,20160112]
[null,1,"A01807","JEFE DE OFICINA","P",2,63,81,5,201207,999999,0,0,713.56,35,35,0,20160112]
[null,1,"A01807","JEFE DE OFICINA","P",2,68,81,5,201207,999999,0,0,795.62,35,35,0,20160112]
[null,1,"A01807","JEFE DE OFICINA","P",2,13,81,5,201207,999999,0,0,80,35,35,0,20160112]
[null,1,"A01807","JEFE DE OFICINA","P",2,29,81,5,201207,999999,0,0,2000,35,35,0,20160112]
[null,1,"T03820","TECNICO DOCENTE","P",2,1,82,7,201207,999999,0,0,6418.76,35,35,0,20160112]
[null,1,"T03820","TECNICO DOCENTE","P",2,3,82,7,201207,999999,0,0,1228.76,35,35,0,20160112]
[null,1,"T03820","TECNICO DOCENTE","P",2,4,82,7,201207,999999,0,0,175,35,35,0,20160112]
[null,1,"T03820","TECNICO DOCENTE","P",2,9,82,7,201207,999999,0,0,365,35,35,0,20160112]
[null,1,"T03820","TECNICO DOCENTE","P",2,11,82,7,201207,999999,0,0,365,35,35,0,20160112]
[null,1,"T03820","TECNICO DOCENTE","P",2,14,82,7,201207,999999,0,0,335,35,35,0,20160112]
[null,1,"T03820","TECNICO DOCENTE","P",2,18,82,7,201207,999999,0,0,855.84,35,35,0,20160112]
[null,1,"T03820","TECNICO DOCENTE","P",2,20,82,7,201207,999999,0,0,1200,35,35,0,20160112]
[null,1,"T03820","TECNICO DOCENTE","P",2,50,82,7,201207,999999,0,0,787.82,35,35,0,20160112]
[null,1,"T03820","TECNICO DOCENTE","P",2,63,82,7,201207,999999,0,0,738.16,35,35,0,20160112]
[null,1,"T03820","TECNICO DOCENTE","P",2,68,82,7,201207,999999,0,0,823.04,35,35,0,20160112]
[null,1,"T03820","TECNICO DOCENTE","P",2,13,82,7,201207,999999,0,0,80,35,35,0,20160112]
[null,1,"T03820","TECNICO DOCENTE","P",2,70,82,7,201207,999999,0,0,1283.76,35,35,0,20160112]
[null,1,"T03820","TECNICO DOCENTE","P",2,92,82,7,201207,999999,0,0,5135,35,35,0,20160112]
[null,1,"T03820","TECNICO DOCENTE","P",2,29,82,7,201207,999999,0,0,2000,35,35,0,20160112]
[null,1,"T03820","TECNICO DOCENTE","P",2,17,82,7,201207,999999,0,0,315.44,35,35,0,20160112]
[null,1,"T03823","TECNICO SUPERIOR","P",2,1,85,7,201207,999999,0,0,6418.76,35,35,0,20160112]
[null,1,"T03823","TECNICO SUPERIOR","P",2,3,85,7,201207,999999,0,0,1228.76,35,35,0,20160112]
[null,1,"T03823","TECNICO SUPERIOR","P",2,4,85,7,201207,999999,0,0,175,35,35,0,20160112]
[null,1,"T03823","TECNICO SUPERIOR","P",2,9,85,7,201207,999999,0,0,365,35,35,0,20160112]
[null,1,"T03823","TECNICO SUPERIOR","P",2,11,85,7,201207,999999,0,0,365,35,35,0,20160112]
[null,1,"T03823","TECNICO SUPERIOR","P",2,14,85,7,201207,999999,0,0,335,35,35,0,20160112]
[null,1,"T03823","TECNICO SUPERIOR","P",2,20,85,7,201207,999999,0,0,1200,35,35,0,20160112]
[null,1,"T03823","TECNICO SUPERIOR","P",2,50,85,7,201207,999999,0,0,916.2,35,35,0,20160112]
[null,1,"T03823","TECNICO SUPERIOR","P",2,63,85,7,201207,999999,0,0,738.16,35,35,0,20160112]
[null,1,"T03823","TECNICO SUPERIOR","P",2,68,85,7,201207,999999,0,0,823.04,35,35,0,20160112]
[null,1,"CF33849","COORD. DE SERVICIOS ESP.","P",2,1,88,8,201207,999999,0,0,6495.06,35,35,0,20160112]
[null,1,"CF33849","COORD. DE SERVICIOS ESP.","P",2,2,88,8,201207,999999,0,0,415,35,35,0,20160112]
[null,1,"CF33849","COORD. DE SERVICIOS ESP.","P",2,3,88,8,201207,999999,0,0,1737.16,35,35,0,20160112]
[null,1,"CF33849","COORD. DE SERVICIOS ESP.","P",2,9,88,8,201207,999999,0,0,465,35,35,0,20160112]
[null,1,"CF33849","COORD. DE SERVICIOS ESP.","P",2,12,88,8,201207,999999,0,0,385,35,35,0,20160112]
[null,1,"CF33849","COORD. DE SERVICIOS ESP.","P",2,20,88,8,201207,999999,0,0,1300,35,35,0,20160112]
[null,1,"CF33849","COORD. DE SERVICIOS ESP.","P",2,106,88,8,201207,999999,0,0,100,35,35,0,20160112]
[null,1,"CF36014","COORDINADOR DE ZONA","P",5,1,"OA1",92,201207,999999,0,0,4190.88,40,40,0,20160112]
[null,1,"CF36014","COORDINADOR DE ZONA","P",5,8,"OA1",92,201207,999999,0,0,17962.400000000001,40,40,0,20160112]
[null,1,"CF36014","COORDINADOR DE ZONA","P",5,9,"OA1",92,201207,999999,0,0,365,40,40,0,20160112]
[null,1,"CF36014","COORDINADOR DE ZONA","P",5,106,"OA1",92,201207,999999,0,0,175,40,40,0,20160112]
[null,1,"CF36014","COORDINADOR DE ZONA","P",5,1,"OA1",92,201207,999999,0,0,4328.8599999999997,40,40,0,20160112]
[null,1,"CF36014","COORDINADOR DE ZONA","P",5,8,"OA1",92,201207,999999,0,0,17824.46,40,40,0,20160112]
[null,1,"CF36014","COORDINADOR DE ZONA","P",5,9,"OA1",92,201207,999999,0,0,365,40,40,0,20160112]
[null,1,"CF36014","COORDINADOR DE ZONA","P",5,106,"OA1",92,201207,999999,0,0,125,40,40,0,20160112]
[null,1,"CF36014","COORDINADOR DE ZONA","P",5,1,"OA1",92,201207,999999,0,0,4190.88,40,40,0,20160112]
[null,1,"CF36014","COORDINADOR DE ZONA","P",5,8,"OA1",92,201207,999999,0,0,17962.400000000001,40,40,0,20160112]
[null,1,"CF36014","COORDINADOR DE ZONA","P",5,9,"OA1",92,201207,999999,0,0,365,40,40,0,20160112]
[null,1,"CF36014","COORDINADOR DE ZONA","P",5,106,"OA1",92,201207,999999,0,0,225,40,40,0,20160112]
[null,1,"CF36014","COORDINADOR DE ZONA","P",5,1,"OA1",92,201207,999999,0,0,4190.88,40,40,0,20160112]
[null,1,"CF36014","COORDINADOR DE ZONA","P",5,8,"OA1",92,201207,999999,0,0,17962.400000000001,40,40,0,20160112]
[null,1,"CF36014","COORDINADOR DE ZONA","P",5,9,"OA1",92,201207,999999,0,0,365,40,40,0,20160112]
[null,1,"CF36014","COORDINADOR DE ZONA","P",5,106,"OA1",92,201207,999999,0,0,225,40,40,0,20160112]
[null,1,"CF36014","COORDINADOR DE ZONA","P",5,1,"OA1",92,201207,999999,0,0,4328.8599999999997,40,40,0,20160112]
[null,1,"CF36014","COORDINADOR DE ZONA","P",5,8,"OA1",92,201207,999999,0,0,17824.46,40,40,0,20160112]
[null,1,"CF36014","COORDINADOR DE ZONA","P",5,9,"OA1",92,201207,999999,0,0,365,40,40,0,20160112]
[null,1,"CF36014","COORDINADOR DE ZONA","P",5,1,"OA1",92,201207,999999,0,0,4190.88,40,40,0,20160112]
[null,1,"CF36014","COORDINADOR DE ZONA","P",5,8,"OA1",92,201207,999999,0,0,16764.900000000001,40,40,0,20160112]
[null,1,"CF36014","COORDINADOR DE ZONA","P",5,9,"OA1",92,201207,999999,0,0,365,40,40,0,20160112]
[null,1,"CF36014","COORDINADOR DE ZONA","P",5,106,"OA1",92,201207,999999,0,0,100,40,40,0,20160112]
[null,1,"CF36014","COORDINADOR DE ZONA","P",5,1,"OA1",92,201207,999999,0,0,4190.88,40,40,0,20160112]
[null,1,"CF36014","COORDINADOR DE ZONA","P",5,8,"OA1",92,201207,999999,0,0,17962.400000000001,40,40,0,20160112]
[null,1,"CF36014","COORDINADOR DE ZONA","P",5,9,"OA1",92,201207,999999,0,0,365,40,40,0,20160112]
[null,1,"CF36014","COORDINADOR DE ZONA","P",5,1,"OA1",92,201207,999999,0,0,4190.88,40,40,0,20160112]
[null,1,"CF36014","COORDINADOR DE ZONA","P",5,8,"OA1",92,201207,999999,0,0,17962.400000000001,40,40,0,20160112]
[null,1,"CF36014","COORDINADOR DE ZONA","P",5,9,"OA1",92,201207,999999,0,0,365,40,40,0,20160112]
[null,1,"CF36014","COORDINADOR DE ZONA","P",5,1,"OA1",92,201207,999999,0,0,4190.88,40,40,0,20160112]
[null,1,"CF36014","COORDINADOR DE ZONA","P",5,8,"OA1",92,201207,999999,0,0,17962.400000000001,40,40,0,20160112]
[null,1,"CF36014","COORDINADOR DE ZONA","P",5,9,"OA1",92,201207,999999,0,0,365,40,40,0,20160112]
[null,1,"CF36014","COORDINADOR DE ZONA","P",5,1,"OA1",92,201207,999999,0,0,4190.88,40,40,0,20160112]
[null,1,"CF36014","COORDINADOR DE ZONA","P",5,8,"OA1",92,201207,999999,0,0,17962.400000000001,40,40,0,20160112]
[null,1,"CF36014","COORDINADOR DE ZONA","P",5,9,"OA1",92,201207,999999,0,0,365,40,40,0,20160112]
[null,1,"CF36014","COORDINADOR DE ZONA","P",5,1,"OA1",92,201207,999999,0,0,4190.88,40,40,0,20160112]
[null,1,"CF36014","COORDINADOR DE ZONA","P",5,8,"OA1",92,201207,999999,0,0,17962.400000000001,40,40,0,20160112]
[null,1,"CF36014","COORDINADOR DE ZONA","P",5,9,"OA1",92,201207,999999,0,0,365,40,40,0,20160112]
[null,1,"CF36014","COORDINADOR DE ZONA","P",5,1,"OA1",92,201207,999999,0,0,4328.8599999999997,40,40,0,20160112]
[null,1,"CF36014","COORDINADOR DE ZONA","P",5,8,"OA1",92,201207,999999,0,0,17824.46,40,40,0,20160112]
[null,1,"CF36014","COORDINADOR DE ZONA","P",5,9,"OA1",92,201207,999999,0,0,365,40,40,0,20160112]
[null,1,"CF36014","COORDINADOR DE ZONA","P",5,1,"OA1",92,201207,999999,0,0,4190.88,40,40,0,20160112]
[null,1,"CF36014","COORDINADOR DE ZONA","P",5,8,"OA1",92,201207,999999,0,0,17962.400000000001,40,40,0,20160112]
[null,1,"CF36014","COORDINADOR DE ZONA","P",5,9,"OA1",92,201207,999999,0,0,365,40,40,0,20160112]
[null,1,"CF01059","JEFE DE DEPARTAMENTO","P",5,1,"OA1",93,201207,999999,0,0,5164.5200000000004,40,40,0,20160112]
[null,1,"CF01059","JEFE DE DEPARTAMENTO","P",5,8,"OA1",93,201207,999999,0,0,20090.240000000002,40,40,0,20160112]
[null,1,"CF01059","JEFE DE DEPARTAMENTO","P",5,9,"OA1",93,201207,999999,0,0,365,40,40,0,20160112]
[null,1,"CF01059","JEFE DE DEPARTAMENTO","P",5,1,"OA1",93,201207,999999,0,0,5164.5200000000004,40,40,0,20160112]
[null,1,"CF01059","JEFE DE DEPARTAMENTO","P",5,8,"OA1",93,201207,999999,0,0,20090.240000000002,40,40,0,20160112]
[null,1,"CF01059","JEFE DE DEPARTAMENTO","P",5,9,"OA1",93,201207,999999,0,0,365,40,40,0,20160112]
[null,1,"CF01059","JEFE DE DEPARTAMENTO","P",5,1,"OA1",93,201207,999999,0,0,5164.5200000000004,40,40,0,20160112]
[null,1,"CF01059","JEFE DE DEPARTAMENTO","P",5,8,"OA1",93,201207,999999,0,0,20090.240000000002,40,40,0,20160112]
[null,1,"CF01059","JEFE DE DEPARTAMENTO","P",5,9,"OA1",93,201207,999999,0,0,365,40,40,0,20160112]
[null,1,"CF01059","JEFE DE DEPARTAMENTO","P",5,1,"OA1",93,201207,999999,0,0,5164.5200000000004,40,40,0,20160112]
[null,1,"CF01059","JEFE DE DEPARTAMENTO","P",5,8,"OA1",93,201207,999999,0,0,20090.240000000002,40,40,0,20160112]
[null,1,"CF01059","JEFE DE DEPARTAMENTO","P",5,9,"OA1",93,201207,999999,0,0,365,40,40,0,20160112]
[null,1,"CF01059","JEFE DE DEPARTAMENTO","P",5,1,"OA1",93,201207,999999,0,0,5164.5200000000004,40,40,0,20160112]
[null,1,"CF01059","JEFE DE DEPARTAMENTO","P",5,8,"OA1",93,201207,999999,0,0,20090.240000000002,40,40,0,20160112]
[null,1,"CF01059","JEFE DE DEPARTAMENTO","P",5,9,"OA1",93,201207,999999,0,0,365,40,40,0,20160112]
[null,1,"CF36014","COORDINADOR REGIONAL","P",5,1,"OA1",95,201207,999999,0,0,5164.5200000000004,40,40,0,20160112]
[null,1,"CF36014","COORDINADOR REGIONAL","P",5,8,"OA1",95,201207,999999,0,0,23499.64,40,40,0,20160112]
[null,1,"CF36014","COORDINADOR REGIONAL","P",5,9,"OA1",95,201207,999999,0,0,365,40,40,0,20160112]
[null,1,"CF14070","DELEGADO","P",5,1,"MB2",97,201207,999999,0,0,14611.06,40,40,0,20160112]
[null,1,"CF14070","DELEGADO","P",5,8,"MB2",97,201207,999999,0,0,64194.38,40,40,0,20160112]
[null,1,"CF14070","DELEGADO","P",5,9,"MB2",97,201207,999999,0,0,365,40,40,0,20160112]
[null,null,null,null,null,null,null,null,null,null,"Total Zona A:",{"$f":"SUBTOTAL(109,Tabla16[Monto Mensual Jornada ó de HSM\nZona A])","v":0}]
[null,null,null,null,null,null,null,null,null,null,null,"Total Zona B:",{"$f":"SUM(M19:M210)","v":0}]
[null,null,null,null,null,null,null,null,null,null,null,null,"Total Zona C:",{"$f":"SUM(N19:N211)","v":681083.46000000031}]
[]
[null,"Fuente : Información proporcionada por las Entidades Federativas"]

{"sheet":"II D) 7 3","index":12,"n_rows":236,"n_cols":11,"rows_kept":236,"cut":false,"hidden":false,"merged":[[9,1,9,7],[8,9,8,10]]}
[]
[]
[]
[]
[]
[]
[]
[]
[null,"Formato: Catálogo de Percepciones y Deducciones",null,null,null,null,null,null,"Entidad Federativa:",{"$f":"IF('Caratula Resumen'!D21=\"Elige el Periodo…\",\"\",'Caratula Resumen'!D21)","v":" GUANAJUATO "}]
[null,{"$f":"IF('Caratula Resumen'!D22=\"Elige el Periodo…\",\"\",'Caratula Resumen'!D22)","v":"Fondo de Aportaciones para la Educación Tecnológica y de Adultos/Instituto Nacional para la Educación de los Adultos (FAETA/INEA)"},null,null,null,null,null,null,null,null,{"$f":"IF('Caratula Resumen'!D23=\"Elige el Periodo…\",\"\",'Caratula Resumen'!D23)","v":"4to. Trimestre"}]
[]
[]
[null,"Identificador origen presupuestal de la plaza","Tipo de concepto de pago ","Origen de financiamiento del concepto de percepciones.","Porcentaje de participación federal por fuente de recursos","Grupo al que pertenece concepto de pago (Percepción y/o Deducción)","Clave de concepto de pago","Descripción del concepto de pago ","Partida presupuestal","Fecha del","Fecha  al"]
[]
[null,"Identificador origen presupuestal de la plaza","Tipo de concepto de pago ","Origen de financiamiento del concepto de percepciones.","Porcentaje de participación federal por fuente de recursos","Grupo al que pertenece concepto de pago (Percepción y/o Deducción)","Clave de concepto de pago","Descripción del concepto de pago ","Partida presupuestal","Fecha del","Fecha  al"]
[null,1,"P","F",100,"P2",1,"SUELDOS",83101,20160012,20160012]
[null,1,"P","F",100,"P2",2,"PREVISION SOCIAL MUL.CONF",83101,20160012,20160012]
[null,1,"P","F",100,"P2",3,"COMPENSACION GARANTIZADA",83101,20160012,20160012]
[null,1,"P","F",100,"P2",4,"COMP. POR ANTI.(QUINQ. B)",83101,20160012,20160012]
[null,1,"P","F",100,"P2",5,"PRIMA VACACIONAL",83101,20160012,20160012]
[null,1,"P","F",100,"P2",6,"AGUINALDO",83101,20160012,20160012]
[null,1,"P","F",100,"P2",7,"COMPENSACION SEDENA",83101,20160012,20160012]
[null,1,"P","F",100,"P2",8,"COMPENSACION GARANT.",83101,20160012,20160012]
[null,1,"P","F",100,"P2",9,"DESPENSA",83101,20160012,20160012]
[null,1,"P","F",100,"P2",10,"OTRAS PRESTACIONES",83101,20160012,20160012]
[null,1,"P","F",100,"P2",11,"PREVISION SOCIAL MULTIPLE",83101,20160012,20160012]
[null,1,"P","F",100,"P2",12,"AYUDA PARA SERVICIOS",83101,20160012,20160012]
[null,1,"P","F",100,"P2",13,"BECAS",83101,20160012,20160012]
[null,1,"P","F",100,"P2",14,"AYUDA PARA SERVICIOS B",83101,20160012,20160012]
[null,1,"P","F",100,"P2",15,"DIAS DE PUNTUALIDAD",83101,20160012,20160012]
[null,1,"P","F",100,"P2",16,"HORARIO DISCONTINUO",83101,20160012,20160012]
[null,1,"P","F",100,"P2",17,"AYUDA DE GUARDERIA",83101,20160012,20160012]
[null,1,"P","F",100,"P2",18,"DIAS ECONOMICOS",83101,20160012,20160012]
[null,1,"P","F",100,"P2",19,"CREDITO AL SALARIO",83101,20160012,20160012]
[null,1,"P","F",100,"P2",20,"CAPACITACION Y DESARROLLO",83101,20160012,20160012]
[null,1,"P","F",100,"P2",21,"AYUDA PARA ANTEOJOS",83101,20160012,20160012]
[null,1,"P","F",100,"P2",22,"CREDITO SALARIO ANUAL",83101,20160012,20160012]
[null,1,"P","F",100,"P2",23,"SALARIO RETROACTIVO",83101,20160012,20160012]
[null,1,"P","F",100,"P2",24,"HOMOLOGACION",83101,20160012,20160012]
[null,1,"P","F",100,"P2",25,"CANASTA MATERNAL",83101,20160012,20160012]
[null,1,"P","F",100,"P2",26,"REMANENTE ESTIMULO",83101,20160012,20160012]
[null,1,"P","F",100,"P2",27,"COMPENSACION",83101,20160012,20160012]
[null,1,"P","F",100,"P2",28,"DEVOLUCION FONAC",83101,20160012,20160012]
[null,1,"P","F",100,"P2",29,"AYUDA PARA ANTEOJOS",83101,20160012,20160012]
[null,1,"P","F",100,"P2",30,"PARTE EXCENTA AGUINALDO",83101,20160012,20160012]
[null,1,"P","F",100,"P2",31,"PARTE EXCENTA PRIMA VAC.",83101,20160012,20160012]
[null,1,"P","F",100,"P2",32,"RECOMPENSA",83101,20160012,20160012]
[null,1,"P","F",100,"P2",33,"AYUDA POR DEFUNCION",83101,20160012,20160012]
[null,1,"P","F",100,"P2",34,"HORAS EXTRAORDINARIAS",83101,20160012,20160012]
[null,1,"P","F",100,"P2",35,"CAPACITACION Y DESARROLLO",83101,20160012,20160012]
[null,1,"P","F",100,"P2",36,"DEVOLUCION CREDINOMINA",83101,20160012,20160012]
[null,1,"P","F",100,"P2",37,"DEVOLUCION I.S.R.",83101,20160012,20160012]
[null,1,"P","F",100,"P2",38,"HORAS EXT. EXCENTAS",83101,20160012,20160012]
[null,1,"P","F",100,"P2",39,"DESPENSA MANDOS MEDIOS",83101,20160012,20160012]
[null,1,"P","F",100,"P2",40,"DIF.PROFES. B1 2004",83101,20160012,20160012]
[null,1,"P","F",100,"P2",41,"DIF.PROFES.B2 2004",83101,20160012,20160012]
[null,1,"P","F",100,"P2",42,"DIF.PROFES. C 2004",83101,20160012,20160012]
[null,1,"P","F",100,"P2",43,"DIF.COMP. POR ANTIGUEDAD",83101,20160012,20160012]
[null,1,"P","F",100,"P2",44,"DIF.PROFES. B1 2005",83101,20160012,20160012]
[null,1,"P","F",100,"P2",45,"DEVOLUCION DESPENSA",83101,20160012,20160012]
[null,1,"P","F",100,"P2",46,"DIF.PROFES. B2 2005",83101,20160012,20160012]
[null,1,"P","F",100,"P2",47,"DIF.PROFES. C 2005",83101,20160012,20160012]
[null,1,"P","F",100,"P2",48,"DIF.PROFES. C 2007",83101,20160012,20160012]
[null,1,"P","F",100,"P2",49,"DIF.PRI.ANT.07",83101,20160012,20160012]
[null,1,"P","F",100,"P2",50,"COMPENSACION POR ANTIGUED",83101,20160012,20160012]
[null,1,"P","F",100,"P2",51,"APARATOS ORTOPEDICOS",83101,20160012,20160012]
[null,1,"P","F",100,"P2",52,"AYUDA TITULACION",83101,20160012,20160012]
[null,1,"P","F",100,"P2",53,"RETROACTIVO QUINQUENIO",83101,20160012,20160012]
[null,1,"P","F",100,"P2",54,"APARATOS ORTOPEDICOS",83101,20160012,20160012]
[null,1,"P","F",100,"P2",55,"AYUDA TITULACION",83101,20160012,20160012]
[null,1,"P","F",100,"P2",56,"DIF.PRF.B107",83101,20160012,20160012]
[null,1,"P","F",100,"P2",57,"DIF.PER.SOC.MUL.07",83101,20160012,20160012]
[null,1,"P","F",100,"P2",58,"DIF. DIAS ECONOMICOS",83101,20160012,20160012]
[null,1,"P","F",100,"P2",59,"AGUINALDO EXCENTO",83101,20160012,20160012]
[null,1,"P","F",100,"P2",60,"GRATIFICACIﾓN POR RENUNCI",83101,20160012,20160012]
[null,1,"P","F",100,"P2",61,"PRIMA L.F.T.",83101,20160012,20160012]
[null,1,"P","F",100,"P2",62,"10, 15 Y 20 AﾑOS",83101,20160012,20160012]
[null,1,"P","F",100,"P2",63,"PROFESIONALIZACION B",83101,20160012,20160012]
[null,1,"P","F",100,"P2",64,"DIFERENCIA PENSION ALIMEN",83101,20160012,20160012]
[null,1,"P","F",100,"P2",65,"PROFESIONALIZACION  B2",83101,20160012,20160012]
[null,1,"P","F",100,"P2",66,"COMP.C.C.T.10,15 Y20 AﾑOS",83101,20160012,20160012]
[null,1,"P","F",100,"P2",67,"AYUDA DEFUNCION",83101,20160012,20160012]
[null,1,"P","F",100,"P2",68,"PROFESIONALIZACION C",83101,20160012,20160012]
[null,1,"P","F",100,"P2",69,"RETRO. PROF B 2008",83101,20160012,20160012]
[null,1,"P","F",100,"P2",70,"ESTIMULO PRODUCTIVIDAD",83101,20160012,20160012]
[null,1,"P","F",100,"P2",71,"VIATICOS",83101,20160012,20160012]
[null,1,"P","F",100,"P2",72,"DEVOLUCION PRES C.P.",83101,20160012,20160012]
[null,1,"P","F",100,"P2",73,"DEVOLUCION SEG. COL. RET",83101,20160012,20160012]
[null,1,"P","F",100,"P2",74,"DEVOLUCION SEG. SEG AHISA",83101,20160012,20160012]
[null,1,"P","F",100,"P2",75,"RETRO. PROF C 2008",83101,20160012,20160012]
[null,1,"P","F",100,"P2",76,"RETRO. CAP Y DES CONF",83101,20160012,20160012]
[null,1,"P","F",100,"P2",77,"RETRO. PRE. SOC. MUL. CF",83101,20160012,20160012]
[null,1,"P","F",100,"P2",78,"PRMA VAC. DIA ADICIONAL",83101,20160012,20160012]
[null,1,"P","F",100,"P2",79,"DIF.COMP.POR ANTI. 2008",83101,20160012,20160012]
[null,1,"P","F",100,"P2",80,"CUOTA SINDICAL FONAC",83101,20160012,20160012]
[null,1,"P","F",100,"P2",81,"DIF.COMP. POR ANT. 2009",83101,20160012,20160012]
[null,1,"P","F",100,"P2",82,"DIF. PROFB2. 2008",83101,20160012,20160012]
[null,1,"P","F",100,"P2",83,"DIAS POR AJUSTE ANUAL",83101,20160012,20160012]
[null,1,"P","F",100,"P2",84,"DEVOL.  ADEUDO POR PRESTA",83101,20160012,20160012]
[null,1,"P","F",100,"P2",85,"RETRO. CAN. ADIC. CONFIAN",83101,20160012,20160012]
[null,1,"P","F",100,"P2",86,"RETROACTIVO PROFB1 2009",83101,20160012,20160012]
[null,1,"P","F",100,"P2",87,"RETROACTIVO PROF.C 2009",83101,20160012,20160012]
[null,1,"P","F",100,"P2",88,"RETRO. C Y D 2008",83101,20160012,20160012]
[null,1,"P","F",100,"P2",89,"RETRO. C.ADIC 2008",83101,20160012,20160012]
[null,1,"P","F",100,"P2",90,"IMPUESTO ANUAL",83101,20160012,20160012]
[null,1,"P","F",100,"P2",91,"CANTIDAD POR UNICA VEZ",83101,20160012,20160012]
[null,1,"P","F",100,"P2",92,"PUNTUALIDAD PERFECTA",83101,20160012,20160012]
[null,1,"P","F",100,"P2",93,"RETRO. PSM 2008",83101,20160012,20160012]
[null,1,"P","F",100,"P2",94,"RETRO. DESP 2008",83101,20160012,20160012]
[null,1,"P","F",100,"P2",95,"DEVOLUCION POTECIACION",83101,20160012,20160012]
[null,1,"P","F",100,"P2",96,"DIF.PROFES. B1 2009",83101,20160012,20160012]
[null,1,"P","F",100,"P2",97,"DIF.PROFES. C 2009",83101,20160012,20160012]
[null,1,"P","F",100,"P2",98,"RETROACTIVO PROFB1",83101,20160012,20160012]
[null,1,"P","F",100,"P2",99,"RETROACTIVO PROFC",83101,20160012,20160012]
[null,1,"P","F",100,"P2",100,"PAGO EX. UNICO FSTSE-SHCP",83101,20160012,20160012]
[null,1,"P","F",100,"P2",101,"VALES DE DESPENSA",83101,20160012,20160012]
[null,1,"P","F",100,"P2",102,"VALES PRODUCTIVIDAD",83101,20160012,20160012]
[null,1,"P","F",100,"P2",103,"VALES BONO SEXENAL",83101,20160012,20160012]
[null,1,"P","F",100,"P2",104,"DEV. DIAS ECONOMINCOS",83101,20160012,20160012]
[null,1,"P","F",100,"P2",105,"PRIMA VACACIONAL MM",83101,20160012,20160012]
[null,1,"P","F",100,"P2",106,"QUINQUENIO C Y MM",83101,20160012,20160012]
[null,1,"P","F",100,"P2",107,"AJUSTE POR FALTAS",83101,20160012,20160012]
[null,1,"P","F",100,"P2",108,"RETROACTIVO QUINC Y MM",83101,20160012,20160012]
[null,1,"P","F",100,"P2",109,"LIQUIDACIONES",83101,20160012,20160012]
[null,1,"P","F",100,"P2",110,"DEVOLUCION AHORRO SOLIDAR",83101,20160012,20160012]
[null,1,"P","F",100,"P2",119,"SUBSIDIO PARA EL EMPLEO",83101,20160012,20160012]
[null,1,"P","F",100,"P2",120,"DIF.COM.GARN.2010 MM",83101,20160012,20160012]
[null,1,"P","F",100,"P2",121,"COMP.LENTES 2010 EXC",83101,20160012,20160012]
[null,1,"P","F",100,"P2",122,"COMP.LENTES 2010 GRAV",83101,20160012,20160012]
[null,1,"P","F",100,"P2",123,"DIFERENCIA DESPENSA 2010",83101,20160012,20160012]
[null,1,"P","F",100,"P2",124,"DIF PREV. SOLCIAL 2010",83101,20160012,20160012]
[null,1,"P","F",100,"P2",125,"DIF CANTIDAD ADIC. 2010",83101,20160012,20160012]
[null,1,"P","F",100,"P2",126,"DIF CANTIDAD ADIC. 2009",83101,20160012,20160012]
[null,1,"P","F",100,"P2",127,"DIF PREV. SOCIAL",83101,20160012,20160012]
[null,1,"P","F",100,"P2",128,"DIA DEL TRABAJOR DEL INEA",83101,20160012,20160012]
[null,1,"P","F",100,"P2",130,"VACACIONES",83101,20160012,20160012]
[null,1,"P","F",100,"P2",206,"AGUINALDO COMP.",83101,20160012,20160012]
[null,1,"P","F",100,"P2",400,"DIF. AYUDA POR SERV. B",83101,20160012,20160012]
[null,1,"P","F",100,"P2",401,"DIFERENCIA DE SUELDO",83101,20160012,20160012]
[null,1,"P","F",100,"P2",402,"DIV.ABRIL2005MAYO2006 POT",83101,20160012,20160012]
[null,1,"P","F",100,"P2",403,"DIF. COMPENSACION GARANTI",83101,20160012,20160012]
[null,1,"P","F",100,"P2",404,"DIVIDENDOS POTEN 2007",83101,20160012,20160012]
[null,1,"P","F",100,"P2",405,"DIF. PRIMA VACACIONAL",83101,20160012,20160012]
[null,1,"P","F",100,"P2",408,"DIF.COMP. GARANT.",83101,20160012,20160012]
[null,1,"P","F",100,"P2",409,"DIF DESPENSA",83101,20160012,20160012]
[null,1,"P","F",100,"P2",414,"DIF AYUDA SERVICIOS",83101,20160012,20160012]
[null,1,"P","F",100,"P2",415,"DIF. DIAS DE PUNTUALIDAD",83101,20160012,20160012]
[null,1,"P","F",100,"P2",418,"DIF. DIAS ECONOMICOS",83101,20160012,20160012]
[null,1,"P","F",100,"P2",420,"DIF CAPACITACION Y DESARR",83101,20160012,20160012]
[null,1,"P","F",100,"P2",450,"DIF COMP. POR ANTIG.",83101,20160012,20160012]
[null,1,"P","F",100,"P2",455,"DEVOLUCION FALTA",83101,20160012,20160012]
[null,1,"P","F",100,"P2",463,"RETROAC. PROFESIONALIZA",83101,20160012,20160012]
[null,1,"P","F",100,"P2",464,"DIF. PROF B1",83101,20160012,20160012]
[null,1,"P","F",100,"P2",466,"CONTINGENCIA LABORAL",83101,20160012,20160012]
[null,1,"P","F",100,"P2",467,"DEV. POR AYUDA EN DEFUNC",83101,20160012,20160012]
[null,1,"D",null,100,"D2",500,"SUSPENSIONES",83101,20160012,20160012]
[null,1,"D",null,100,"D2",501,"FALTAS",83101,20160012,20160012]
[null,1,"D",null,100,"D2",502,"COMPENSACION GARANT.",83101,20160012,20160012]
[null,1,"D",null,100,"D2",503,"HORARIO DISCONTINUO",83101,20160012,20160012]
[null,1,"D",null,100,"D2",504,"DONATIVOS",83101,20160012,20160012]
[null,1,"D",null,100,"D2",505,"CUOTA SINDICAL RETIRO",83101,20160012,20160012]
[null,1,"D",null,100,"D2",506,"AHORRO SOLIDARIO",83101,20160012,20160012]
[null,1,"D",null,100,"D2",507,"DEV. PREST. CAJA DE AHORR",83101,20160012,20160012]
[null,1,"D",null,100,"D2",508,"DEV. GUARDERIA",83101,20160012,20160012]
[null,1,"D",null,100,"D2",518,"DEV. DIAS ECONOMICOS",83101,20160012,20160012]
[null,1,"D",null,100,"D2",519,"DEV. QUINQUENIOS",83101,20160012,20160012]
[null,1,"D",null,100,"D2",520,"DEV. PRIM VAC",83101,20160012,20160012]
[null,1,"D",null,100,"D2",521,"DEV. DESPENSA",83101,20160012,20160012]
[null,1,"D",null,100,"D2",522,"DEV. AYUDA OARA SERV. B",83101,20160012,20160012]
[null,1,"D",null,100,"D2",529,"CREDITO DINAMO",83101,20160012,20160012]
[null,1,"D",null,100,"D2",530,"ISR",83101,20160012,20160012]
[null,1,"D",null,100,"D2",531,"DIFERENCIA ISR",83101,20160012,20160012]
[null,1,"D",null,100,"D2",532,"IMPUESTO ANUAL",83101,20160012,20160012]
[null,1,"D",null,100,"D2",533,"I.S.R.ESTIMULO 10 15 Y 20",83101,20160012,20160012]
[null,1,"D",null,100,"D2",534,"AJUSTE ESTIMULO 10 AﾑOS",83101,20160012,20160012]
[null,1,"D",null,100,"D2",535,"IMPUESTO AGUINALDO",83101,20160012,20160012]
[null,1,"D",null,100,"D2",536,"AJUSTE BONIFICACION",83101,20160012,20160012]
[null,1,"D",null,100,"D2",537,"CREDITO SALARIO ANUAL",83101,20160012,20160012]
[null,1,"D",null,100,"D2",538,"DEVOLUCION PUNTUALIDAD",83101,20160012,20160012]
[null,1,"D",null,100,"D2",539,"GASTOS FUNERARIOS",83101,20160012,20160012]
[null,1,"D",null,100,"D2",540,"SERV.MED/MAT.ISSSTE",83101,20160012,20160012]
[null,1,"D",null,100,"D2",541,"FONDO/PENSION ISSSTE",83101,20160012,20160012]
[null,1,"D",null,100,"D2",542,"PRESTAMO C.P. ISSSTE",83101,20160012,20160012]
[null,1,"D",null,100,"D2",543,"PRESTAMO COMPLEM. ISSSTE",83101,20160012,20160012]
[null,1,"D",null,100,"D2",544,"PRES. HIP. FOVISSSTE",83101,20160012,20160012]
[null,1,"D",null,100,"D2",545,"DIF. 8% ISSSTE",83101,20160012,20160012]
[null,1,"D",null,100,"D2",546,"DEVOLUCIONES VARIAS",83101,20160012,20160012]
[null,1,"D",null,100,"D2",547,"DEVOLUCION VIATICOS",83101,20160012,20160012]
[null,1,"D",null,100,"D2",548,"AYUDA CRUZ ROJA",83101,20160012,20160012]
[null,1,"D",null,100,"D2",549,"ADEUDO POR PRESTAMO",83101,20160012,20160012]
[null,1,"D",null,100,"D2",550,"CUOTA SINDICAL",83101,20160012,20160012]
[null,1,"D",null,100,"D2",551,"PENSION ALIMENTICIA",83101,20160012,20160012]
[null,1,"D",null,100,"D2",552,"DIFERENCIA ANTEOJOS",83101,20160012,20160012]
[null,1,"D",null,100,"D2",553,"DEVOLUCION ANTEOJOS",83101,20160012,20160012]
[null,1,"D",null,100,"D2",554,"DIF PENSION ALIMENTICIA",83101,20160012,20160012]
[null,1,"D",null,100,"D2",555,"DEV.CAN.ADIC.2010 T.S.T.D",83101,20160012,20160012]
[null,1,"D",null,100,"D2",556,"GTOS. FUNER. SAN RAFAEL",83101,20160012,20160012]
[null,1,"D",null,100,"D2",558,"AJUSTE POR AYUDA DE LENTE",83101,20160012,20160012]
[null,1,"D",null,100,"D2",560,"MULTISEGURO",83101,20160012,20160012]
[null,1,"D",null,100,"D2",561,"GPO.SEG. DIVERSOS",83101,20160012,20160012]
[null,1,"D",null,100,"D2",562,"SEG. VIDA IND AHISA",83101,20160012,20160012]
[null,1,"D",null,100,"D2",563,"SEGURO COL. DE RETIRO",83101,20160012,20160012]
[null,1,"D",null,100,"D2",564,"POT. SEGURO DE VIDA",83101,20160012,20160012]
[null,1,"D",null,100,"D2",565,"DEV. SEGURO CAP.",83101,20160012,20160012]
[null,1,"D",null,100,"D2",566,"CAJA DE AHORRO",83101,20160012,20160012]
[null,1,"D",null,100,"D2",567,"PRESTAMO CAJA DE AHORRO",83101,20160012,20160012]
[null,1,"D",null,100,"D2",569,"DEVOLUCION FONAC",83101,20160012,20160012]
[null,1,"D",null,100,"D2",570,"ANTICIPO DE SUELDO",83101,20160012,20160012]
[null,1,"D",null,100,"D2",571,"FONDO DE AHORRO CAP.",83101,20160012,20160012]
[null,1,"D",null,100,"D2",572,"CAJA DE AHORRO CUOTA",83101,20160012,20160012]
[null,1,"D",null,100,"D2",573,"PRESTAMO CAJA AHORROS",83101,20160012,20160012]
[null,1,"D",null,100,"D2",574,"FONACOT",83101,20160012,20160012]
[null,1,"D",null,100,"D2",575,"PAQUETE DEPORTIVO",83101,20160012,20160012]
[null,1,"D",null,100,"D2",576,"ANTICIPO ESTIMULO M.M.",83101,20160012,20160012]
[null,1,"D",null,100,"D2",577,"GASTOS MEDICOS MAYORES",83101,20160012,20160012]
[null,1,"D",null,100,"D2",578,"SEGUROS FOVISSSTE",83101,20160012,20160012]
[null,1,"D",null,100,"D2",579,"CREDITOS LIBERTAD",83101,20160012,20160012]
[null,1,"D",null,100,"D2",580,"CREDI-NOMINA ADIC.",83101,20160012,20160012]
[null,1,"D",null,100,"D2",581,"DEVOLUCION CREDINOMINA",83101,20160012,20160012]
[null,1,"D",null,100,"D2",582,"ACRENOMINA",83101,20160012,20160012]
[null,1,"D",null,100,"D2",583,"RETROACTIVO FONDO DE AHOR",83101,20160012,20160012]
[null,1,"D",null,100,"D2",584,"DIF. ACRENOMINA",83101,20160012,20160012]
[null,1,"D",null,100,"D2",585,"DEV. PRES. C.P.",83101,20160012,20160012]
[null,1,"D",null,100,"D2",586,"DEV. SEG.COL.RET.",83101,20160012,20160012]
[null,1,"D",null,100,"D2",587,"DEV. SEG. AHISA",83101,20160012,20160012]
[null,1,"D",null,100,"D2",588,"AYUDA DEFUNCION  A COMPAﾑ",83101,20160012,20160012]
[null,1,"D",null,100,"D2",589,"ADEUDO CAJA AHORRO",83101,20160012,20160012]
[null,1,"D",null,100,"D2",590,"DEV.DES MM 2010",83101,20160012,20160012]
[null,1,"D",null,100,"D2",591,"DEV. SUELDO MM 2010",83101,20160012,20160012]
[null,1,"D",null,100,"D2",594,"POT. SEGURO DE VIDA SURA",83101,20160012,20160012]
[null,1,"D",null,100,"D2",595,"ALIANZA LA MERCED",83101,20160012,20160012]
[null,1,"D",null,100,"D2",596,"OPTICA OPTIC COLOR",83101,20160012,20160012]
[null,1,"D",null,100,"D2",597,"OPTICA OPTIFOTO",83101,20160012,20160012]
[null,1,"D",null,100,"D2",600,"AJUSTE COMP. POR ANT.",83101,20160012,20160012]
[null,1,"D",null,100,"D2",801,"DIF. FALTAS",83101,20160012,20160012]
[null,"Fuente : Información proporcionada por las Entidades Federativas"]

{"sheet":"E)","index":13,"n_rows":26,"n_cols":8,"rows_kept":26,"cut":false,"hidden":false,"merged":[[9,1,9,5],[12,1,14,1],[12,2,14,2],[13,7,14,7],[12,3,14,3],[12,4,14,4],[12,5,12,7],[13,5,14,5],[13,6,14,6]]}
[]
[]
[]
[]
[]
[]
[]
[]
[null,"Formato: Trabajadores que Cobran con RFC / CURP con Formato Incorrecto"]
[null,{"$f":"IF('Caratula Resumen'!D22=\"Elige el Periodo…\",\"\",'Caratula Resumen'!D22)","v":"Fondo de Aportaciones para la Educación Tecnológica y de Adultos/Instituto Nacional para la Educación de los Adultos (FAETA/INEA)"},null,null,null,null,null,{"$f":"IF('Caratula Resumen'!D23=\"Elige el Periodo…\",\"\",'Caratula Resumen'!D23)","v":"4to. Trimestre"}]
[]
[]
[null,"Entidad Federativa","RFC","CURP","NOMBRE TRABAJADOR","Motivo"]
[null,null,null,null,null,"Sin RFC o erroneo","RFC Sin Homoclave","Sin CURP o Erronea"]
[]
[]
[null,"Entidad Federativa","RFC","CURP","NOMBRE TRABAJADOR","Sin RFC o erroneo","RFC Sin Homoclave","Sin CURP o Erronea"]
[]
[]
[]
[]
[]
[null,"Total Personas : ",null,null,"Total Sin RFC o Erroneo:"]
[null,null,null,null,null,"Total RFC Sin Homoclave:"]
[null,null,null,null,null,null,"Total Sin CURP o Erroneo:"]
[null,"Fuente : Información proporcionada por las Entidades Federativas"]

{"sheet":"F) 1","index":14,"n_rows":26,"n_cols":19,"rows_kept":26,"cut":false,"hidden":false,"merged":[[9,1,9,6],[12,15,13,15],[12,16,13,16],[12,17,12,18],[12,1,13,1],[12,2,13,2],[12,3,13,3],[12,4,13,4],[12,5,13,5],[12,6,13,6],[12,7,13,7],[12,8,12,14]]}
[]
[]
[]
[]
[]
[]
[]
[]
[null,"Formato: Trabajadores con Doble Asignación Salarial en Municipios no Colindantes Geográficamente"]
[null,{"$f":"IF('Caratula Resumen'!D22=\"Elige el Periodo…\",\"\",'Caratula Resumen'!D22)","v":"Fondo de Aportaciones para la Educación Tecnológica y de Adultos/Instituto Nacional para la Educación de los Adultos (FAETA/INEA)"},null,null,null,null,null,null,null,null,null,null,null,null,null,null,null,null,{"$f":"IF('Caratula Resumen'!D23=\"Elige el Periodo…\",\"\",'Caratula Resumen'!D23)","v":"4to. Trimestre"}]
[]
[]
[null,"Entidad Federativa","Municipio","Localidad","RFC","CURP","Nombre del Trabajador","Clave integrada","Clave Presupuestal",null,null,null,null,null,null,"Clave CT","Nombre CT","Periodo en el CT"]
[null,null,null,null,null,null,null,null,"Partida Presupuestal","Código de Pago","Clave de Unidad","Clave de Sub Unidad","Clave de Categoría","Horas Semana Mes ","Número de Plaza",null,null,"Desde","Hasta"]
[]
[null,"Entidad Federativa","Municipio","Localidad","RFC","CURP","Nombre del Trabajador","Clave integrada","Partida Presupuestal","Código de Pago","Clave de Unidad","Clave de Sub Unidad","Clave de Categoría","Horas semana mes","Número de Plaza","Clave CT","Nombre CT","Periodo en el CT\nDesde","Periodo en el CTH\nasta"]
[]
[]
[]
[]
[]
[null,"Total Personas : ",null,null,null,null,null,null,null,null,null,null,"Total Plazas : "]
[]
[]
[null,"Fuente : Información proporcionada por las Entidades Federativas"]
[null,"Importante: Listar Sólo los Municipios no Colindantes"]

{"sheet":"F) 2","index":15,"n_rows":22,"n_cols":20,"rows_kept":22,"cut":false,"hidden":false,"merged":[[13,3,14,3],[13,4,14,4],[13,5,14,5],[10,1,10,9],[13,19,14,19],[13,18,14,18],[13,6,13,12],[13,13,14,13],[13,14,14,14],[13,15,14,15],[13,16,13,17],[13,1,14,1],[13,2,14,2]]}
[]
[]
[]
[]
[]
[]
[]
[]
[]
[null,"Formato: Trabajadores Ocupando Plazas que Superan el Número de Horas de Compatibilidad Autorizadas"]
[null,{"$f":"IF('Caratula Resumen'!D22=\"Elige el Periodo…\",\"\",'Caratula Resumen'!D22)","v":"Fondo de Aportaciones para la Educación Tecnológica y de Adultos/Instituto Nacional para la Educación de los Adultos (FAETA/INEA)"},null,null,null,null,null,null,null,null,null,null,null,null,null,null,null,null,{"$f":"IF('Caratula Resumen'!D23=\"Elige el Periodo…\",\"\",'Caratula Resumen'!D23)","v":"4to. Trimestre"}]
[]
[]
[null,"Entidad Federativa","RFC","CURP","Nombre","Clave integrada","Clave Presupuestal",null,null,null,null,null,null,"CT","Nombre CT","Turno CT","Periodo",null,"Total de Horas en el CT","Horas de compatibilidad de la categoría"]
[null,null,null,null,null,null,"Partida Presupuestal","Código de Pago","Clave de Unidad","Clave de Sub Unidad","Clave de Categoría","Horas Semana Mes ","Número de Plaza",null,null,null,"Desde","Hasta"]
[]
[null,"Entidad Federativa","RFC","CURP","Nombre","Clave integrada","Partida Presupuestal","Código de Pago","Clave de Unidad","Clave de Sub Unidad","Clave de Categoría","Horas semana mes","Número de plaza","CT","Nombre CT","Turno CT","Periodo\nDesde","Periodo\nHasta","Total de Horas en el CT","Horas de compatibilidad de la categoría"]
[null,"GUANAJUATO","GOGR650725KF1","GOGR650725HGTNRB02","ROBERTO GONZALEZ GARCIA","831011721T0382000.0",83101,1,7,21,"T03820",0,235,0,0,100,0,0,0,0]
[null,"Total Personas : ",1,null,null,null,null,null,null,null,"Total Plazas : ",null,1]
[]
[]
[null,"Fuente : Información proporcionada por las Entidades Federativas"]

{"sheet":"G)","index":16,"n_rows":27,"n_cols":20,"rows_kept":27,"cut":false,"hidden":false,"merged":[[13,19,14,19],[13,13,14,13],[13,14,14,14],[13,15,13,16],[13,17,14,17],[13,18,14,18],[10,1,10,8],[12,5,12,11],[13,1,14,1],[13,2,14,2],[13,3,14,3],[13,4,14,4],[13,5,14,5],[13,6,13,12]]}
[]
[]
[]
[]
[]
[]
[]
[]
[]
[null,"Formato: Trabajadores Cuyo Salario Básico Supere los Ingresos Promedio de un Docente en la Categoría más Alta del Tabulador Salarial Correspondiente a Cada Entidad"]
[null,{"$f":"IF('Caratula Resumen'!D22=\"Elige el Periodo…\",\"\",'Caratula Resumen'!D22)","v":"Fondo de Aportaciones para la Educación Tecnológica y de Adultos/Instituto Nacional para la Educación de los Adultos (FAETA/INEA)"},null,null,null,null,null,null,null,null,null,null,null,null,null,null,null,null,null,{"$f":"IF('Caratula Resumen'!D23=\"Elige el Periodo…\",\"\",'Caratula Resumen'!D23)","v":"4to. Trimestre"}]
[]
[]
[null,"Entidad Federativa","R.F.C.","CURP","Nombre","Clave integrada","Clave Presupuestal Integrada y Categoria aparte",null,null,null,null,null,null,"Clave CT Origen","Nombre CT","Periodo",null,"Monto de Remuneraciones Mensuales ","Monto de referencia","Diferencia\n(R-S)"]
[null,null,null,null,null,null,"Partida Presupuestal","Código de Pago","Clave de Unidad","Clave de Sub Unidad","Clave de Categoría","Horas Semana Mes ","Número de Plaza",null,null,"Desde","Hasta"]
[]
[null,"Entidad Federativa","R.F.C.","CURP","Nombre","Clave integrada","Partida Presupuestal","Código de Pago","Clave de Unidad","Clave de Sub Unidad","Clave de Categoría","Horas Semana Mes ","No. de plaza","CT","Nombre CT","Periodo\nDesde","Periodo\nHasta","Monto de Remuneraciones Mensuales ","Monto de referencia","Diferencia\n(R-S)"]
[]
[]
[]
[]
[]
[null,"Total Personas : ",null,null,null,null,null,null,null,null,null,null,null,null,"Total Remuneraciones Mensuales:"]
[]
[null,null,null,null,null,null,null,null,null,null,null,null,null,null,null,null,null,"Total Diferencia:"]
[]
[null,"Fuente : Información proporcionada por las Entidades Federativas"]

{"sheet":"Listas","index":17,"n_rows":42,"n_cols":8,"rows_kept":42,"cut":false,"hidden":true,"merged":[]}
[]
[]
[]
[null,"Elige un Fondo…"]
[null,"Fondo de Aportaciones para la Educación Básica y Normal (FAEB)"]
[null,"Fondo de Aportaciones para la Educación Tecnológica y de Adultos/Colegio Nacional de Educación Profesional Técnica (FAETA/CONALEP)"]
[null,"Fondo de Aportaciones para la Educación Tecnológica y de Adultos/Instituto Nacional para la Educación de los Adultos (FAETA/INEA)"]
[]
[]
[null,null,null,null,null,null,null,"Elige la Entidad Federativa…"]
[null,"Elige el Periodo…",null,null,null,null,null,"AGUASCALIENTES"]
[null,"1er. Trimestre",null,null,null,null,null,"BAJA CALIFORNIA"]
[null,"2do. Trimestre",null,null,null,null,null,"BAJA CALIFORNIA SUR"]
[null,"3er. Trimestre",null,null,null,null,null,"CAMPECHE"]
[null,"4to. Trimestre",null,null,null,null,null,"COAHUILA "]
[null,null,null,"Elige el Año…",null,null,null,"COLIMA "]
[null,null,null,2013,null,null,null,"CHIAPAS "]
[null,null,null,2014,null,null,null,"CHIHUAHUA "]
[null,null,null,2015,null,null,null,"DISTRITO FEDERAL"]
[null,null,null,2016,null,null,null," DURANGO "]
[null,null,null,2017,null,null,null," GUANAJUATO "]
[null,null,null,2018,null,null,null," GUERRERO "]
[null,null,null,null,null,null,null," HIDALGO"]
[null,null,null,null,null,null,null," JALISCO "]
[null,null,null,null,null,null,null," MEXICO "]
[null,null,null,null,null,null,null," MICHOACAN "]
[null,null,null,null,null,null,null," MORELOS "]
[null,null,null,null,null,null,null," NAYARIT "]
[null,null,null,null,null,null,null," NUEVO LEON"]
[null,null,null,null,null,null,null," OAXACA "]
[null,null,null,null,null,null,null," PUEBLA "]
[null,null,null,null,null,null,null," QUERETARO "]
[null,null,null,null,null,null,null," QUINTANA ROO"]
[null,null,null,null,null,null,null," SAN LUIS"]
[null,null,null,null,null,null,null," SINALOA "]
[null,null,null,null,null,null,null," SONORA "]
[null,null,null,null,null,null,null," TABASCO "]
[null,null,null,null,null,null,null," TAMAULIPAS "]
[null,null,null,null,null,null,null," TLAXCALA "]
[null,null,null,null,null,null,null," VERACRUZ"]
[null,null,null,null,null,null,null," YUCATÁN "]
[null,null,null,null,null,null,null," ZACATECAS "]