{"text_format":"1","workbook":"xlsx","n_sheets":18,"sheets":["Caratula Resumen","A Y  II D3","A Y II D4","B)","II B) Y 1","II C y 1_","II D) 2","II D) 4","II D) 4 A","II D) 6","II D) 7 1","II D) 7 2 ","II D) 7 3","E)","F) 1","F) 2","G)","Listas"],"not_rendered":{"charts":0,"images":16,"macros":1,"external_links":0,"defined_names":19,"comments":16,"pivot_tables":0},"unopened":[],"bounds":{"document_bytes":16777216,"sheet_cells":100000,"rows_first":2000,"rows_last":500,"rows_between":2000,"halvings":0,"cell_chars":16384,"cell_head_chars":4096},"cells_cut":0,"cells_raw":0,"read":"whole","date_system":"1900"}

{"sheet":"Caratula Resumen","index":0,"n_rows":73,"n_cols":18,"rows_kept":73,"cut":false,"hidden":false,"merged":[[69,2,69,5],[71,2,71,5],[72,2,72,5],[73,2,73,5],[20,3,20,14],[21,3,21,14],[22,3,22,14],[49,3,49,6],[62,2,62,5],[63,2,63,5],[65,2,65,5],[66,2,66,5],[68,2,68,5],[43,3,43,6],[44,3,44,6],[45,3,45,6],[46,3,46,6],[47,3,47,6],[48,3,48,6],[37,3,37,6],[38,3,38,6],[39,3,39,6],[40,3,40,6],[41,3,41,6],[42,3,42,6],[36,3,36,6],[10,3,10,18],[11,3,11,18],[12,3,12,18],[34,3,34,6],[35,3,35,6]]}
[]
[]
[]
[]
[]
[]
[]
[]
[]
[]
[]
[null,null,null,"FORMATOS ENTREGADOS PARA DAR CUMPLIMIENTO AL ARTICULO 73 DE \"LA LEY GENERAL DE CONTABILIDAD GUBERNAMENTAL\""]
[]
[]
[]
[]
[]
[]
[]
[]
[null,null,"Entidad Federativa :"," GUANAJUATO "]
[null,null,"Fondo :","Fondo de Aportaciones para la Educación Tecnológica y de Adultos/Colegio Nacional de Educación Profesional Técnica (FAETA/CONALEP)"]
[null,null,"Periodo :","4to. Trimestre"]
[]
[]
[]
[]
[]
[]
[]
[]
[null,null,null,null,null,null,null,"TOTAL REGISTROS ",null,"Num. de Paginas",null,"TOTAL PERSONAS",null,"TOTAL PLAZAS",null,"Total Pto. Federal",null,"Total Ppto. Otras Fuentes"]
[]
[]
[null,1,"A Y II D3","Personal Comisionado",null,null,null,31,null,1,null,31,null,31,null,2022529.57,null,0]
[null,2,"A Y II D4","Personal con Licencia",null,null,null,20,null,1,null,20,null,20,null,386954.7,null,0]
[null,3,"B)   ","Registro Federal de Contribuyentes de Trabajadores con Pagos Retroactivos con un Periodo Mayor a 45 días",null,null,null,0,null,1,null,0,null,0,null,"N/A",null,"N/A"]
[null,4,"II B) Y 1","Plaza / Función",null,null,null,1030,null,16,null,1030,null,"N/A",null,"N/A",null,"N/A"]
[null,5,"II C y 1_","Personal Federalizado por Registro Federal de Contribuyentes",null,null,null,1030,null,18,null,1030,null,1030,null,2022529.5699999998,null,2022529.5699999998]
[null,6,"II D) 2","Movimientos de Plazas",null,null,null,0,null,1,null,0,null,0,null,"N/A",null,"N/A"]
[null,7,"II D) 4","Trabajadores Jubilados en el Periodo",null,null,null,2,null,1,null,2,null,2,null,"N/A",null,"N/A"]
[null,8,"II D) 4 A","Trabajadores que Tramitaron Licencia Prejubilatoria en el Periodo",null,null,null,2,null,1,null,2,null,2,null,84884.6,null,0]
[null,9,"II D) 6","Trabajadores Contratados por Honorarios en el Periodo",null,null,null,0,null,1,null,0,null,"N/A",null,"N/A",null,"N/A"]
[null,10,"II D) 7 1 ","Analítico de Categorías / Plazas Autorizadas con su Tabulador",null,null,null,30,null,null,null,"N/A",null,"N/A",null,"N/A",null,"N/A"]
[null,11,"II D) 7 2 ","Catálogo de Categorías y Tabuladores",null,null,null,30,null,null,null,"N/A",null,"N/A",null,"N/A",null,"N/A"]
[null,12,"II D) 7 3 ","Catálogo de Percepciones y Deducciones",null,null,null,68,null,null,null,"N/A",null,"N/A",null,"N/A",null,"N/A"]
[null,13,"E)","Trabajadores que Cobran con RFC / CURP con Formato Incorrecto",null,null,null,0,null,1,null,0,null,"N/A",null,"N/A",null,"N/A"]
[null,14,"F) 1","Trabajadores con Doble Asignación Salarial en Municipios no Colindantes Geográficamente",null,null,null,0,null,1,null,0,null,"N/A",null,"N/A",null,"N/A"]
[null,15,"F) 2","Trabajadores Ocupando Plazas que Superan el Número de Horas de Compatibilidad Autorizadas",null,null,null,0,null,1,null,0,null,null,null,"N/A",null,"N/A"]
[null,16,"G)","Trabajadores Cuyo Salario Básico Supere los Ingresos Promedio de un Docente en la Categoría más Alta del Tabulador Salarial Correspondiente a Cada Entidad",null,null,null,0,null,1,null,0,null,"N/A",null,"N/A",null,"N/A"]
[]
[]
[]
[]
[]
[]
[]
[]
[]
[]
[]
[]
[null,null,"M. en C. GUILLERMO ARIAS GUZMÁN"]
[null,null,"Nombre del  Responsable"]
[]
[null,null,"DIRECTOR DE ADMINISTRACIÓN"]
[null,null,"Cargo"]
[]
[]
[null,null,"Firma"]
[]
[null,null,"2016-01-21"]
[null,null,"Fecha"]

{"sheet":"A Y  II D3","index":1,"n_rows":53,"n_cols":25,"rows_kept":53,"cut":false,"hidden":false,"merged":[[9,1,9,7],[12,6,12,12],[12,1,13,1],[12,2,13,2],[12,3,13,3],[12,4,13,4],[12,5,13,5],[49,12,49,14],[12,24,13,24],[12,13,12,14],[12,15,13,15],[12,16,13,16],[12,17,13,17],[12,18,12,19],[12,20,13,20],[47,13,47,14],[12,21,13,21],[12,22,13,22],[12,23,13,23]]}
[]
[]
[]
[]
[]
[]
[]
[]
[null,"Formato: Personal Comisionado"]
[null,{"$f":"IF('Caratula Resumen'!D22=\"Elige el Periodo…\",\"\",'Caratula Resumen'!D22)","v":"Fondo de Aportaciones para la Educación Tecnológica y de Adultos/Colegio Nacional de Educación Profesional Técnica (FAETA/CONALEP)"},null,null,null,null,null,null,null,null,null,null,null,null,null,null,null,null,null,null,null,null,null,{"$f":"IF('Caratula Resumen'!D23=\"Elige el Periodo…\",\"\",'Caratula Resumen'!D23)","v":"4to. Trimestre"}]
[]
[]
[null,"Entidad Federativa","R.F.C.","CURP","Nombre","Clave integrada","Clave Presupuestal",null,null,null,null,null,null,"Fecha Comisión",null,"Percepciones pagadas en el Periodo de Comisión con Presupuesto Federal*","Percepciones pagadas en el Periodo de Comisión con Presupuesto de otra fuente*","Clave CT Origen","CT Destino dentro del sector",null,"Lugar de la comisión fuera del sector educativo","Tipo de Comisión","Función Específica","Objeto de la comision","No. Oficio"]
[null,null,null,null,null,null,"Partida Presupuestal","Código de Pago","Clave de Unidad","Clave de Sub Unidad","Clave de Categoría","Horas Semana Mes ","Número de Plaza","Inicio","Conclusión",null,null,null,"Clave","Turno"]
[]
[null,"Entidad Federativa","R.F.C.","CURP","Nombre","Clave integrada","Partida Presupuestal","Código de Pago","Clave de Unidad","Clave de Sub Unidad","Clave de Categoría","Horas Semana Mes ","Número de Plaza","Fecha Comisión\nInicio","Fecha Comisión\nConclusión","Percepciones pagadas en el Periodo de Comisión con Presupuesto Federal*","Percepciones pagadas en el Periodo de Comisión con Presupuesto de otra fuente*","Clave CT Origen","Clave","Turno","Lugar de la comisión fuera del sector educativo","Tipo de Comisión","Función Específica","Objeto de la comision","No. Oficio"]
[null,"GUANAJUATO","AECL710621SE4","AECL710621HGTRRS02","JOSE LUIS ARELLANO CRUZ","113010030000A0320200.010301",1130,1003,"00","00","A03202","00.0",10301,20141117,20151231,30024.639999999999,0,"11APT0001T","11DPT0010Y",100,"PLANTEL SILAO","C","APOYO AL AREA DE CAPACITACION","APOYO AL AREA POR FALTA DE PERSONAL","976/2014"]
[null,"GUANAJUATO","MOGM581228P96","MOGM581228MGTRNR09","MORENO GONZALEZ MARTHA DEL CARMEN","113010030000A0180100.018843",1130,1003,"00","00","A01801","00.0",18843,20080801,20151231,40626.9,0,"11APT0001T","11DPT0007K",100,"PLANTEL LEON II","C","ADMINISTRATIVO TECNICO ESPECIALISTA","COLABORAR EN LAS ACTIVIDADES RELACIONADAS CON EL DEPARTAMENTO DE RECURSOS HUMANOS DEL PLANTEL","7292008"]
[null,"GUANAJUATO","PELI680925LM6","PELI680925MGTDPV03","IVONNE YOLANDA PEDROZA LOPEZ            ","113010030000CF3320600.010303",1130,1003,"00","00","CF33206","00.0",10303,20140829,20151231,108476.39999999998,0,"11APT0001T","11DPT0013V",100,"PLANTEL LEÓN III","C","JEFE DE PROYECTO DE FORMACION TÉCNICA","POR FALTA DE PERSONAL REALIZA LABORES RELACIONADAS CON EL DEPARTAMENTO DE FORMACIÓN TÉCNICA","1206/2014"]
[null,"GUANAJUATO","POPG430527TB7","POPG430527HGTRDD09","J. GUADALUPE PORRAS PADILLA","113010030000S0120200.02636",1130,1003,"00","00","S01202","00.0",2636,20091201,20151231,35558.33,0,"11APT0001T","11APT0001T",100,"CAST LEON","C","APOYO A LA DIRECCIÓN DE COMPETITIVIDAD","APOYO AL AREA POR FALTA DE PERSONAL","01122009"]
[null,"GUANAJUATO","AAMD810413AX8","AAMD810413MGTNRN03","DIANA LORENA ANAYA MARTINEZ","113010030705CF0420100.011092",1130,1003,"07","05","CF04201","00.0",11092,20080901,20151231,33583.47,0,"11APT0001T","11DPT0003O",100,"PLANTEL LEON I","C","ATENCION A CLIENTES AL LABORATORIO","CAMBIO DE LABORATORIO","01092008"]
[null,"GUANAJUATO","EIPA861113S53","EIPA861113HGTSRB08","JOSE ABRAHAM ESPINOZA PORRAS","113010030705CF3420200.05581",1130,1003,"07","05","CF34202","00.0",5581,20080601,20151231,29230.34,0,"11APT0001T","11APT0001T",100,"DIRECCION GENERAL","C","AREA DE ACADEMICOS","APOYO AL AREA POR FALTA DE PERSONAL","01062008"]
[null,"GUANAJUATO","GONM790924B46","GONM790924HGTNVG00","MIGUEL ANGEL GONZALEZ NAVARRO","113010030705CF3320400.02578",1130,1003,"07","05","CF33204","00.0",2578,20080417,20151231,62154.97,0,"11APT0001T","11DPT0003O",100,"PLANTEL LEON I","C","RESPONSABLE DE LABORATORIO","CAMBIO DE LABORATORIO",17042008]
[null,"GUANAJUATO","GUJE870107661","GUJE870107MGTTRL01","ELIZABETH VERONICA GUTIERREZ JUAREZ","113010030705CF3320400.02546",1130,1003,"07","05","CF33204","00.0",2546,20090601,20151231,54280.760000000009,0,"11APT0001T","11APT0001T",100,"DIRECCION GENERAL","C","AREA DE PLANEACION","APOYO AL AREA POR FALTA DE PERSONAL","01062009"]
[null,"GUANAJUATO","RAMA640606AQ0","RAMA640606HGTNXL06","ALBERTO RANGEL MUÑOZ","113010030705ED0120100.02619",1130,1003,"07","05","ED01201","00.0",2619,20080417,20151231,39334.709999999992,0,"11APT0001T","11DPT0003O",100,"PLANTEL LEON I","C","APOYO LAB. DE PRUEBAS FISICAS","CAMBIO DE LABORATORIO",17042008]
[null,"GUANAJUATO","MANR8209073S1","MANR820907HGTCGT04","RITO MACIAS NEGRETE","113010030705CF0160100.011035",1130,1003,"07","05","CF01601","00.0",11035,20090901,20151231,89158.079999999987,0,"11APT0001T","11APT0001T",100,"DIRECCION GENERAL","C","APOYO AL AREA DE PLANEACION","APOYO AL AREA POR FALTA DE PERSONAL","01092010"]
[null,"GUANAJUATO","PESE6410262J8","PESE641026HTSRNR02","ERNESTO PEREZ SANCHEZ","113010030705CF0160100.011098",1130,1003,"07","05","CF01601","00.0",11098,20061001,20151231,89158.079999999987,0,"11APT0001T","11APT0001T",100,"DIRECCION GENERAL","C","APOYO AL AREA DE PLANEACION","APOYO AL AREA POR FALTA DE PERSONAL",822013]
[null,"GUANAJUATO","VARG660927MXA","VARG660927MDFLSL01","GLORIA  GUADALUPE VALENZUELA RIOS","113010030705CF0160100.011090",1130,1003,"07","05","CF01601","00.0",11090,20130201,20151231,89158.079999999987,0,"11APT0001T","11APT0001T",100,"DIRECCION GENERAL","C","EN EL AREA DE PROMOCION Y VINCULACION","APOYO AL AREA POR FALTA DE PERSONAL","1565/2013"]
[null,"GUANAJUATO","MABM8602122N2","MABM860212MGTRRL21","MELISSA MARISELA MARTINEZ BARRIOS","113010030705S0120100.02647",1130,1003,"07","05","S01201","00.0",2647,20141001,20151231,27683.410000000003,0,"11APT0001T","11APT0001T",120,"DIRECCION GENERAL","C","APOYO EN EL AREA DE JURIDICO","APOYO AL AREA POR FALTA DE PERSONAL","1618/2014"]
[null,"GUANAJUATO","GATG451128UX1","GATG451128HDFYRS05","GUSTAVO GAYTAN TORRES","113010030029CF3320600.013248",1130,1003,"00","29","CF33206","00.0",13248,20120716,20151231,73109.76999999999,0,"11DPT0002P","11DPT0008J",120,"CORTAZAR","C","COORDINADOR EJECUTIVO","CUBRIR LA COORDINACION EJECUTIVA DEL PLANTEL CORTAZAR",16262012]
[null,"GUANAJUATO","AETA880105TQ0","AETA880105HGTCNN01","ANTONIO ACEVEDO TINAJERO","113010030030CF3320600.013322",1130,1003,"00","30","CF33206","00.0",13322,20130301,20151231,72130.079999999987,0,"11DPT0003O","11DPT0010Y",100,"PLANTEL SILAO","C","DESARROLLAR ACTIVIDADES EN EL PLANTEL SILAO","DESARROLLAR ACTIVIDADES EN EL PLANTEL SILAO",5512013]
[null,"GUANAJUATO","CALA611023U79","CALA611023MZSRZD15","ADRIANA CÁRDENAS LOZA","113010030030CF3320600.014317",1130,1003,"00",30,"CF33206","00.0",14317,20131016,20151231,89169.609999999986,0,"11DPT0003O","11APT0001T",100,"DIRECCION GENERAL","C","DESARROLLAR ACTIVIDADES EN DIRECCIÓN GENERAL","DESARROLLAR ACTIVIDADES EN DIRECCIÓN GENERAL","1860/2013"]
[null,"GUANAJUATO","NIRA700123GK9","NIRA700123MGTTVN01","ANA LAURA NIETO RIVERA","113010030030CF3320600.014316",1130,1003,"00","30","CF33206","00.0",14316,20090816,20151231,108234.97999999998,0,"11DPT0003O","11FPT0001O",100,"DIRECCIÓN GENERAL","C","MEJORAMIENTO DE LOS PROCESOS EN LA DIRECCION DE COMPETITIVIDAD","MEJORAMIENTO DE LOS PROCESOS EN LA DIRECCION DE COMPETITIVIDAD",16082009]
[null,"GUANAJUATO","PAPA810618AR6","PAPA810618HGTLLB03","ABRAHAM PALACIOS PALACIOS","113010030030CF1820200.011099",1130,1003,"00","30","CF18202","00.0",11099,20150101,20151231,26275.730000000003,0,"11DPT0003O","11APT0001T",100,"DIRECCIÓN GENERAL","C","DESARROLLAR ACTIVIDADES EN DIRECCIÓN GENERAL","DESARROLLAR ACTIVIDADES EN DIRECCIÓN GENERAL","883/2015"]
[null,"GUANAJUATO","MAZR720405LB8","MAZR720405HMNRTC01","RICARDO MARTINEZ ZETINA","113010030163CF3320400.07693",1130,1003,"01","63","CF33204","00.0",7693,20140216,20151231,56223.21,0,"11DPT0006L","11DPT0008J",120,"PLANTEL CORTAZAR","C","AREA DE FORMACION TECNICA","APOYO AL AREA POR FALTA DE PERSONAL",20140216]
[null,"GUANAJUATO","CAPE530526869","CAPE530526MGTRRL07","M ELENA CARDIEL PEREZ","113010030203CF3320400.09174",1130,1003,"02","03","CF33204","00.0",9174,20080801,20151231,70210.7,0,"11DPT0007K","11APT0001T",100,"DIRECCIÓN GENERAL","C","COLABORAR CON LOS PROYECTOS RELACIONADOS AL AREA DE ADMINISTRACIÓN Y FINANZAS","COLABORAR CON LOS PROYECTOS RELACIONADOS AL AREA DE ADMINISTRACIÓN Y FINANZAS",7302008]
[null,"GUANAJUATO","CUAC760716LS6","CUAC760716HGTVCR00","JOSE CARMEN NOE CUAEVAS ACOSTA","1130100323CF0210500.012840",1130,1003,2,3,"CF02105","00.0",12840,20130116,20151231,77122.2,0,"11DPT0007K","11FPT0001O",120,"DIRECCION GENERAL CONALEP","C","COORDINADOR DE SERVICIOS ESCOLARES","COORDINA LOS PROCESOS ESCOLARES Y EXTRACURRICULARES DE ALUMNOS.","550/2013"]
[null,"GUANAJUATO","RAAE850827HM7","RAAE850827MGTMNL05","ELVIA RAMÍREZ ANDRADE","113010030203S0120100.09183",1130,1003,"02","03","S01201","00.0",9183,20120901,20151231,26540.300000000003,0,"11DPT0007K","11DPT0014U",100,"PLANTEL SAN FELIPE","C","APOYO EN SERVICIOS ESCOLARES","APOYAR EN LOS PROCESOS RELACIONADOS AL CONTROL ESCOLAR ","1545/2012"]
[null,"GUANAJUATO","AALR590709UH6","AALR590709MGTNPC06","MARIA ROCIO ANAYA LOPEZ","113010030233CF3320600.014312",1130,1003,"02","33","CF33206","00.0",14312,20140201,20151231,110267.82999999999,0,"11DPT0008J","11DPT0006L",100,"PLANTEL ACAMBARO","C","JEFE DE PROYECTO","RESPONSABLE DE FORMACIÓN TÉCNICA",20140201]
[null,"GUANAJUATO","RABR820601BH9","RABR820601HGTMND08","RODOLFO OSVALDO RAMIREZ BUENO ","113010030204CF3320600.013543","1130","1003","02","04","CF33206","00.0",13543,20150204,20150331,82911.63,0,"11DPT0010Y","11APT0001T",100,"DIRECCION GENERAL ","C","JEFE DE PROYECTO DE NOMINA ","ACTIVIDADES RELATIVAS AL NOMBRAMIENTO ","520/2015"]
[null,"GUANAJUATO","MAVR700118TS6","MAVR700118HGTRRB08","RUBEN MARTINEZ VARELA ","113010030204CF3320600.013251","1130","1003","02","04","CF33206","00.0",13251,20131001,20150331,102783.73999999999,0,"11DPT0010Y","11DPT0003O",100,"PLANTEL LEON 1","C","JEFE DE PROYECTO DE ESCOLARES ","ACTIVIDADES RELATIVAS AL NOMBRAMIENTO ",20131001]
[null,"GUANAJUATO","MAJG650413GMA","MAJG650413HGTLRS08","GUSTAVO MALAGON JUÁREZ","113010030249CF3320600.013689",1130,1003,"02",49,"CF33206","00.0",13689,20120816,20150331,98679.549999999974,0,"11DPT0011X","11DPT0006L",100,"PLANTEL ACAMBARO","C","MEJORAR LOS PROCESOS ","MEJORAMIENTO DE LOS PROCESOS DEL PLANTEL AL QUE FUE COMISIONADO ","1388/2012"]
[null,"GUANAJUATO","PAGA670111I35","PAGA670111HNTLRR03","ARMANDO PALOMARES GARCIA ","113010030302CF3320600.018851",1130,1003,"03","02","CF33206","00.0",18851,"20130301",20151231,91247.950000000012,0,"11DPT0013V","11APT0001T",100,"DIRECCIÓN GENERAL","C","COLABORAR CON LOS PROYECTOS RELACIONADOS AL AREA DE ADMINISTRACIÓN Y FINANZAS","COLABORAR CON LOS PROYECTOS RELACIONADOS AL AREA DE ADMINISTRACIÓN Y FINANZAS","549/2013"]
[null,"GUANAJUATO","ROMR861218274","ROMR861218HGTDGC00","RICARDO RODRÍGUEZ MAGDALENO","113010030302CF3320600.018849",1130,1003,"03","02","CF33206","00.0",18849,"20141117",20151231,73109.76999999999,0,"11DPT0013V","11APT0001T",100,"DIRECCIÓN GENERAL","C","COLABORAR CON LOS PROYECTOS RELACIONADOS CON EL ÁREA DE FORMACIÓN TÉCNICA DE LA DIRECCIÓN GRAL.","COLABORAR CON LOS PROYECTOS RELACIONADOS CON EL ÁREA DE FORMACIÓN TÉCNICA DE LA DIRECCIÓN GRAL.","1618/2014"]
[null,"GUANAJUATO","OOCM7903122F9","OOCM790312MGTRRR03","MARCELA OROZCO CORNEJO","113010030303CF3320400.018865",1130,1003,"03","03","CF33204","00.0",18865,20130116,20151231,61862.14,0,"11DPT0014U","11DPT0003O",120,"PLANTEL LEON I","C","OCUPACION PUESTO VACANTE ","OCUPACION PUESTO DE SUBJEFE TECNICO ESPECIALISTA DEL PLANTEL LEON 1","657/2013"]
[null,"GUANAJUATO","CEVB731120C46","CEVB731120HGTDRR00","BERNARDO CEDILLO VERA","113010030303A0180100.018872",1130,1003,"03","03","A01801","00.0",18872,20120901,20151231,37138.300000000003,0,"11DPT0014U","11DPT0007K",100,"PLANTEL LEON II","C","OCUPACION PUESTO VACANTE ","OCUPACION PUESTO DE ADMINISRATIVO EN PLANTEL LEON II","1546/2012"]
[null,"GUANAJUATO","MOFD741006FM4","MOFD741006HGTSLV05","DAVID MOSQUEDA FLORES","113010030029CF1820300.011914",1130,1003,"00","29","CF18203","00.0",11914,20150916,20151231,37083.910000000003,0,"11DPT0002P","11DPT0016S",100,"PLANTEL IRAPUATO II","C","SUPERVISOR DE MANTENIMIENTO","ACTIVIDADES RELATIVAS AL NOMBRAMIENTO ","1409/2015"]
[null,"Total Personas : ",31,null,null,null,null,null,null,null,"Total Plazas : ",null,31,"Total Pto. Federal",null,{"$f":"SUBTOTAL(109,Tabla1[Percepciones pagadas en el Periodo de Comisión con Presupuesto Federal*])","v":2022529.5699999998}]
[]
[null,null,null,null,null,null,null,null,null,null,null,null,"Total Ppto. Otras Fuentes",null,null,null,0]
[]
[null,"*Total de Percepciones reportadas por la Entidad Federativa como pagadas al trabajador durante la comisión."]
[null,"Fuente : Información proporcionada por las Entidades Federativas."]

{"sheet":"A Y II D4","index":2,"n_rows":42,"n_cols":21,"rows_kept":42,"cut":false,"hidden":false,"merged":[[9,1,9,6],[36,13,36,14],[12,16,13,16],[12,17,13,17],[12,20,13,20],[12,1,13,1],[12,3,13,3],[12,4,13,4],[12,5,13,5],[12,6,12,12],[12,13,12,14],[12,2,13,2],[12,18,12,19],[12,15,13,15]]}
[]
[]
[]
[]
[]
[]
[]
[]
[null,"Formato: Personal con Licencia"]
[null,{"$f":"IF('Caratula Resumen'!D22=\"Elige el Periodo…\",\"\",'Caratula Resumen'!D22)","v":"Fondo de Aportaciones para la Educación Tecnológica y de Adultos/Colegio Nacional de Educación Profesional Técnica (FAETA/CONALEP)"},null,null,null,null,null,null,null,null,null,null,null,null,null,null,null,null,null,null,{"$f":"IF('Caratula Resumen'!D23=\"Elige el Periodo…\",\"\",'Caratula Resumen'!D23)","v":"4to. Trimestre"}]
[]
[]
[null,"Entidad Federativa","R.F.C.","CURP","NOMBRE","Clave integrada","Clave Presupuestal",null,null,null,null,null,null,"Periodo Licencia",null,"Percepciones pagadas en el Periodo de la Licencia con Presupuesto Federal*","Percepciones pagadas en el Periodo de la Licencia con Presupuesto de otra fuente*","Clave CT Origen","Licencia",null,"Descripción de la Licencia"]
[null,null,null,null,null,null,"Partida Presupuestal","Código de Pago","Clave de Unidad","Clave de Sub Unidad","Clave de Categoría","Horas Semana Mes ","Número de Plaza","Inicio","Conclusión",null,null,null,"Clave","Tipo"]
[]
[null,"Entidad Federativa","R.F.C.","CURP","NOMBRE","Clave integrada","Partida Presupuestal","Código de Pago","Clave de Unidad","Clave de Sub Unidad","Clave de Categoría","Horas Semana Mes ","Número de Plaza","Periodo Licencia\nInicio","Periodo Licencia\nConclusión","Percepciones pagadas en el Periodo de la Licencia con Presupuesto Federal*","Percepciones pagadas en el Periodo de la Licencia con Presupuesto de otra fuente*","Clave CT Origen","Licencia\nClave","Licencia\nTipo","Descripción de la Licencia"]
[null,"GUANAJUATO","GAUR8010189E2","GAUR801018MGTRRS03 ","MARIA DEL ROSARIO  GRANADOS URIBE","113010010028PC21.0280034",1130,1001,"00",28,"PC","21.0",280034,20150801,20160131,25797,0,"11DPT0001Q",22,"Goce","Por incapacidad médica o su refrendo"]
[null,"GUANAJUATO","EIPF611001FZA","EIPF611001HGTSRR04","J. FRANCISCO ESPITIA PEREZ","113010010233PC14.0233014",1130,1001,"02",33,"PC","14.0",233014,20150701,20150930,0,0,"11DPT0008J",16,"Sin Goce","Sin goce de sueldo o su refrendo"]
[null,"GUANAJUATO","HEFJ700120711","HEFG700120HGTRSD12","J. GUADALUPE HERNANDEZ FISCAL","113010010233PC20.0233024",1130,1001,"02",33,"PC","20.0",233024,20150701,20150930,32712.05,0,"11DPT0008J",12,"Goce","Comisión sindical o su refrendo"]
[null,"GUANAJUATO","MIRA590513QB0","MIRA590513HGTRMR01","MIRANDA RAMOS JOSE ARMANDO","113010030029CF3420100.02587",1130,1003,"00",29,"CF34201","00.0",2587,20150801,20151031,40381.33,0,"11DPT0002P",26,"Goce","Prepensionaria o su refrendo"]
[null,"GUANAJUATO","PEVG640422LA3","PEVG640422MGTRRR00","PEREZ VERA GEORGINA SOLEDAD","113010030029CF3320200.02594",1130,1003,"00",29,"CF33202","00.0",2594,20150801,20151031,44503.270000000004,0,"11DPT0002P",26,"Goce","Prepensionaria o su refrendo"]
[null,"GUANAJUATO","ROGJ631018GD6","ROGJ631018HGTMRN04","JUAN JOSÉ ROMERO GARCÍA","113010030030CF1920100.02620",1130,1003,"00",30,"CF19201","00.0",2620,20140701,20140930,38481.009999999995,0,"11DPT00030",12,"Goce","Comisión sindical o su refrendo"]
[null,"GUANAJUATO","LUPG840320SN8","LUPG840320HGTNRD08","LUNA PÉREZ JOSÉ GUADALUPE","113010030030AO320200.02614",1130,1003,"00",30,"AO3202","00.0",2614,20140916,20141129,0,0,"11DPT00030",16,"Sin Goce","Sin goce de sueldo o su refrendo"]
[null,"GUANAJUATO","ROFL880718AL5","ROFL880718MGTDLR00","LAURA VIRIDIANA RODRIGUEZ FLORES","113010010203PA27.0203168",1130,1001,"02","03","PA","27.0",203168,20150801,20150930,0,0,"11DPT0007K",16,"Sin Goce","Sin goce de sueldo o su refrendo"]
[null,"GUANAJUATO","IAMJ7009132Z3","IAMJ700913HGTBLS01","JOSE DE JESUS IBARRA MELENDEZ","113010010203PC16.0203130",1130,1001,"02","03","PC","16.0",203130,20150901,20150930,0,0,"11DPT0007K",16,"Sin Goce","Sin goce de sueldo o su refrendo"]
[null,"GUANAJUATO","ROZA8409121VA","ROZA840912MGTDXL02","ALMA ROSARIO RODRIGUEZ ZUÑIGA","113010010203PC16.0203202",1130,1001,"02","03","PC","16.0",203202,20150107,20150921,15692.849999999999,0,"11DPT0007K",22,"Goce","Por incapacidad médica o su refrendo"]
[null,"GUANAJUATO","AAMR650620AB4","AAMR650620HGTLGB03","ROBERTO ALVARADO MAGAÑA","113010030249CF1920100.010606",1130,1003,"02",49,"CF19201","00.0",10606,20131016,20190930,36580.69,0,"11DPT0011X",12,"Goce","Comisión sindical o su refrendo"]
[null,"GUANAJUATO","SAJB8210296D0","SAJB821029HGTNMR03","BERNARDO SANCHEZ JIMENEZ ","113010010249PC20.0249050",1130,1001,"02",49,"PC","20.0",249050,20150801,20160131,0,0,"11DPT0011X",16,"Sin Goce","Sin goce de sueldo o su refrendo"]
[null,"GUANAJUATO","CESA870418K76","CESA870418MGTRMN08","ANA GABRIELA CERVERA SAMANO","113010030513CF3420100.08065",1130,1003,"05",13,"CF34201","00.0",8065,20150612,20150730,30630.690000000002,0,"11APT0001T",22,"Goce","Por incapacidad médica o su refrendo"]
[null,"GUANAJUATO","CALA611023U79","CALA611023MZSRZD15","ADRIANA CARDENAS LOZA                   ","113010030030CF3320600.014317",1130,1003,"00",30,"CF33206","00.0",14317,20140816,20150904,89169.609999999986,0,"11DPT0003O",22,"Goce","Por incapacidad médica o su refrendo"]
[null,"GUANAJUATO","AULJ800815441","AULJ800815HGTGPS08","JOSE AGUILAR LOPEZ","113010010163PA15.0163001",1130,1001,"01","63","PA","15.0",163001,20150801,20160131,0,0,"11DPT0006L",16,"Sin Goce","Sin goce de sueldo o su refrendo"]
[null,"GUANAJUATO","VAAE770920SD7","VAAE770920MOCZGR13","ERICA MARIZA VAZQUEZ AGUILERA","113010010163PB09.0163051",1130,1001,"01",63,"PB","09.0",163051,20150801,20160131,0,0,"11DPT0006L",16,"Sin Goce","Sin goce de sueldo o su refrendo"]
[null,"GUANAJUATO","MAMA660610965","MAMA660610HGTRLR08","ARMANDO MARTINEZ MALDONADO","113010010163PC10.0163028",1130,1001,"01",63,"PC","10.0",163028,20150801,20160131,0,0,"11DPT0006L",16,"Sin Goce","Sin goce de sueldo o su refrendo"]
[null,"GUANAJUATO","CADJ720202F14","CADJ720202HMNHRN03","JUAN CHAVEZ DURAN","113010010163PC10.0163010",1130,1001,"01",63,"PC","10.0",163010,20150801,20160131,0,0,"11DPT0006L",16,"Sin Goce","Sin goce de sueldo o su refrendo"]
[null,"GUANAJUATO","QUDW870430HH4","QUDW870430MGTNMN07","WENDY YAZMIN QUINTANA DOMINGUEZ","113010030163CF2120200.07721",1130,1003,"01",63,"CF21202","00.0",7721,20150601,20150829,22378.370000000003,0,"11DPT0006L",25,"Goce","Por gravidez o su refrendo"]
[null,"GUANAJUATO","AERG571209NWA","AERG571209HGTRML09","GILBERTO ARREOLA ROMERO ","113010030163S0120200.07707",1130,1003,"01",63,"S01202","00.0",7707,20150702,20150804,10627.83,0,"11DPT0006L",22,"Goce","Por incapacidad médica o su refrendo"]
[null,"Total Personas : ",20,null,null,null,null,null,null,null,"Total Plazas : ",null,20,"Total Pto. Federal",null,{"$f":"SUBTOTAL(109,Tabla3[Percepciones pagadas en el Periodo de la Licencia con Presupuesto Federal*])","v":386954.7}]
[]
[null,null,null,null,null,null,null,null,null,null,null,null,null,"Total Ppto. Otras Fuentes",null,0]
[]
[null,"*Total de Percepciones reportadas por la Entidad Federativa como pagadas al trabajador durante la Licencia."]
[null,"Fuente : Información proporcionada por las Entidades Federativas."]

{"sheet":"B)","index":3,"n_rows":27,"n_cols":19,"rows_kept":27,"cut":false,"hidden":false,"merged":[[9,1,9,10],[12,1,13,1],[12,2,13,2],[12,3,13,3],[12,4,13,4],[12,5,12,11],[12,18,13,18],[12,12,13,12],[12,13,13,13],[12,14,13,14],[12,15,12,16],[12,17,13,17]]}
[]
[]
[]
[]
[]
[]
[]
[]
[null,"Formato: Registro Federal de Contribuyentes de Trabajadores con Pagos Retroactivos con un Periodo Mayor a 45 días"]
[null,{"$f":"IF('Caratula Resumen'!D22=\"Elige el Periodo…\",\"\",'Caratula Resumen'!D22)","v":"Fondo de Aportaciones para la Educación Tecnológica y de Adultos/Colegio Nacional de Educación Profesional Técnica (FAETA/CONALEP)"},null,null,null,null,null,null,null,null,null,null,null,null,null,null,null,{"$f":"IF('Caratula Resumen'!D23=\"Elige el Periodo…\",\"\",'Caratula Resumen'!D23)","v":"4to. Trimestre"}]
[]
[]
[null,"Entidad Federativa","RFC","CURP","Nombre","Clave Presupuestal",null,null,null,null,null,null,"Clave de Centro de Trabajo","Fecha de emisión de pago","Motivo del Pago Retroactivo","Periodo pagado",null,"Días transcurridos para el pago","Percepciones pagadas en el periodo reportado *"]
[null,null,null,null,null,"Partida Presupuestal","Código de Pago","Clave de Unidad","Clave de Sub Unidad","Clave de Categoría","Horas Semana Mes ","Número de Plaza",null,null,null,"Desde","Hasta"]
[]
[null,"Entidad Federativa","RFC","CURP","Nombre","Partida Presupuestal","Código de Pago","Clave de Unidad","Clave de Sub Unidad","Clave de Categoría","Horas semana mes","Número de plaza","Clave de Centro de Trabajo","Fecha de emisión de pago","Motivo del Pago Retroactivo","Periodo pagado\nDesde","Periodo pagado\nHasta","Días transcurridos para el pago","Percepciones pagadas en el periodo reportado *"]
[]
[]
[]
[]
[]
[null,"Total Personas : ",null,null,null,null,null,null,null,null,"Total Plazas : ",null,null,null,null,"Total Percepciones Pagadas:"]
[]
[]
[]
[null,"*Total de Percepciones reportadas por la Entidad Federativa como pagadas en el periodo "]
[null,"Fuente : Información proporcionada por las Entidades Federativas"]

{"sheet":"II B) Y 1","index":4,"n_rows":1066,"n_cols":25,"rows_kept":1066,"cut":false,"hidden":false,"merged":[[12,24,14,24],[13,6,13,8],[13,9,13,11],[13,12,13,14],[13,15,13,17],[13,18,13,20],[12,6,12,20],[12,21,14,21],[12,22,14,22],[12,23,14,23],[12,4,14,4],[12,3,14,3],[12,2,14,2],[9,1,9,9],[1063,21,1063,23],[12,1,14,1],[12,5,14,5]]}
[]
[]
[]
[]
[]
[]
[]
[]
[null,"Formato: Plaza / Función"]
[null,{"$f":"IF('Caratula Resumen'!D22=\"Elige el Periodo…\",\"\",'Caratula Resumen'!D22)","v":"Fondo de Aportaciones para la Educación Tecnológica y de Adultos/Colegio Nacional de Educación Profesional Técnica (FAETA/CONALEP)"},null,null,null,null,null,null,null,null,null,null,null,null,null,null,null,null,null,null,null,null,null,{"$f":"IF('Caratula Resumen'!D23=\"Elige el Periodo…\",\"\",'Caratula Resumen'!D23)","v":"4to. Trimestre"}]
[]
[]
[null,"Entidad Federativa","RFC","CURP","Nombre","Centros de Trabajo","Plazas por tipo de función",null,null,null,null,null,null,null,null,null,null,null,null,null,null,"Total plazas Jornada","Total \nHSM","Total de Honorarios","Total de recursos presupuestales ejercidos en servicios personales en el periodo\n(2)"]
[null,null,null,null,null,null,"Apoyo a la labor educativa",null,null,"Administrativo y de servicio",null,null,"Docente y Apoyo Técnico Pedagógico",null,null,"Directivos y Supervisión",null,null,"Mandos medios y superiores"]
[null,null,null,null,null,null,"Jornada","HSM","Honorarios","Jornada","HSM","Honorarios","Jornada","HSM","Honorarios","Jornada","HSM","Honorarios","Jornada","HSM","Honorarios"]
[]
[null,"Entidad Federativa","RFC","CURP","Nombre","Centros de Trabajo","Jornada","HSM","Honorarios","Jornada2","HSM3","Honorarios4","Jornada5","HSM6","Honorarios7","Jornada8","HSM9","Honorarios10","Jornada11","HSM12","Honorarios13","Total plazas Jornada","Total \nHSM","Total de Honorarios","Total de recursos presupuestales ejercidos en servicios personales en el periodo\n(2)"]
[null,"GUANAJUATO","GARG5704245R5","GARG570424HGTRZB08  ","GABRIEL GARCIA RAZO                     ","11DPT0009I",null,null,null,"X",null,null,null,null,null,null,null,null,null,null,null,1,0,0,37268.49]
[null,"GUANAJUATO","GUAA600320L51","GUAA600320MGTTLL03  ","ALEJANDRA GUTIERREZ ALVAREZ             ","11DPT0002P",null,null,null,"X",null,null,null,null,null,null,null,null,null,null,null,1,0,0,36028.78]
[null,"GUANAJUATO","IAGY780906K26","IAGY780906MGTBMD00  ","YADIRA ADRIANA IBARRA GOMEZ             ","11DPT0010Y",null,null,null,"X",null,null,null,null,null,null,null,null,null,null,null,1,0,0,73109.76999999999]
[null,"GUANAJUATO","LARV631103246","LARV631103MGTRCR01  ","VERONICA LARA RICO                      ","11DPT0014U",null,null,null,"X",null,null,null,null,null,null,null,null,null,null,null,1,0,0,44960.89]
[null,"GUANAJUATO","LOBM750809KY1","LOBM750809HGTPRG01  ","MIGUEL LOPEZ BARRAGAN                   ","11DPT0002P",null,null,null,"X",null,null,null,null,null,null,null,null,null,null,null,1,0,0,27761.78]
[null,"GUANAJUATO","MOFD741006FM4","MOFD741006HGTSLV05  ","DAVID MOSQUEDA FLORES                   ","11DPT0002P",null,null,null,"X",null,null,null,null,null,null,null,null,null,null,null,1,0,0,42443.070000000007]
[null,"GUANAJUATO","SAVJ890118LK2","SAVJ890118HGTNZS05  ","JOSE DE JESUS SANCHEZ VAZQUEZ           ","11DPT0002P",null,null,null,"X",null,null,null,null,null,null,null,null,null,null,null,1,0,0,29915.850000000002]
[null,"GUANAJUATO","AABC680116196","AABC680116MMCBNL09  ","CLAUDIA CECILIA D ABDALA BUENDIA        ","11DPT0011X",null,null,null,"X",null,null,null,null,null,null,null,null,null,null,null,1,0,0,33257.81]
[null,"GUANAJUATO","AABC720527RL6","AABC720527HGTLRR03  ","CARLOS ALVARADO BARRIOS                 ","11DPT0009I",null,null,null,"X",null,null,null,null,null,null,null,null,null,null,null,1,0,0,35740.240000000005]
[null,"GUANAJUATO","AACG691218L13","AACG691218MMNLSR08  ","GRACIELA ALVAREZ CASTRO                 ","11DPT0004N",null,null,null,"X",null,null,null,null,null,null,null,null,null,null,null,1,0,0,39265.039999999994]
[null,"GUANAJUATO","AAGA521215AI7","AAGA521215HDFLRR19  ","ARTURO GERARDO ALVAREZ GARCIA           ","11DPT0002P",null,null,null,"X",null,null,null,null,null,null,null,null,null,null,null,1,0,0,33236.300000000003]
[null,"GUANAJUATO","AALA880119VB9","AALA880119MGTLPL06  ","ALESSA ALVARADO LOPEZ                   ","11DPT0014U",null,null,null,"X",null,null,null,null,null,null,null,null,null,null,null,1,0,0,35212.19]
[null,"GUANAJUATO","AALR590709UH6","AALR590709MGTNPC06  ","MARIA ROCIO ANAYA LOPEZ                 ","11DPT0008J",null,null,null,"X",null,null,null,null,null,null,null,null,null,null,null,1,0,0,110267.82999999999]
[null,"GUANAJUATO","AALS670904235","AALS670904MGTNPL09  ","SILVIA ANAYA LOPEZ                      ","11DPT0006L",null,null,null,"X",null,null,null,null,null,null,null,null,null,null,null,1,0,0,68064.02]
[null,"GUANAJUATO","AAMD810413AX8","AAMD810413MGTNRN03  ","DIANA LORENA ANAYA MARTINEZ             ","11APT0001T",null,null,null,"X",null,null,null,null,null,null,null,null,null,null,null,1,0,0,33583.47]
[null,"GUANAJUATO","AAMR650620AB4","AAMR650620HGTLGB03  ","ROBERTO ALVARADO MAGAÑA                 ","11DPT0011X",null,null,null,"X",null,null,null,null,null,null,null,null,null,null,null,1,0,0,36580.69]
[null,"GUANAJUATO","AAMR671130JR0","AAMR671130HGTLGB00  ","RUBEN ALVARADO MAGANA                   ","11DPT0011X",null,null,null,"X",null,null,null,null,null,null,null,null,null,null,null,1,0,0,29610.6]
[null,"GUANAJUATO","AARL760126331","AARL760126HGTLMN06  ","LEONARDO ISRAEL ALVAREZ ROMO            ","11DPT0006L",null,null,null,"X",null,null,null,null,null,null,null,null,null,null,null,1,0,0,32993.67]
[null,"GUANAJUATO","AARM7802157H4","AARM780215MGTLDY03  ","MYRIAM DEL ROSAR ALVARADO RODRIGUEZ     ","11DPT0002P",null,null,null,"X",null,null,null,null,null,null,null,null,null,null,null,1,0,0,25352.300000000003]
[null,"GUANAJUATO","AATE760606N24","AATE760606MGTLNV03  ","EVA ALMANZA TINOCO                      ","11DPT0001Q",null,null,null,"X",null,null,null,null,null,null,null,null,null,null,null,1,0,0,30122.260000000002]
[null,"GUANAJUATO","AEAC630530Q21","AEAC630530MGTLLN08  ","MA. CONCEPCION ALEJOS ALONSO            ","11DPT0008J",null,null,null,"X",null,null,null,null,null,null,null,null,null,null,null,1,0,0,67392.319999999992]
[null,"GUANAJUATO","AECJ7908035L8","AECJ790803HGTLRS03  ","JOSE JESUS ALEJO CARRENO                ","11DPT0011X",null,null,null,"X",null,null,null,null,null,null,null,null,null,null,null,1,0,0,29194.579999999998]
[null,"GUANAJUATO","AECL710621SE4","AECL710621HGTRRS02  ","JOSE LUIS ARELLANO CRUZ                 ","11APT0001T",null,null,null,"X",null,null,null,null,null,null,null,null,null,null,null,1,0,0,30024.639999999999]
[null,"GUANAJUATO","AECM720103NB9","AECM720103MGTLRR09  ","MARCELA ALEJO CARREÑO                   ","11DPT0011X",null,null,null,"X",null,null,null,null,null,null,null,null,null,null,null,1,0,0,101128.06999999998]
[null,"GUANAJUATO","AEGJ5311191A4","AEGJ531119HGTSRR09  ","JORGE ASCENCIO GARCIA                   ","11DPT0003O",null,null,null,"X",null,null,null,null,null,null,null,null,null,null,null,1,0,0,35339.089999999997]
[null,"GUANAJUATO","AERG571209NWA","AERG571209HGTRML09  ","GILBERTO ARREOLA ROMERO                 ","11DPT0006L",null,null,null,"X",null,null,null,null,null,null,null,null,null,null,null,1,0,0,30000.609999999997]
[null,"GUANAJUATO","AETA880105TQ0","AETA880105HGTCNN01  ","ANTONIO ACEVEDO TINAJERO                ","11DPT0003O",null,null,null,"X",null,null,null,null,null,null,null,null,null,null,null,1,0,0,72130.079999999987]
[null,"GUANAJUATO","AIGG6105048S8","AIGG610504HGTRZL05  ","GUILLERMO ARIAS GUZMAN                  ","11APT0001T",null,null,null,null,null,null,null,null,null,null,null,null,"X",null,null,1,0,0,112136.28000000001]
[null,"GUANAJUATO","AIMK880805R10","AIMK880805MGTRXR05  ","KARLA GABRIELA ARIAS MUÑOZ              ","11APT0001T",null,null,null,"X",null,null,null,null,null,null,null,null,null,null,null,1,0,0,69173.51999999999]
[null,"GUANAJUATO","AOFA670123A81","AOFA670123MGTBLD06  ","ADRIANA DEL CARM ABONCE FLORES          ","11DPT0011X",null,null,null,"X",null,null,null,null,null,null,null,null,null,null,null,1,0,0,79722.67]
[null,"GUANAJUATO","AOGI790809G38","AOGI790809MGTLRM04  ","IMELDA SUSANA ALONSO GARCIA             ","11APT0001T",null,null,null,"X",null,null,null,null,null,null,null,null,null,null,null,1,0,0,67251.63]
[null,"GUANAJUATO","AOLJ820429DY4","AOLJ820429HGTCPL06  ","JOEL ADOLFO ACOSTA LOPEZ                ","11DPT0007K",null,null,null,"X",null,null,null,null,null,null,null,null,null,null,null,1,0,0,26713.14]
[null,"GUANAJUATO","AORJ6109147M3","AORJ610914HDFMZR05  ","JORGE AMOR RUIZ                         ","11APT0001T",null,null,null,null,null,null,null,null,null,null,null,null,"X",null,null,1,0,0,112136.28000000001]
[null,"GUANAJUATO","AOVP751006KA9","AOVP751006MGTLLL04  ","MA. DEL PILAR ALMONACI VALADEZ          ","11DPT0003O",null,null,null,"X",null,null,null,null,null,null,null,null,null,null,null,1,0,0,71867.250000000015]
[null,"GUANAJUATO","AUDM660425P52","AUDM660425MGTGRR18  ","MIRIAM AGUILAR DURON                    ","11DPT0001Q",null,null,null,"X",null,null,null,null,null,null,null,null,null,null,null,1,0,0,108835.01999999999]
[null,"GUANAJUATO","AUPM640422KR2","AUPM640422HGTGLR03  ","MARTIN AGUIRRE PALMERIN                 ","11DPT0004N",null,null,null,"X",null,null,null,null,null,null,null,null,null,null,null,1,0,0,35804.400000000001]
[null,"GUANAJUATO","BACM8402274W0","BACM840227HGTRNG03  ","MIGUEL ANGEL BARRON CONEJO              ","11DPT0001Q",null,null,null,"X",null,null,null,null,null,null,null,null,null,null,null,1,0,0,73109.76999999999]
[null,"GUANAJUATO","BAGJ5004309G9","BAGJ500430HGTRRR03  ","JORGE BARRERA GARCIA                    ","11DPT0011X",null,null,null,"X",null,null,null,null,null,null,null,null,null,null,null,1,0,0,34845.979999999996]
[null,"GUANAJUATO","BAGS470901EG4","BAGS470901MGTRRL03  ","SILVIA BARRERA GARCIA                   ","11DPT0011X",null,null,null,"X",null,null,null,null,null,null,null,null,null,null,null,1,0,0,36370.800000000003]
[null,"GUANAJUATO","BAJR800429CA7","BAJR800429MGTLRC00  ","ROCIO BALDERAS JUAREZ                   ","11DPT0008J",null,null,null,"X",null,null,null,null,null,null,null,null,null,null,null,1,0,0,40246.610000000008]
[null,"GUANAJUATO","SIRO740717FV0","SIRO740717HGTRCS06","OSWALDO SIERRA ROCHA","11APT0001T",null,null,null,"X",null,null,null,null,null,null,null,null,null,null,null,1,0,0,33927.020000000004]
[null,"GUANAJUATO","BAMJ651013MA3","BAMJ651013HGTRRN08  ","JUAN PEDRO BARBOSA MORALES              ","11DPT0013V",null,null,null,"X",null,null,null,null,null,null,null,null,null,null,null,1,0,0,65850.78]
[null,"GUANAJUATO","BAPA711019KLA","BAPA711019MGTRRN03  ","ANA LOURDES BARAJAS PEREZ               ","11DPT0007K",null,null,null,"X",null,null,null,null,null,null,null,null,null,null,null,1,0,0,69629.820000000007]
[null,"GUANAJUATO","BAQL620315PN5","BAQL620315HGTRRS00  ","LUIS MANUEL BRAVO QUIROZ                ","11DPT0005M",null,null,null,"X",null,null,null,null,null,null,null,null,null,null,null,1,0,0,100610.91]
[null,"GUANAJUATO","BARJ8305267S1","BARJ830526HGTRYN02  ","JUAN ANGEL BRAVO REYES                  ","11DPT0008J",null,null,null,"X",null,null,null,null,null,null,null,null,null,null,null,1,0,0,72130.079999999987]
[null,"GUANAJUATO","BASS600608U7A","BASS600608MGTRRL08  ","MARIA SOLEDAD ROS BRAVO SERRANO         ","11DPT0005M",null,null,null,"X",null,null,null,null,null,null,null,null,null,null,null,1,0,0,37720.559999999998]
[null,"GUANAJUATO","BAUM780104T8A","BAUM780104MGTRRC01  ","MICAELA BARCENAS URBINA                 ","11DPT0010Y",null,null,null,"X",null,null,null,null,null,null,null,null,null,null,null,1,0,0,28420.489999999998]
[null,"GUANAJUATO","BAUR7105213K8","BAUR710521MDFRRT02  ","RITA BARCENAS URBINA                    ","11DPT0001Q",null,null,null,"X",null,null,null,null,null,null,null,null,null,null,null,1,0,0,40101.800000000003]
[null,"GUANAJUATO","BEEJ790327230","BEEJ790327HGTLSN06  ","JUAN GUSTAVO BELMAN ESPINOSA            ","11DPT0001Q",null,null,null,"X",null,null,null,null,null,null,null,null,null,null,null,1,0,0,28690.350000000002]
[null,"GUANAJUATO","BERC880813NK7","BERC880813MGTLMN05  ","CINDIA ELIZABETH BELTRAN RAMOS          ","11DPT0002P",null,null,null,"X",null,null,null,null,null,null,null,null,null,null,null,1,0,0,33417.33]
[null,"GUANAJUATO","BUSG720302VE9","BUSG720302MGTLND02  ","MA. GUADALUPE BULLONS SANTIAGO          ","11DPT0003O",null,null,null,"X",null,null,null,null,null,null,null,null,null,null,null,1,0,0,33193.019999999997]
[null,"GUANAJUATO","CAAO740517PC6","CAAO740517HGTMRC05  ","OCTAVIANO CAMPOS ARRIAGA                ","11DPT0008J",null,null,null,"X",null,null,null,null,null,null,null,null,null,null,null,1,0,0,71735.62]
[null,"GUANAJUATO","CACF600221UD2","CACF600221HSPMSR07  ","FORTUNATO CAMACHO CASTILLO              ","11DPT0003O",null,null,null,"X",null,null,null,null,null,null,null,null,null,null,null,1,0,0,27777.410000000003]
[null,"GUANAJUATO","CACL650308V86","CACL650308MGTMLZ03  ","MA. DE LA LUZ CAMARILLO COLLAZO         ","11DPT0007K",null,null,null,"X",null,null,null,null,null,null,null,null,null,null,null,1,0,0,103025.16999999998]
[null,"GUANAJUATO","CADG5812029W6","CADG581202MGTHLR09  ","GRACIELA CHAVEZ DELGADO                 ","11DPT0007K",null,null,null,"X",null,null,null,null,null,null,null,null,null,null,null,1,0,0,43355.360000000001]
[null,"GUANAJUATO","CAGM670126RV9","CAGM670126MGTHNR09  ","MARTHA DELIA CHAVEZ GONZALEZ            ","11DPT0003O",null,null,null,"X",null,null,null,null,null,null,null,null,null,null,null,1,0,0,98777.51999999999]
[null,"GUANAJUATO","CAGR660928KD7","CAGR660928MGTSNB07  ","RUBICELIA CASTRO GONZALEZ               ","11DPT0005M",null,null,null,"X",null,null,null,null,null,null,null,null,null,null,null,1,0,0,84912.910000000018]
[null,"GUANAJUATO","CAGT7903078F3","CAGT790307HGTMRM01  ","TOMAS ESTEBAN CAMACHO GARCIA            ","11DPT0001Q",null,null,null,"X",null,null,null,null,null,null,null,null,null,null,null,1,0,0,27641.300000000003]
[null,"GUANAJUATO","CALA611023U79","CALA611023MZSRZD15  ","ADRIANA CARDENAS LOZA                   ","11DPT0003O",null,null,null,"X",null,null,null,null,null,null,null,null,null,null,null,1,0,0,89169.609999999986]
[null,"GUANAJUATO","CALA7006204L0","CALA700620MGTMPL09  ","ALEJANDRA CAMACHO LOPEZ                 ","11APT0001T",null,null,null,"X",null,null,null,null,null,null,null,null,null,null,null,1,0,0,69064.67]
[null,"GUANAJUATO","CALA880830IGA","CALA880830MGTLPD08  ","ADRIANA CALDERON LOPEZ                  ","11DPT0011X",null,null,null,"X",null,null,null,null,null,null,null,null,null,null,null,1,0,0,33030.989999999991]
[null,"GUANAJUATO","CAML640420FH8","CAML640420HDFSRS06  ","JOSE LUIS CASILLAS MIRANDA              ","11DPT0005M",null,null,null,"X",null,null,null,null,null,null,null,null,null,null,null,1,0,0,36580.69]
[null,"GUANAJUATO","CAML820820U36","CAML820820HGTNNS09  ","LUIS MIGUEL CANO MENDOZA                ","11DPT0013V",null,null,null,"X",null,null,null,null,null,null,null,null,null,null,null,1,0,0,59899.350000000013]
[null,"GUANAJUATO","CANS730714K3A","CANS730714MGTSTR04  ","SARA CASTILLO NIETO                     ","11DPT0005M",null,null,null,"X",null,null,null,null,null,null,null,null,null,null,null,1,0,0,40808.449999999997]
[null,"GUANAJUATO","CAPE530526869","CAPE530526MGTRRL07  "," M.ELENA CARDIEL PEREZ                  ","11DPT0007K",null,null,null,"X",null,null,null,null,null,null,null,null,null,null,null,1,0,0,70210.7]
[null,"GUANAJUATO","CAPR810416EKA","CAPR810416HGTLRB07  ","ROBERTO CALDERON PEREZ                  ","11DPT0002P",null,null,null,"X",null,null,null,null,null,null,null,null,null,null,null,1,0,0,55751.239999999991]
[null,"GUANAJUATO","CARM520206UK0","CARM520206HGTBCR09  ","MARIO CABRERA RICO                      ","11DPT0001Q",null,null,null,null,null,null,null,null,null,null,null,null,"X",null,null,1,0,0,90974.399999999994]
[null,"GUANAJUATO","CASI750121969","CASI750121HGTSNS13  ","ISAAC CASTRO SANTILLANES                ","11DPT0002P",null,null,null,"X",null,null,null,null,null,null,null,null,null,null,null,1,0,0,43765.420000000006]
[null,"GUANAJUATO","CAUF560705QGA","CAUF560705HGTHRL05  ","FILOMENO CHAGOYA URRUTIA                ","11DPT0007K",null,null,null,"X",null,null,null,null,null,null,null,null,null,null,null,1,0,0,34041.14]
[null,"GUANAJUATO","CAVT730609CSA","CAVT730609MGTRRR12  ","MA. TERESA CARPIO VARGAS                ","11DPT0002P",null,null,null,"X",null,null,null,null,null,null,null,null,null,null,null,1,0,0,16235.079999999998]
[null,"GUANAJUATO","CAJU780116N75","CAXJ780116HGTMXN05  ","JUAN JOSE CAMACHO                       ","11APT0001T",null,null,null,"X",null,null,null,null,null,null,null,null,null,null,null,1,0,0,79188.2]
[null,"GUANAJUATO","CEFS680324L40","CEFS680324HJCRLL06  ","SAUL CERPA FLORES                       ","11DPT0001Q",null,null,null,"X",null,null,null,null,null,null,null,null,null,null,null,1,0,0,31630.630000000005]
[null,"GUANAJUATO","CELM960313G89","CELM960313MGTRPY09  ","MAYRA FRANCISCA CERVANTES LOPEZ         ","11DPT0009I",null,null,null,"X",null,null,null,null,null,null,null,null,null,null,null,1,0,0,13189.51]
[null,"GUANAJUATO","CAGX680903LH5","CAGA680903HGTHNL06","ALBERTO CHAO GONZALEZ","11DPT0002P",null,null,null,null,null,null,null,null,null,null,null,null,"X",null,null,1,0,0,90974.399999999994]
[null,"GUANAJUATO","CESA870418K76","CESA870418MGTRMN08  ","ANA GABRIELA CERVERA SAMANO             ","11APT0001T",null,null,null,"X",null,null,null,null,null,null,null,null,null,null,null,1,0,0,30630.690000000002]
[null,"GUANAJUATO","CEVB731120C46","CEVB731120HGTDRR00  ","BERNARDO CEDILLO VERA                   ","11DPT0014U",null,null,null,"X",null,null,null,null,null,null,null,null,null,null,null,1,0,0,37138.300000000003]
[null,"GUANAJUATO","CIEE710907TK8","CIEE710907HDFSSD04  ","EDUARDO ALEJANDR CISNEROS ESPINOZA      ","11DPT0002P",null,null,null,"X",null,null,null,null,null,null,null,null,null,null,null,1,0,0,27577.15]
[null,"GUANAJUATO","CIGP680809983","CIGP680809HGTDRB07  ","PABLO MARTIN CID GARCIA                 ","11DPT0006L",null,null,null,"X",null,null,null,null,null,null,null,null,null,null,null,1,0,0,97280.01999999999]
[null,"GUANAJUATO","COAD7908184B7","COAD790818MGTVRN00  ","DENY COVARRUBIAS ARREGUIN               ","11DPT0005M",null,null,null,"X",null,null,null,null,null,null,null,null,null,null,null,1,0,0,27091.14]
[null,"GUANAJUATO","COCA760915JU4","COCA760915HGTRLL02  ","ALEJANDRO CORIA CALDERON                ","11DPT0002P",null,null,null,"X",null,null,null,null,null,null,null,null,null,null,null,1,0,0,27378.83]
[null,"GUANAJUATO","COCM710215JF9","COCM710215HMNBMR04  ","MARIO COBIAN CAMACHO                    ","11DPT0009I",null,null,null,"X",null,null,null,null,null,null,null,null,null,null,null,1,0,0,102178.44]
[null,"GUANAJUATO","COMI671203D76","COMI671203MGTNLR18  ","MA. IRAIS CONTRERAS MALDONADO           ","11DPT0012W",null,null,null,null,null,null,null,null,null,null,null,null,"X",null,null,1,0,0,77122.2]
[null,"GUANAJUATO","COMP630327QN2","COMP630327HGTNRB00  ","PABLO GERARDO CONTRERAS MARTINEZ        ","11DPT0006L",null,null,null,"X",null,null,null,null,null,null,null,null,null,null,null,1,0,0,112161.28999999998]
[null,"GUANAJUATO","CORJ890525619","CORJ890525HGTRMR07  ","JORGE ARMANDO CORONA RAMIREZ            ","11DPT0010Y",null,null,null,"X",null,null,null,null,null,null,null,null,null,null,null,1,0,0,28609.85]
[null,"GUANAJUATO","COVA700831PW6","COVA700831MGRNRM03  ","AMADA CONDE VERA                        ","11DPT0008J",null,null,null,"X",null,null,null,null,null,null,null,null,null,null,null,1,0,0,40434.700000000004]
[null,"GUANAJUATO","COVF720114623","COVF720114HGTNRR02  ","FRANCISCO JAVIER CONDE VERA             ","11DPT0008J",null,null,null,"X",null,null,null,null,null,null,null,null,null,null,null,1,0,0,27091.14]
[null,"GUANAJUATO","CUAC760716LS6","CUAC760716HGTVCR00  ","JOSE CARMEN NOE CUEVAS ACOSTA           ","11DPT0007K",null,null,null,null,null,null,null,null,null,null,null,null,"X",null,null,1,0,0,77122.2]
[null,"GUANAJUATO","CUHC5501119F9","CUHC550111HGTLNS08  ","CESAR CUELLAR HINOJOSA                  ","11DPT0002P",null,null,null,"X",null,null,null,null,null,null,null,null,null,null,null,1,0,0,39925.44000000001]
[null,"GUANAJUATO","CUTR610723JC8","CUTR610723MGTLTS06  ","ROSA MARIA CUELLAR TETUAN               ","11DPT0010Y",null,null,null,"X",null,null,null,null,null,null,null,null,null,null,null,1,0,0,44559.72]
[null,"GUANAJUATO","CUVL741004T6A","CUVL741004MGTRRR08  ","LAURA CRUZ VARGAS                       ","11DPT0010Y",null,null,null,"X",null,null,null,null,null,null,null,null,null,null,null,1,0,0,96677.56]
[null,"GUANAJUATO","CUVY830805JA3","CUVY830805MGTSRH00  ","YAHAIRA ALICIA E CUESTAS VARGAS         ","11DPT0002P",null,null,null,"X",null,null,null,null,null,null,null,null,null,null,null,1,0,0,24831.170000000006]
[null,"GUANAJUATO","CACX500817KXA","CXCA500817MGTBMN03  ","ANITA CABEZA CAMARGO                    ","11DPT0009I",null,null,null,"X",null,null,null,null,null,null,null,null,null,null,null,1,0,0,7169.45]
[null,"GUANAJUATO","DAFT8701278E1","DAFT870127MZSVLN04  ","TANIA LIZETH DAVILA FLORES              ","11DPT0003O",null,null,null,"X",null,null,null,null,null,null,null,null,null,null,null,1,0,0,27810.83]
[null,"GUANAJUATO","DEHM860518J96","DEHM860518HMCLRG02  ","MIGUEL ANGEL DELGADO HERNANDEZ          ","11DPT0002P",null,null,null,"X",null,null,null,null,null,null,null,null,null,null,null,1,0,0,31156.120000000003]
[null,"GUANAJUATO","DEJA790116B16","DEJA790116HMCLMN00  ","JOSE ANTONIO DELGADO JIMENEZ            ","11DPT0002P",null,null,null,"X",null,null,null,null,null,null,null,null,null,null,null,1,0,0,91247.950000000012]
[null,"GUANAJUATO","DIJL7203079A3","DIJL720307MGTGCR01  ","MA. DE LOURDES DIEGO JACOBO             ","11DPT0004N",null,null,null,"X",null,null,null,null,null,null,null,null,null,null,null,1,0,0,37610.030000000006]
[null,"GUANAJUATO","DONA780620F80","DONA780620HGTMTL04  ","ALEJANDRO DOMINGUEZ NIETO               ","11DPT0002P",null,null,null,"X",null,null,null,null,null,null,null,null,null,null,null,1,0,0,25303.690000000002]
[null,"GUANAJUATO","DOZL761001RD2","DOZL761001HMNMVS18  ","LUIS ADRIAN DOMINGUEZ ZAVALA            ","11APT0001T",null,null,null,null,null,null,null,null,null,null,null,null,"X",null,null,1,0,0,77122.2]
[null,"GUANAJUATO","DUAJ8704098Q4","DUAJ870409HGTRGR00  ","JORGE LUIS DURAN AGUILERA               ","11DPT0004N",null,null,null,"X",null,null,null,null,null,null,null,null,null,null,null,1,0,0,23359.480000000003]
[null,"GUANAJUATO","DUFC8505038R7","DUFC850503MGTRLR04  ","MARIA CRUZ DURAN FLORES                 ","11DPT0010Y",null,null,null,"X",null,null,null,null,null,null,null,null,null,null,null,1,0,0,32887.730000000003]
[null,"GUANAJUATO","EACA751029DJ3","EACA751029MGTSRN06  ","MA DE LOS ANGELE ESPARZA CORONA         ","11DPT0013V",null,null,null,"X",null,null,null,null,null,null,null,null,null,null,null,1,0,0,27901.14]
[null,"GUANAJUATO","EAFM570902GM4","EAFM570902HGTSLS06  ","MOISES ESTRADA FLORES                   ","11DPT0011X",null,null,null,"X",null,null,null,null,null,null,null,null,null,null,null,1,0,0,34443.56]
[null,"GUANAJUATO","EAMG8704104G8","EAMG870410MGTSRR00  ","GRECIA ROXANA ESPARZA MARES             ","11DPT0006L",null,null,null,"X",null,null,null,null,null,null,null,null,null,null,null,1,0,0,26864.27]
[null,"GUANAJUATO","EAVG760111SA9","EAVG760111MGTSLD04  ","MA GUADALUPE ESPARZA VALENCIA           ","11APT0001T",null,null,null,"X",null,null,null,null,null,null,null,null,null,null,null,1,0,0,58192.92]
[null,"GUANAJUATO","EICA641219IS3","EICA641219MGTLRL01  ","ALTAGRACIA ELIZARRARAS CERVANTES        ","11DPT0009I",null,null,null,"X",null,null,null,null,null,null,null,null,null,null,null,1,0,0,47398.97]
[null,"GUANAJUATO","EICA780130NQ1","EICA780130MGTSRN03  ","ANA MARIA ESPINOZA CERVANTES            ","11DPT0001Q",null,null,null,"X",null,null,null,null,null,null,null,null,null,null,null,1,0,0,32978.99]
[null,"GUANAJUATO","EICT8203073V8","EICT820307HGTSRM05  ","TOMAS ROGELIO ESPINOZA CERVANTES        ","11DPT0008J",null,null,null,"X",null,null,null,null,null,null,null,null,null,null,null,1,0,0,31195.26]
[null,"GUANAJUATO","EIMJ620524ID9","EIMJ620524HGTLRS02  ","JOSE ELIAS MORENO                       ","11DPT0009I",null,null,null,"X",null,null,null,null,null,null,null,null,null,null,null,1,0,0,113717.74]
[null,"GUANAJUATO","EIMJ880812BK0","EIMJ880812MGTLRH07  ","JHOANA IVON ELIZALDE MARTINEZ           ","11DPT0006L",null,null,null,"X",null,null,null,null,null,null,null,null,null,null,null,1,0,0,25458.550000000003]
[null,"GUANAJUATO","EIPA861113S53","EIPA861113HGTSRB08  ","JOSE ABRAHAM ESPINOZA PORRAS            ","11APT0001T",null,null,null,"X",null,null,null,null,null,null,null,null,null,null,null,1,0,0,29230.34]
[null,"GUANAJUATO","EIPM591011QG5","EIPM591011MGTSRR09  ","MARTHA ALICIA ESPINOSA PEREZ            ","11DPT0002P",null,null,null,"X",null,null,null,null,null,null,null,null,null,null,null,1,0,0,85278.83]
[null,"GUANAJUATO","EISB881118DD0","EISB881118MGTSPT05  ","BETSAIDA MAGDALE ESPINOZA SEPULVEDA     ","11DPT0010Y",null,null,null,"X",null,null,null,null,null,null,null,null,null,null,null,1,0,0,29702.300000000003]
[null,"GUANAJUATO","EITG6112096F3","EITG611209MDFSBD05  ","MARIA GUADALUPE ESPINOSA TABLEROS       ","11DPT0009I",null,null,null,"X",null,null,null,null,null,null,null,null,null,null,null,1,0,0,66452.899999999994]
[null,"GUANAJUATO","EIVC851005GF2","EIVC851005HGTLRR07  ","CARLOS ELIZARRARAS VARGAS               ","11DPT0009I",null,null,null,"X",null,null,null,null,null,null,null,null,null,null,null,1,0,0,25352.300000000003]
[null,"GUANAJUATO","EUVA760924363","EUVA760924HGTSLN02  ","ANTONIO ESQUEDA VILLALON                ","11DPT0012W",null,null,null,"X",null,null,null,null,null,null,null,null,null,null,null,1,0,0,61142.880000000005]
[null,"GUANAJUATO","FAAF540219KI2","FAAF540219MGTRGX06  ","MARIA FE FRAUSTO AGUILAR                ","11DPT0003O",null,null,null,"X",null,null,null,null,null,null,null,null,null,null,null,1,0,0,41450.720000000001]
[null,"GUANAJUATO","FABC530210FR5","FABC530210MDFRRR00  ","MARIA DEL CARMEN FRANCO BOURET          ","11DPT0001Q",null,null,null,"X",null,null,null,null,null,null,null,null,null,null,null,1,0,0,37536.18]
[null,"GUANAJUATO","FIGP640907QP7","FIGP640907HGTGRD01  ","PEDRO FIGUEROA GARCIA                   ","11DPT0005M",null,null,null,"X",null,null,null,null,null,null,null,null,null,null,null,1,0,0,37296.720000000001]
[null,"GUANAJUATO","FIRG871015PB5","FIRG871015MGTGMB07  ","GABRIELA FIGUEROA RAMIREZ               ","11DPT0005M",null,null,null,"X",null,null,null,null,null,null,null,null,null,null,null,1,0,0,26540.300000000003]
[null,"GUANAJUATO","FOCJ7406233X9","FOCJ740623MGTLLS01  ","JOSEFINA FLORES CALVA                   ","11DPT0010Y",null,null,null,"X",null,null,null,null,null,null,null,null,null,null,null,1,0,0,38983.24]
[null,"GUANAJUATO","HEPL670716M36","HEPL670716HGTRRS02","JOSE LUIS HERNANDEZ PEREZ","11APT0001T",null,null,null,null,null,null,null,null,null,null,null,null,"X",null,null,1,0,0,59438.720000000001]
[null,"GUANAJUATO","FOGH740517223","FOGH740517HGTLTC07  ","HECTOR FLORES GUTIERREZ                 ","11DPT0012W",null,null,null,"X",null,null,null,null,null,null,null,null,null,null,null,1,0,0,39062.62999999999]
[null,"GUANAJUATO","FOSA610902SG9","FOSA610902MGTLNL09  ","ALEJANDRA PATRICI FLORES SANDOVAL       ","11DPT0003O",null,null,null,"X",null,null,null,null,null,null,null,null,null,null,null,1,0,0,71867.250000000015]
[null,"GUANAJUATO","FOTE790312PL3","FOTE790312MGTLRR00  ","ERIKA DEL ROCIO FLORES TERRONES         ","11APT0001T",null,null,null,null,null,null,null,null,null,null,null,null,"X",null,null,1,0,0,77122.2]
[null,"GUANAJUATO","FOJU6701074Z1","FOXJ670107HGTLXN09  ","JUAN ANTONIO FLORES                     ","11DPT0008J",null,null,null,"X",null,null,null,null,null,null,null,null,null,null,null,1,0,0,70192.53]
[null,"GUANAJUATO","GAAE770204JK3","GAAE770204MDFYLL06  ","ELIA GAYTAN ALCARAZ                     ","11DPT0014U",null,null,null,null,null,null,null,null,null,null,null,null,"X",null,null,1,0,0,89087.46]
[null,"GUANAJUATO","GAAR6310249B2","GAAR631024HGTLRF01  ","RAFAEL GALLEGOS ARELLANO                ","11DPT0001Q",null,null,null,"X",null,null,null,null,null,null,null,null,null,null,null,1,0,0,42522.97]
[null,"GUANAJUATO","GABI850102NDA","GABI850102MGTRRS03  ","MARIA ISABEL GARCIA BARRIENTOS          ","11DPT0014U",null,null,null,"X",null,null,null,null,null,null,null,null,null,null,null,1,0,0,92914.96]
[null,"GUANAJUATO","GACR6704153I2","GACR670415MGTRRT06  ","MARIA RITA GARCIA CERRATO               ","11DPT0004N",null,null,null,"X",null,null,null,null,null,null,null,null,null,null,null,1,0,0,38131.009999999995]
[null,"GUANAJUATO","GAFV6609298F9","GAFV660929MGTRRR06  ","VERONICA ROCIO GRANADOS FRIAS           ","11DPT0008J",null,null,null,"X",null,null,null,null,null,null,null,null,null,null,null,1,0,0,37736.910000000003]
[null,"GUANAJUATO","GAGY700725MG2","GAGY700725MGTRNS04  ","YESENIA GRANADOS GONZALEZ               ","11DPT0012W",null,null,null,null,null,null,null,null,null,null,null,null,"X",null,null,1,0,0,91124.75999999998]
[null,"GUANAJUATO","GAHJ561230M55","GAHJ561230HGTRRN04  ","JUAN GRANADOS HERNANDEZ                 ","11DPT0002P",null,null,null,"X",null,null,null,null,null,null,null,null,null,null,null,1,0,0,94634.86]
[null,"GUANAJUATO","GAJJ660505P94","GAJJ660505HGTRMN06  ","JUAN GARCIA JIMENEZ                     ","11DPT0011X",null,null,null,"X",null,null,null,null,null,null,null,null,null,null,null,1,0,0,38055.770000000004]
[null,"GUANAJUATO","GALE770303QD2","GALE770303HGTRSD04  ","EDUARDO GARCIA LESSO                    ","11DPT0001Q",null,null,null,"X",null,null,null,null,null,null,null,null,null,null,null,1,0,0,45582.080000000002]
[null,"GUANAJUATO","GALJ930324KX8","GALJ930324HGTRPN06  ","JUAN CARLOS GARCIA LOPEZ                ","11DPT0003O",null,null,null,"X",null,null,null,null,null,null,null,null,null,null,null,1,0,0,27000.83]
[null,"GUANAJUATO","GAMM680220L32","GAMM680220MGTLRR01  ","MARTHA NORMA GALLEGOS MARISCAL          ","11DPT0001Q",null,null,null,"X",null,null,null,null,null,null,null,null,null,null,null,1,0,0,40562.65]
[null,"GUANAJUATO","GAOH8102061G0","GAOH810206HDFLLM04  ","HUMBERTO ISRAEL GALVAN OLVERA           ","11DPT0001Q",null,null,null,"X",null,null,null,null,null,null,null,null,null,null,null,1,0,0,27378.83]
[null,"GUANAJUATO","GARJ690126G3A","GARJ690126HQTRVN01  ","JOSÉ JUAN GARCIA RIVERA                 ","11DPT0003O",null,null,null,"X",null,null,null,null,null,null,null,null,null,null,null,1,0,0,21737.480000000003]
[null,"GUANAJUATO","GARJ840526678","GARJ840526HGTRMV04  ","JAVIER ARTURO GARCIA ROMERO             ","11DPT0007K",null,null,null,"X",null,null,null,null,null,null,null,null,null,null,null,1,0,0,31153.970000000008]
[null,"GUANAJUATO","GARL720427FX0","GARL720427MGTRMZ12  ","LUZ MA. GARCIA ROMERO                   ","11DPT0007K",null,null,null,"X",null,null,null,null,null,null,null,null,null,null,null,1,0,0,37530.850000000006]
[null,"GUANAJUATO","GARS670416A54","GARS670416MGTRYL05  ","SILVIA GARCIA REYES                     ","11DPT0004N",null,null,null,"X",null,null,null,null,null,null,null,null,null,null,null,1,0,0,77504.00999999998]
[null,"GUANAJUATO","GASM690929112","GASM690929HDFRLR02  ","MARIO MIGUEL GARCIA SALINAS             ","11DPT0013V",null,null,null,"X",null,null,null,null,null,null,null,null,null,null,null,1,0,0,53545.520000000011]
[null,"GUANAJUATO","GATG451128UX1","GATG451128HDFYRS05  ","GUSTAVO GAYTAN TORRES                   ","11DPT0002P",null,null,null,"X",null,null,null,null,null,null,null,null,null,null,null,1,0,0,73109.76999999999]
[null,"GUANAJUATO","GAZE690718GX3","GAZE690718MGTRVL07  ","ELIZABETH GARCIA ZAVALA                 ","11DPT0004N",null,null,null,"X",null,null,null,null,null,null,null,null,null,null,null,1,0,0,38724.210000000006]
[null,"GUANAJUATO","GIAJ670517N7A","GIAJ670517HGTRLN07  ","JUAN MANUEL GRIMALDO ALFARO             ","11DPT0001Q",null,null,null,"X",null,null,null,null,null,null,null,null,null,null,null,1,0,0,41512.81]
[null,"GUANAJUATO","GOAA770911HT1","GOAA770911MGTMLN09  ","ANA ROSA GOMEZ ALBA                     ","11DPT0005M",null,null,null,"X",null,null,null,null,null,null,null,null,null,null,null,1,0,0,56223.21]
[null,"GUANAJUATO","GOCH8410237R3","GOCH841023HGTNBC04  ","HECTOR HUGO GONZALEZ CABRERA            ","11DPT0008J",null,null,null,"X",null,null,null,null,null,null,null,null,null,null,null,1,0,0,22422.480000000003]
[null,"GUANAJUATO","GOGD870617R99","GOGD870617HNLMRN00  ","JOSE DANIEL GOMEZ GARZA                 ","11DPT0010Y",null,null,null,"X",null,null,null,null,null,null,null,null,null,null,null,1,0,0,54875.649999999994]
[null,"GUANAJUATO","GOGE730923ME8","GOGE730923MMNNNL00  ","ELIZABETH GONZALEZ GONZALEZ             ","11DPT0004N",null,null,null,"X",null,null,null,null,null,null,null,null,null,null,null,1,0,0,38525.920000000006]
[null,"GUANAJUATO","GOGI750427GM1","GOGI750427HMCMYS02  ","ISRAEL GOMEZ GAYTAN                     ","11DPT0012W",null,null,null,"X",null,null,null,null,null,null,null,null,null,null,null,1,0,0,94687.34]
[null,"GUANAJUATO","GOGK890902JT3","GOGK890902MGTNLR04  ","KARLA RAFAELA GONZALEZ GALLARDO         ","11DPT0001Q",null,null,null,"X",null,null,null,null,null,null,null,null,null,null,null,1,0,0,52989.56]
[null,"GUANAJUATO","GOGL6009014D1","GOGL600901MGTNLN08  ","LINA ENGRACIA GONZALEZ GALLARDO         ","11DPT0007K",null,null,null,"X",null,null,null,null,null,null,null,null,null,null,null,1,0,0,43759.430000000008]
[null,"GUANAJUATO","GOLA7812182KA","GOLA781218MQTMPN05  ","ANA GLORIA GOMEZ LOPEZ                  ","11APT0001T",null,null,null,"X",null,null,null,null,null,null,null,null,null,null,null,1,0,0,62971.89]
[null,"GUANAJUATO","GOLR590503HDA","GOLR590503HGTNDB04  ","ROBERTO GONZALEZ LEDESMA                ","11DPT0005M",null,null,null,null,null,null,null,null,null,null,null,null,"X",null,null,1,0,0,77122.2]
[null,"GUANAJUATO","GOMG8812289D6","GOMG881228HQTMLB01  ","GABRIEL GOMEZ MOLINERO                  ","11DPT0001Q",null,null,null,"X",null,null,null,null,null,null,null,null,null,null,null,1,0,0,49304.340000000004]
[null,"GUANAJUATO","GOML690426EW2","GOML690426MGTNDZ08  ","LUZ ESTELA GONZALEZ MEDINA              ","11DPT0003O",null,null,null,"X",null,null,null,null,null,null,null,null,null,null,null,1,0,0,73880.08]
[null,"GUANAJUATO","GONM790924B46","GONM790924HGTNVG00  ","MIGUEL ANGEL GONZALEZ NAVARRO           ","11APT0001T",null,null,null,"X",null,null,null,null,null,null,null,null,null,null,null,1,0,0,62154.97]
[null,"GUANAJUATO","GOSA4507257Y0","GOXS450725HGTNXN07  ","SANTIAGO GONZALEZ                       ","11DPT0011X",null,null,null,"X",null,null,null,null,null,null,null,null,null,null,null,1,0,0,34242.769999999997]
[null,"GUANAJUATO","GUFO930509HR3","GUFO930509MGTVRL06  ","OLIVIA GUEVARA FARFAN                   ","11DPT0006L",null,null,null,"X",null,null,null,null,null,null,null,null,null,null,null,1,0,0,28090.300000000003]
[null,"GUANAJUATO","GUFV820306TSA","GUFV820306HGRZLC04  ","VICTOR MANUEL GUZMAN FLORES             ","11DPT0003O",null,null,null,"X",null,null,null,null,null,null,null,null,null,null,null,1,0,0,78777.97]
[null,"GUANAJUATO","GUGA7312084M6","GUGA731208HGTTZL01  ","ALFREDO GUTIERREZ GUZMAN                ","11DPT0013V",null,null,null,"X",null,null,null,null,null,null,null,null,null,null,null,1,0,0,34787]
[null,"GUANAJUATO","GUGE730901EC4","GUGE730901MGTTNS07  ","ESPERANZA GUTIERREZ GONZALEZ            ","11DPT0007K",null,null,null,"X",null,null,null,null,null,null,null,null,null,null,null,1,0,0,43732.15]
[null,"GUANAJUATO","GUGM650603GP3","GUGM650603MJCTZR08  ","MA. MARTINA GUTIERREZ GUZMAN            ","11DPT0007K",null,null,null,"X",null,null,null,null,null,null,null,null,null,null,null,1,0,0,110267.82999999999]
[null,"GUANAJUATO","GUJE870107661","GUJE870107MGTTRL01  ","ELIZABETH VERONI GUTIERREZ JUAREZ       ","11APT0001T",null,null,null,"X",null,null,null,null,null,null,null,null,null,null,null,1,0,0,54280.760000000009]
[null,"GUANAJUATO","GULH680121BP6","GULH680121HDFTPR01  ","HORACIO GUTIERREZ LOPEZ                 ","11DPT0005M",null,null,null,"X",null,null,null,null,null,null,null,null,null,null,null,1,0,0,27087.919999999998]
[null,"GUANAJUATO","GULM790929U80","GULM790929HGTRGG04  ","MIGUEL ANGEL GUERRERO LAGUNA            ","11DPT0002P",null,null,null,"X",null,null,null,null,null,null,null,null,null,null,null,1,0,0,33323.32]
[null,"GUANAJUATO","GUMB860612B77","GUMB860612MGTTRL01  ","BLANCA EDITH GUTIERREZ MORENO           ","11DPT0010Y",null,null,null,"X",null,null,null,null,null,null,null,null,null,null,null,1,0,0,33921.659999999996]
[null,"GUANAJUATO","GUPD810705I4A","GUPD810705HQTRDM04  ","DOMINGO DANIEL GUERRERO PADILLA         ","11DPT0010Y",null,null,null,null,null,null,null,null,null,null,null,null,"X",null,null,1,0,0,89087.46]
[null,"GUANAJUATO","GURG711212BH3","GURG711212MGTRXD01  ","MA GUADALUPE GUARDADO REA               ","11DPT0013V",null,null,null,"X",null,null,null,null,null,null,null,null,null,null,null,1,0,0,31163.119999999995]
[null,"GUANAJUATO","GUTR690427DSA","GUTR690427MDFPRC02  ","ROCIO GUAPO TORRECILLAS                 ","11DPT0008J",null,null,null,"X",null,null,null,null,null,null,null,null,null,null,null,1,0,0,37984.720000000001]
[null,"GUANAJUATO","GUZA720514FG4","GUZA720514MDFTVL06  ","ALEJANDRA GUTIERREZ ZAVALA              ","11DPT0009I",null,null,null,"X",null,null,null,null,null,null,null,null,null,null,null,1,0,0,39217.829999999994]
[null,"GUANAJUATO","HEBL680226MH6","HEBL680226HDFRNS05  ","LUIS FELIPE HERRERA BUENDIA             ","11DPT0007K",null,null,null,"X",null,null,null,null,null,null,null,null,null,null,null,1,0,0,34040.46]
[null,"GUANAJUATO","HECH720907NC1","HECH720907MDFRNL01  ","HILDA HERNANDEZ CANCHOLA                ","11APT0001T",null,null,null,"X",null,null,null,null,null,null,null,null,null,null,null,1,0,0,32386.669999999995]
[null,"GUANAJUATO","HECL500618L95","HECL500618HGTRRS04  ","JOSE LUIS HERNANDEZ CORTES              ","11DPT0010Y",null,null,null,"X",null,null,null,null,null,null,null,null,null,null,null,1,0,0,36523.090000000004]
[null,"GUANAJUATO","HECL6401228X2","HECL640122MDFRLT03  ","LETICIA HERNANDEZ CALVILLO              ","11DPT0003O",null,null,null,"X",null,null,null,null,null,null,null,null,null,null,null,1,0,0,42420.08]
[null,"GUANAJUATO","HECS621213HZ5","HECS621213HGTRLR02  ","SERGIO HERNANDEZ CALDERON               ","11DPT0005M",null,null,null,"X",null,null,null,null,null,null,null,null,null,null,null,1,0,0,43972.09]
[null,"GUANAJUATO","HEFM781229PE6","HEFM781229MGTRRL06  ","MARIA MILAGROS HERNANDEZ FRAUSTO        ","11DPT0003O",null,null,null,"X",null,null,null,null,null,null,null,null,null,null,null,1,0,0,28180.83]
[null,"GUANAJUATO","HEGC870427C96","HEGC870427HCSRNR00  ","CRISTOBAL DE JES HERNANDEZ GONZALEZ     ","11DPT0012W",null,null,null,"X",null,null,null,null,null,null,null,null,null,null,null,1,0,0,25352.300000000003]
[null,"GUANAJUATO","HEGN8708165Y4","HEGN870816MGTRRY05  ","NAYELI HERREJON GUERRERO                ","11DPT0006L",null,null,null,"X",null,null,null,null,null,null,null,null,null,null,null,1,0,0,25895.95]
[null,"GUANAJUATO","HEGS590916A12","HEGS590916HGTRMR05  ","SERAFIN HERNANDEZ GAMIÑO                ","11DPT0003O",null,null,null,"X",null,null,null,null,null,null,null,null,null,null,null,1,0,0,38481.009999999995]
[null,"GUANAJUATO","HEHA830216PP3","HEHA830216MGTRRL04  ","ALMA DELIA HERNANDEZ HERNANDEZ          ","11DPT0010Y",null,null,null,"X",null,null,null,null,null,null,null,null,null,null,null,1,0,0,28073.97]
[null,"GUANAJUATO","HEHA900701UB1","HEHA900701MGTRRN03  ","ANA LETICIA HERNANDEZ HERRERA           ","11DPT0003O",null,null,null,"X",null,null,null,null,null,null,null,null,null,null,null,1,0,0,27000.83]
[null,"GUANAJUATO","HELB7109192T6","HELB710919MGTRNT04  ","BEATRIZ HERNANDEZ LONA                  ","11DPT0010Y",null,null,null,"X",null,null,null,null,null,null,null,null,null,null,null,1,0,0,36350.399999999994]
[null,"GUANAJUATO","HELJ790519GT9","HELJ790519HGTRPN03  ","JUAN MANUEL HERNANDEZ LOPEZ             ","11DPT0013V",null,null,null,"X",null,null,null,null,null,null,null,null,null,null,null,1,0,0,39540.359999999993]
[null,"GUANAJUATO","HEMG620422565","HEMG620422MGTRRR08  ","GRACIELA HERNANDEZ MARTINEZ             ","11DPT0013V",null,null,null,"X",null,null,null,null,null,null,null,null,null,null,null,1,0,0,33309.729999999996]
[null,"GUANAJUATO","HEMM6706104M9","HEMM670610MGTRNR09  ","MA. MERCEDES HERRERA MANCERA            ","11DPT0001Q",null,null,null,"X",null,null,null,null,null,null,null,null,null,null,null,1,0,0,106475.01999999999]
[null,"GUANAJUATO","HEOS630818TG4","HEOS630818MDFRRN00  ","SONIA GUADALUPE HERNANDEZ OROZCO        ","11APT0001T",null,null,null,"X",null,null,null,null,null,null,null,null,null,null,null,1,0,0,96146.38]
[null,"GUANAJUATO","HEPL670716M36","HEPL670716HGTRRS02  ","JOSE LUIS HERNANDEZ PEREZ               ","11APT0001T",null,null,null,null,null,null,null,null,null,null,null,null,"X",null,null,1,0,0,29719.360000000001]
[null,"GUANAJUATO","HEPU760412GG8","HEPU760412HPLRRZ03  ","UZIEL HERNANDEZ PEREZ                   ","11DPT0014U",null,null,null,"X",null,null,null,null,null,null,null,null,null,null,null,1,0,0,28403.360000000001]
[null,"GUANAJUATO","HEVL6006012YA","HEVL600601HGTRLZ00  ","J.LUZ HERNANDEZ VELAZQUEZ               ","11DPT0010Y",null,null,null,"X",null,null,null,null,null,null,null,null,null,null,null,1,0,0,33300.99]
[null,"GUANAJUATO","HELU501011H62","HEXL501011HGTRXZ04  ","DE LA LUZ HERNANDEZ JOSE                ","11DPT0007K",null,null,null,"X",null,null,null,null,null,null,null,null,null,null,null,1,0,0,32264.270000000004]
[null,"GUANAJUATO","HIMK800908LB0","HIMK800908HGTNNR04  ","KRISTIAN MANUEL HINOJOSA MONROY         ","11DPT0010Y",null,null,null,"X",null,null,null,null,null,null,null,null,null,null,null,1,0,0,28660.699999999997]
[null,"GUANAJUATO","IAVC761114FE1","IAVC761114MNTBLL00  ","CLAUDIA ELIZABET IBARRA VILLANUEVA      ","11DPT0007K",null,null,null,"X",null,null,null,null,null,null,null,null,null,null,null,1,0,0,102542.31]
[null,"GUANAJUATO","JACF700609GI1","JACF700609HGTRML07  ","FELIPE JARAMILLO CAMPOS                 ","11DPT0008J",null,null,null,"X",null,null,null,null,null,null,null,null,null,null,null,1,0,0,26684.11]
[null,"GUANAJUATO","JALS470121DUA","JALS470121HMNMPR04  ","SERGIO JAIMES LOPEZ                     ","11DPT0006L",null,null,null,null,null,null,null,null,null,null,null,null,"X",null,null,1,0,0,90974.399999999994]
[null,"GUANAJUATO","JAMC821119QK9","JAMC821119MGTMSL07  ","CLAUDIA MARCELA JAIME MOSQUEDA          ","11DPT0007K",null,null,null,"X",null,null,null,null,null,null,null,null,null,null,null,1,0,0,27741.519999999997]
[null,"GUANAJUATO","JAMJ591122Q73","JAMJ591122HGTRNV07  ","JAVIER JARALEÑO MANCERA                 ","11DPT0001Q",null,null,null,"X",null,null,null,null,null,null,null,null,null,null,null,1,0,0,35445.380000000005]
[null,"GUANAJUATO","JILD710426DB9","JILD710426HGTMPR06  ","DARIO DAMIAN JIMENEZ LOPEZ              ","11DPT0011X",null,null,null,null,null,null,null,null,null,null,null,null,"X",null,null,1,0,0,90974.399999999994]
[null,"GUANAJUATO","JIOL8008248F7","JIOL800824MGTMRZ11  ","LIZETH ARIADNA JIMENEZ ORTEGA           ","11DPT0003O",null,null,null,"X",null,null,null,null,null,null,null,null,null,null,null,1,0,0,73033.63]
[null,"GUANAJUATO","JOOM700802BM5","JOOM700802HGTYRG06  ","MIGUEL ANGEL JOYA ORTIZ                 ","11DPT0001Q",null,null,null,"X",null,null,null,null,null,null,null,null,null,null,null,1,0,0,102041.97]
[null,"GUANAJUATO","JUHF791105831","JUHF791105HDFRLR06  ","FERNANDO JUAREZ HELGUERA                ","11DPT0002P",null,null,null,"X",null,null,null,null,null,null,null,null,null,null,null,1,0,0,25730.300000000003]
[null,"GUANAJUATO","JUMH681213NW0","JUMH681213HGTRGL00  ","JOSE HILARIO JUAREZ MAGAÑA              ","11DPT0005M",null,null,null,"X",null,null,null,null,null,null,null,null,null,null,null,1,0,0,98920.969999999972]
[null,"GUANAJUATO","JUPA730712HA3","JUPA730712MGTRRN04  ","ANA LAURA JUAREZ PEREZ                  ","11DPT0006L",null,null,null,"X",null,null,null,null,null,null,null,null,null,null,null,1,0,0,42450.33]
[null,"GUANAJUATO","JUSD780922L87","JUSD780922MQTRRL03  ","DULCE MARIA JUAREZ SORIA                ","11DPT0014U",null,null,null,"X",null,null,null,null,null,null,null,null,null,null,null,1,0,0,35212.19]
[null,"GUANAJUATO","LAMA800707D83","LAMA800707HGTRRL05  ","JOSE ALEJANDRO LARA MERCADO             ","11DPT0002P",null,null,null,"X",null,null,null,null,null,null,null,null,null,null,null,1,0,0,29495.230000000003]
[null,"GUANAJUATO","LAVA8108019Q9","LAVA810801MGTGRN09  ","MARIA DE LOS ANG LAGUNA VARGAS          ","11DPT0008J",null,null,null,"X",null,null,null,null,null,null,null,null,null,null,null,1,0,0,90924.31]
[null,"GUANAJUATO","LAVD841123J58","LAVD841123HGTGRN02  ","DANIEL LAGUNA VARGAS                    ","11DPT0008J",null,null,null,"X",null,null,null,null,null,null,null,null,null,null,null,1,0,0,27091.14]
[null,"GUANAJUATO","LEAC581017M56","LEAC581017MGTDLN17  ","MARIA CONSEPCION LEDESMA ALMANZA        ","11DPT0005M",null,null,null,"X",null,null,null,null,null,null,null,null,null,null,null,1,0,0,39444.36]
[null,"GUANAJUATO","LELE610112FLA","LELE610112MGTMRL09  ","ELSA GUADALUPE LEMUS LIRA               ","11DPT0005M",null,null,null,"X",null,null,null,null,null,null,null,null,null,null,null,1,0,0,85075.92]
[null,"GUANAJUATO","LERD770827UM0","LERD770827HGTNDM00  ","JOSE DOMINGO DE LEON RODRIGUEZ          ","11APT0001T",null,null,null,null,null,null,null,null,null,null,null,null,"X",null,null,1,0,0,89158.079999999987]
[null,"GUANAJUATO","LILB720207HV3","LILB720207MGTNML02  ","BLANCA ESTELA LINARES LOMELI            ","11DPT0009I",null,null,null,"X",null,null,null,null,null,null,null,null,null,null,null,1,0,0,41670.250000000007]
[null,"GUANAJUATO","LIRA890608KM8","LIRA890608MGTZZL06  ","ALMA ROSARIO LIZARRAGA RUIZ             ","11DPT0001Q",null,null,null,"X",null,null,null,null,null,null,null,null,null,null,null,1,0,0,27576.63]
[null,"GUANAJUATO","LOAP6711257L7","LOAP671125HGTPGB09  ","JOSE PABLO LOPEZ AGUIRRE                ","11DPT0006L",null,null,null,"X",null,null,null,null,null,null,null,null,null,null,null,1,0,0,37312.920000000006]
[null,"GUANAJUATO","LOCR480518KR8","LOCR480518HDFPRG01  ","ROGELIO LOPEZ CERVANTES                 ","11DPT0003O",null,null,null,"X",null,null,null,null,null,null,null,null,null,null,null,1,0,0,43795.03]
[null,"GUANAJUATO","LOCV8505084R9","LOCV850508MGTPRR07  ","VERONICA LOPEZ CARDOSO                  ","11DPT0011X",null,null,null,"X",null,null,null,null,null,null,null,null,null,null,null,1,0,0,28249.759999999995]
[null,"GUANAJUATO","LOGM731124S65","LOGM731124MMNPZN04  ","MONICA IVETT LOPEZ GUZMAN               ","11DPT0004N",null,null,null,"X",null,null,null,null,null,null,null,null,null,null,null,1,0,0,84810.04]
[null,"GUANAJUATO","LOGY890331RG1","LOGY890331MGTPZN04  ","YANNET LOPEZ GUZMAN                     ","11DPT0004N",null,null,null,"X",null,null,null,null,null,null,null,null,null,null,null,1,0,0,27280.689999999995]
[null,"GUANAJUATO","LOLA590613UN8","LOLA590613HGTPPN00  ","ANTONIO LOPEZ LOPEZ                     ","11DPT0009I",null,null,null,"X",null,null,null,null,null,null,null,null,null,null,null,1,0,0,107370.73000000001]
[null,"GUANAJUATO","LOLA870110SJ9","LOLA870110MGTPPL02  ","ALMA ALEJANDRA LOPEZ LOPEZ              ","11DPT0001Q",null,null,null,"X",null,null,null,null,null,null,null,null,null,null,null,1,0,0,53318.580000000009]
[null,"GUANAJUATO","LOSG55020446A","LOSG550204HGTPTL09  ","GUILLERMO LOPEZ SOTO                    ","11DPT0012W",null,null,null,"X",null,null,null,null,null,null,null,null,null,null,null,1,0,0,36105.549999999996]
[null,"GUANAJUATO","LOVL610419CF3","LOVL610419MDFPCR09  ","MARIA DE LOURDES LOPEZ VICTORIA         ","11APT0001T",null,null,null,null,null,null,null,null,null,null,null,null,"X",null,null,1,0,0,77122.2]
[null,"GUANAJUATO","LOMA701120ND4","LOXM701120HGTPXR04  ","MARTIN EDUARDO LOPEZ                    ","11DPT0007K",null,null,null,"X",null,null,null,null,null,null,null,null,null,null,null,1,0,0,109304.8]
[null,"GUANAJUATO","LOZE620109TAO","LOZE620109MGTPMV07  ","MA.EVERILDA LOPEZ ZAMORA                ","11DPT0010Y",null,null,null,"X",null,null,null,null,null,null,null,null,null,null,null,1,0,0,34895.5]
[null,"GUANAJUATO","DIXA5103118M5","DIXA510311HGTSXL09","ALBERTO DE LA LUZ SOCORRO DIOSDADO","11APT0001T",null,null,null,null,null,null,null,null,null,null,null,null,"X",null,null,1,0,0,239628.6]
[null,"GUANAJUATO","LUPG840320SN8","LUPG840320HGTNRD08  ","JOSE GUADALUPE LUNA PEREZ               ","11DPT0003O",null,null,null,"X",null,null,null,null,null,null,null,null,null,null,null,1,0,0,4830.54]
[null,"GUANAJUATO","LURR5303156L3","LURR530315HGTNMY04  ","RAYMUNDO LUNA RAMIREZ                   ","11DPT0004N",null,null,null,"X",null,null,null,null,null,null,null,null,null,null,null,1,0,0,97280.01999999999]
[null,"GUANAJUATO","MABH800524BY7","MABH800524HMNRRG02  ","HUGO MARTINEZ BARRERA                   ","11DPT0002P",null,null,null,"X",null,null,null,null,null,null,null,null,null,null,null,1,0,0,78008.2]
[null,"GUANAJUATO","MABM8602122N2","MABM860212MGTRRL21  ","MELISSA MARISELA MARTINEZ BARRIOS       ","11APT0001T",null,null,null,"X",null,null,null,null,null,null,null,null,null,null,null,1,0,0,27683.410000000003]
[null,"GUANAJUATO","MACP790228577","MACP790228MGTRSL06  ","MARIA DEL PILAR MARTINEZ CASTRO         ","11DPT0002P",null,null,null,"X",null,null,null,null,null,null,null,null,null,null,null,1,0,0,26974.35]
[null,"GUANAJUATO","MADB860405V48","MADB860405MGTLZL02  ","MARIA BLANCA MALAGON DIAZ               ","11DPT0010Y",null,null,null,"X",null,null,null,null,null,null,null,null,null,null,null,1,0,0,31649.900000000005]
[null,"GUANAJUATO","MADJ760413GFA","MADJ760413HGTTZQ01  ","JOAQUIN MATA DIAZ                       ","11DPT0002P",null,null,null,"X",null,null,null,null,null,null,null,null,null,null,null,1,0,0,36602.799999999996]
[null,"GUANAJUATO","MADM900319GN9","MADM900319HGTTZN05  ","JOSE MANUEL MATA DIAZ                   ","11DPT0002P",null,null,null,"X",null,null,null,null,null,null,null,null,null,null,null,1,0,0,20367.480000000003]
[null,"GUANAJUATO","MAFJ5906036T8","MAFJ590603HGTRRN00  ","JUAN MANUEL MARTINEZ FRIAS              ","11DPT0006L",null,null,null,"X",null,null,null,null,null,null,null,null,null,null,null,1,0,0,38859.009999999995]
[null,"GUANAJUATO","MAGB8208194P2","MAGB820819MGTLRL08  ","BLANCA ELIA MALDONADO GARCIA            ","11DPT0001Q",null,null,null,"X",null,null,null,null,null,null,null,null,null,null,null,1,0,0,51049.380000000005]
[null,"GUANAJUATO","MAGC661126AJ5","MAGC661126MGTLNR18  ","MA.CARMEN MALDONADO GONZALEZ            ","11DPT0001Q",null,null,null,"X",null,null,null,null,null,null,null,null,null,null,null,1,0,0,90457.189999999988]
[null,"GUANAJUATO","MAGE8309219C9","MAGE830921HSPLRD08  ","EDUARDO MALDONADO GARCIA                ","11DPT0014U",null,null,null,"X",null,null,null,null,null,null,null,null,null,null,null,1,0,0,73774.560000000012]
[null,"GUANAJUATO","MAGF780719PC1","MAGF780719MGTRNT03  ","FATIMA MARTINEZ GONZALEZ                ","11DPT0007K",null,null,null,"X",null,null,null,null,null,null,null,null,null,null,null,1,0,0,28073.97]
[null,"GUANAJUATO","MAHM7308144V2","MAHM730814MGTRRR07  ","MARCELA DEL PILA MARTINEZ HERNANDEZ     ","11DPT0013V",null,null,null,"X",null,null,null,null,null,null,null,null,null,null,null,1,0,0,82906.62]
[null,"GUANAJUATO","MAJG650413GMA","MAJG650413HGTLRS08  ","GUSTAVO MALAGON JUAREZ                  ","11DPT0011X",null,null,null,"X",null,null,null,null,null,null,null,null,null,null,null,1,0,0,98679.549999999974]
[null,"GUANAJUATO","MALR690904B5A","MALR690904MGTRPS03  ","ROSA EUGENIA MARTINEZ LOPEZ             ","11DPT0003O",null,null,null,"X",null,null,null,null,null,null,null,null,null,null,null,1,0,0,41070.850000000006]
[null,"GUANAJUATO","MAMJ550416EN3","MAMJ550416HMNRNS07  ","JOSE MARROQUIN MENDOZA                  ","11DPT0011X",null,null,null,"X",null,null,null,null,null,null,null,null,null,null,null,1,0,0,73109.76999999999]
[null,"GUANAJUATO","MAMJ620217DW9","MAMJ620217HGTRNN03  ","JUAN ANTONIO MARTINEZ MONCIBAIS         ","11DPT0003O",null,null,null,"X",null,null,null,null,null,null,null,null,null,null,null,1,0,0,73029.080000000016]
[null,"GUANAJUATO","MAMM8504029T1","MAMM850402MGTLLS09  ","MASSIEL MALDONADO MALDONADO             ","11DPT0011X",null,null,null,"X",null,null,null,null,null,null,null,null,null,null,null,1,0,0,30313.379999999997]
[null,"GUANAJUATO","MANR8209073S1","MANR820907HGTCGT04  ","RITO MACIAS NEGRETE                     ","11APT0001T",null,null,null,null,null,null,null,null,null,null,null,null,"X",null,null,1,0,0,89158.079999999987]
[null,"GUANAJUATO","MAOJ7405168FA","MAOJ740516MGTRCN05  ","JUANA MARTINEZ OCHOA                    ","11APT0001T",null,null,null,"X",null,null,null,null,null,null,null,null,null,null,null,1,0,0,98007.75]
[null,"GUANAJUATO","MAPU730620D62","MAPU730620HGTRRL07  ","ULISES MARQUEZ DE LA PARRA              ","11DPT0013V",null,null,null,null,null,null,null,null,null,null,null,null,"X",null,null,1,0,0,89087.46]
[null,"GUANAJUATO","MARM6405079G7","MARM640507HGTGVR02  ","MARTIN MAGAÑA RIVERA                    ","11DPT0009I",null,null,null,"X",null,null,null,null,null,null,null,null,null,null,null,1,0,0,91247.950000000012]
[null,"GUANAJUATO","MATF6010095M3","MATF601009HGTGFR00  ","FRANCISCO MAGAÑA TAFOYA                 ","11DPT0009I",null,null,null,"X",null,null,null,null,null,null,null,null,null,null,null,1,0,0,40856.410000000003]
[null,"GUANAJUATO","MATM660127FH7","MATM660127MGTGFN01  ","MONICA MAGAÑA TAFOYA                    ","11DPT0009I",null,null,null,"X",null,null,null,null,null,null,null,null,null,null,null,1,0,0,44857.39]
[null,"GUANAJUATO","MAVR700118TS6","MAVR700118HGTRRB08  ","RUBEN MARTINEZ VARELA                   ","11DPT0010Y",null,null,null,"X",null,null,null,null,null,null,null,null,null,null,null,1,0,0,102783.73999999999]
[null,"GUANAJUATO","MAZC650708TU1","MAZC650708MGTQRR01  ","MARIA CARMEN MAQUEDA ZARATE             ","11DPT0009I",null,null,null,"X",null,null,null,null,null,null,null,null,null,null,null,1,0,0,35436.960000000006]
[null,"GUANAJUATO","MAZC781203DS0","MAZC781203HGTQRR06  ","CARLOS MAQUEDA ZARATE                   ","11DPT0009I",null,null,null,"X",null,null,null,null,null,null,null,null,null,null,null,1,0,0,13189.51]
[null,"GUANAJUATO","MAZR720405LB8","MAZR720405HMNRTC01  ","RICARDO MARTINEZ ZETINA                 ","11DPT0006L",null,null,null,"X",null,null,null,null,null,null,null,null,null,null,null,1,0,0,56223.21]
[null,"GUANAJUATO","MEAE910606I30","MEAE910606HGTJGD01  ","EDGAR EMMANUEL MEJIA AGUILA             ","11DPT0002P",null,null,null,"X",null,null,null,null,null,null,null,null,null,null,null,1,0,0,25730.300000000003]
[null,"GUANAJUATO","MEEA7012162L2","MEEA701216HZSZSR04  ","ARTURO MEZA ESPARZA                     ","11APT0001T",null,null,null,null,null,null,null,null,null,null,null,null,"X",null,null,1,0,0,113060.7]
[null,"GUANAJUATO","MEES880125B67","MEES880125MGTZSN02  ","SANDRA MARGARITA MEZA ESTRADA           ","11DPT0013V",null,null,null,"X",null,null,null,null,null,null,null,null,null,null,null,1,0,0,27304.999999999996]
[null,"GUANAJUATO","MEGG6410124T0","MEGG641012MGTDRL06  ","GLORIA MEDINA GARCIA                    ","11DPT0005M",null,null,null,"X",null,null,null,null,null,null,null,null,null,null,null,1,0,0,36444.04]
[null,"GUANAJUATO","MEGM680209QU7","MEGM680209MGTDZR08  ","MARTHA SUSANA MEDEL GUZMAN              ","11DPT0009I",null,null,null,"X",null,null,null,null,null,null,null,null,null,null,null,1,0,0,13189.51]
[null,"GUANAJUATO","MEGR631011V43","MEGR631011MGTNRS04  ","ROSA MENDEZ GARCIA                      ","11DPT0004N",null,null,null,"X",null,null,null,null,null,null,null,null,null,null,null,1,0,0,35640.080000000002]
[null,"GUANAJUATO","MELJ7904219Z8","MELJ790421HGTLDN03  ","JUAN MAURICIO MELGOZA LEDESMA           ","11DPT0008J",null,null,null,"X",null,null,null,null,null,null,null,null,null,null,null,1,0,0,30349.54]
[null,"GUANAJUATO","MELN680719F21","MELN680719MGTLDR00  ","NORMA LETICIA MELGOZA LEDESMA           ","11DPT0001Q",null,null,null,"X",null,null,null,null,null,null,null,null,null,null,null,1,0,0,36068.74]
[null,"GUANAJUATO","MEME901101QT3","MEME901101MGTNRL08  ","MARIA ELENA MENDOZA MARTINEZ            ","11DPT0014U",null,null,null,"X",null,null,null,null,null,null,null,null,null,null,null,1,0,0,32212.68]
[null,"GUANAJUATO","MEMM670521N64","MEMM670521MDFDJR03  ","MARTHA PATRICIA MEDEL MEJIA             ","11DPT0005M",null,null,null,"X",null,null,null,null,null,null,null,null,null,null,null,1,0,0,43795.03]
[null,"GUANAJUATO","MEMM740704297","MEMM740704MDFDRR03  ","MIRNA MEDINA MARIN                      ","11DPT0001Q",null,null,null,"X",null,null,null,null,null,null,null,null,null,null,null,1,0,0,31441.06]
[null,"GUANAJUATO","MERA680725T53","MERA680725MGTJML04  ","ALMA DELIA MEJIA RAMOS                  ","11DPT0009I",null,null,null,"X",null,null,null,null,null,null,null,null,null,null,null,1,0,0,38808.32]
[null,"GUANAJUATO","MEVJ760816A58","MEVJ760816HGTJLL19  ","JULIO ENRIQUE MEJIA VILLANUEVA          ","11DPT0002P",null,null,null,"X",null,null,null,null,null,null,null,null,null,null,null,1,0,0,105579.35999999999]
[null,"GUANAJUATO","MIAO8312189C2","MIAO831218HDFLPM04  ","OMAR MILLAN APUD                        ","11DPT0001Q",null,null,null,"X",null,null,null,null,null,null,null,null,null,null,null,1,0,0,49755.91]
[null,"GUANAJUATO","MIHG8606185P2","MIHG860618MDFRRB06  ","GABRIELA MIRAMONTES HERNANDEZ           ","11DPT0014U",null,null,null,"X",null,null,null,null,null,null,null,null,null,null,null,1,0,0,25512.57]
[null,"GUANAJUATO","MIRA590513QB0","MIRA590513HGTRMR01  ","JOSE ARMANDO MIRANDA RAMOS              ","11DPT0002P",null,null,null,"X",null,null,null,null,null,null,null,null,null,null,null,1,0,0,40381.33]
[null,"GUANAJUATO","MOFD480314HT2","MOFD480314HGTRLL00  ","JOSE DOLORES MORALES FLORES             ","11DPT0008J",null,null,null,"X",null,null,null,null,null,null,null,null,null,null,null,1,0,0,36873.949999999997]
[null,"GUANAJUATO","MOFY680125UV7","MOFY680125MGTSLL00  ","YOLANDA MOSQUEDA FLORES                 ","11DPT0002P",null,null,null,"X",null,null,null,null,null,null,null,null,null,null,null,1,0,0,43108.659999999996]
[null,"GUANAJUATO","MOGM581228P96","MOGM581228MGTRNR09  ","MARTHA DEL CARME MORENO GONZALEZ        ","11APT0001T",null,null,null,"X",null,null,null,null,null,null,null,null,null,null,null,1,0,0,40626.9]
[null,"GUANAJUATO","MOHA6909151AA","MOHA690915MGTRRN03  ","ANDREA MORALES HERNANDEZ                ","11DPT0001Q",null,null,null,"X",null,null,null,null,null,null,null,null,null,null,null,1,0,0,36491.550000000003]
[null,"GUANAJUATO","MOJC851117J2A","MOJC851117MGTRST08  ","CITLALLI TONANCI MORA JASSO             ","11DPT0014U",null,null,null,"X",null,null,null,null,null,null,null,null,null,null,null,1,0,0,79500.490000000005]
[null,"GUANAJUATO","MOLJ6908066K2","MOLJ690806HGTNRN01  ","JUAN ANTONIO MONTALVO LIRA              ","11DPT0013V",null,null,null,"X",null,null,null,null,null,null,null,null,null,null,null,1,0,0,63076.270000000011]
[null,"GUANAJUATO","MOMA590424218","MOMA590424HGTNLN04  ","JOSE ANTONIO MONCADA MALDONADO          ","11DPT0011X",null,null,null,"X",null,null,null,null,null,null,null,null,null,null,null,1,0,0,37530.850000000006]
[null,"GUANAJUATO","MORA580316U78","MORA580316HGTJML06  ","ALEJANDRO MOJICA RAMIREZ                ","11DPT0007K",null,null,null,"X",null,null,null,null,null,null,null,null,null,null,null,1,0,0,42967.89]
[null,"GUANAJUATO","MORM6501066X7","MORM650106HGTRSL00  ","MELCHOR BENITO MORENO ROSALES           ","11DPT0005M",null,null,null,"X",null,null,null,null,null,null,null,null,null,null,null,1,0,0,97231.029999999984]
[null,"GUANAJUATO","MORM731010QZ9","MORM731010MVZLZR03  ","MIRSA MARICELA MOLGORA RAZO             ","11DPT0004N",null,null,null,null,null,null,null,null,null,null,null,null,"X",null,null,1,0,0,89087.46]
[null,"GUANAJUATO","MORM8011214B7","MORM801121HDFRMN03  ","MANUEL EFRAIN MORENO ROMERO             ","11DPT0005M",null,null,null,"X",null,null,null,null,null,null,null,null,null,null,null,1,0,0,25153.32]
[null,"GUANAJUATO","MOSJ790615LD6","MOSJ790615HGTLNN00  ","JUAN MOLINA SANCHEZ                     ","11DPT0006L",null,null,null,"X",null,null,null,null,null,null,null,null,null,null,null,1,0,0,34382.959999999999]
[null,"GUANAJUATO","MOSP780508DF7","MOSP780508HGTLND02  ","PEDRO MOLINA SANCHEZ                    ","11DPT0006L",null,null,null,"X",null,null,null,null,null,null,null,null,null,null,null,1,0,0,38948.840000000004]
[null,"GUANAJUATO","MUHA861028V94","MUHA861028HGTXRD02  ","JOSE ADAN MUÑOZ HERNANDEZ               ","11DPT0012W",null,null,null,"X",null,null,null,null,null,null,null,null,null,null,null,1,0,0,26532.300000000003]
[null,"GUANAJUATO","MUPT600105IQ9","MUPT600105MGTRRR07  ","MA. TRINIDAD MURILLO PEREZ              ","11DPT0007K",null,null,null,"X",null,null,null,null,null,null,null,null,null,null,null,1,0,0,35491.17]
[null,"GUANAJUATO","MUSF920131CIA","MUSF920131MGTXCR06  ","MARIA FERNANDA MUÑOZ SAUCILLO           ","11DPT0001Q",null,null,null,"X",null,null,null,null,null,null,null,null,null,null,null,1,0,0,25730.300000000003]
[null,"GUANAJUATO","MUVA591117ID0","MUVA591117HGTRGN01  ","ANTONIO MURILLO VEGA                    ","11DPT0011X",null,null,null,"X",null,null,null,null,null,null,null,null,null,null,null,1,0,0,36053.179999999993]
[null,"GUANAJUATO","TERY911028QH5","TERY911028MGTNMS08","YASMIN DEL CARMEN TENA RAMIREZ","11APT0001T",null,null,null,"X",null,null,null,null,null,null,null,null,null,null,null,1,0,0,25320.45]
[null,"GUANAJUATO","NAME6411037H1","NAME641103MDFVDV03  ","EVA NAVARRO MADRIGAL                    ","11DPT0003O",null,null,null,"X",null,null,null,null,null,null,null,null,null,null,null,1,0,0,30532.83]
[null,"GUANAJUATO","NAQI780206S92","NAQI780206HDFVXV07  ","IVAN AGUSTIN NAVARRETE QUIÑONES         ","11DPT0014U",null,null,null,"X",null,null,null,null,null,null,null,null,null,null,null,1,0,0,31143.279999999999]
[null,"GUANAJUATO","NAVS621206356","NAVS621206MGTVLN00  ","SANDRA JUANA NAVA VELAZQUEZ             ","11DPT0006L",null,null,null,"X",null,null,null,null,null,null,null,null,null,null,null,1,0,0,66396.160000000003]
[null,"GUANAJUATO","NECL411005F85","NECL411005HGTGRS08  ","LUIS NEGRETE CRUZ                       ","11DPT0009I",null,null,null,"X",null,null,null,null,null,null,null,null,null,null,null,1,0,0,6540.74]
[null,"GUANAJUATO","NIHE721201VC3","NIHE721201HGTTRS04  ","EUSEBIO MIGUEL A NIETO HERNANDEZ        ","11DPT0001Q",null,null,null,"X",null,null,null,null,null,null,null,null,null,null,null,1,0,0,30546.16]
[null,"GUANAJUATO","NIMA711025LJ1","NIMA711025MGTTRL07  ","ALICIA NIETO MARTINEZ                   ","11DPT0005M",null,null,null,"X",null,null,null,null,null,null,null,null,null,null,null,1,0,0,37639.199999999997]
[null,"GUANAJUATO","NIMT691014GT1","NIMT691014MGTTRR05  ","TERESITA NIETO MARTINEZ                 ","11DPT0011X",null,null,null,"X",null,null,null,null,null,null,null,null,null,null,null,1,0,0,25730.300000000003]
[null,"GUANAJUATO","NIPD811108TF1","NIPD811108HBCTSN09  ","DANIEL NIETO PASCALIS                   ","11DPT0003O",null,null,null,null,null,null,null,null,null,null,null,null,"X",null,null,1,0,0,90974.399999999994]
[null,"GUANAJUATO","NIRA700123GK9","NIRA700123MGTTVN01  ","ANA LAURA NIETO RIVERA                  ","11DPT0003O",null,null,null,"X",null,null,null,null,null,null,null,null,null,null,null,1,0,0,108234.97999999998]
[null,"GUANAJUATO","NIRG591215T84","NIRG591215MGTTVR06  ","GEORGINA DE LOURD NIETO RIVERA          ","11DPT0007K",null,null,null,null,null,null,null,null,null,null,null,null,"X",null,null,1,0,0,90974.399999999994]
[null,"GUANAJUATO","NUBS660923MR4","NUBS660923MGTXRL07  ","MA.SILVIA NUÑEZ BARRERA                 ","11DPT0001Q",null,null,null,"X",null,null,null,null,null,null,null,null,null,null,null,1,0,0,41024.590000000004]
[null,"GUANAJUATO","NUCS580811UI9","NUCS580811MGTXRS04  ","SUSANA NUÑEZ CERRITOS                   ","11DPT0008J",null,null,null,"X",null,null,null,null,null,null,null,null,null,null,null,1,0,0,38098.559999999998]
[null,"GUANAJUATO","OAGS860412RP6","OAGS860412MGTRTR05  ","SARA DEL ROSARIO ORRANTI GUTIERREZ      ","11DPT0010Y",null,null,null,"X",null,null,null,null,null,null,null,null,null,null,null,1,0,0,31307.039999999994]
[null,"GUANAJUATO","OAMC600520F43","OAMC600520HSLLLR01  ","CARLOS JAVIER OLAVEZ MELESIO            ","11DPT0001Q",null,null,null,"X",null,null,null,null,null,null,null,null,null,null,null,1,0,0,39552.119999999995]
[null,"GUANAJUATO","OELW670610C88","OELW670610HGTLDN06  ","WENSESLAO OLVERA LEDESMA                ","11DPT0012W",null,null,null,"X",null,null,null,null,null,null,null,null,null,null,null,1,0,0,37051.149999999994]
[null,"GUANAJUATO","OERM770419UD7","OERM770419HGTLSG03  ","MIGUEL ANGEL OLVERA RESENDIZ            ","11DPT0012W",null,null,null,"X",null,null,null,null,null,null,null,null,null,null,null,1,0,0,35209.660000000003]
[null,"GUANAJUATO","OETL661122IZ6","OETL661122MGTRRZ06  ","LUZ CECILIA ORTEGA TORRES               ","11DPT0008J",null,null,null,"X",null,null,null,null,null,null,null,null,null,null,null,1,0,0,16647.059999999998]
[null,"GUANAJUATO","OEVL650213T59","OEVL650213MGTRLR01  ","LAURA INES ORTEGA VALADEZ               ","11DPT0004N",null,null,null,"X",null,null,null,null,null,null,null,null,null,null,null,1,0,0,109543.57]
[null,"GUANAJUATO","OIHA541221R95","OIHA541221HGTRRL04  ","ALFONSO ORTIZ HERNANDEZ                 ","11DPT0007K",null,null,null,"X",null,null,null,null,null,null,null,null,null,null,null,1,0,0,39547.44000000001]
[null,"GUANAJUATO","OILP6802156K9","OILP680215MDFVGL09  ","MARIA DEL PILAR OVIEDO LUGO             ","11DPT0007K",null,null,null,"X",null,null,null,null,null,null,null,null,null,null,null,1,0,0,35814.239999999998]
[null,"GUANAJUATO","OING5906128T6","OING590612HGTRCS02  ","GUSTAVO ORTIZ NICASIO                   ","11APT0001T",null,null,null,"X",null,null,null,null,null,null,null,null,null,null,null,1,0,0,40607.89]
[null,"GUANAJUATO","OIOM621117BE8","OIOM621117HGTLLN02  ","MANUEL MARTIN OLIVA OLIVA               ","11DPT0003O",null,null,null,"X",null,null,null,null,null,null,null,null,null,null,null,1,0,0,44173.03]
[null,"GUANAJUATO","OOCM7903122F9","OOCM790312MGTRRR03  ","MARCELA OROZCO CORNEJO                  ","11DPT0014U",null,null,null,"X",null,null,null,null,null,null,null,null,null,null,null,1,0,0,61862.14]
[null,"GUANAJUATO","OUGM7012272G3","OUGM701227MGTRRN03  ","MONICA ORDUNA GARCIA                    ","11DPT0005M",null,null,null,"X",null,null,null,null,null,null,null,null,null,null,null,1,0,0,28483.78]
[null,"GUANAJUATO","PACM840215MT1","PACM840215MGTLRR00  ","MAURA ANGELICA PALOMINO CARREÑO         ","11DPT0005M",null,null,null,"X",null,null,null,null,null,null,null,null,null,null,null,1,0,0,8408.7799999999988]
[null,"GUANAJUATO","PACM941015U40","PACM941015MGTLRR06  ","MARIANA PALOMINO CARREñO                ","11DPT0008J",null,null,null,"X",null,null,null,null,null,null,null,null,null,null,null,1,0,0,26000.27]
[null,"GUANAJUATO","PACS8101228Y0","PACS810122MGTLRR02  ","SARA PALOMINO CARREÑO                   ","11DPT0001Q",null,null,null,"X",null,null,null,null,null,null,null,null,null,null,null,1,0,0,28039.300000000003]
[null,"GUANAJUATO","PAGA670111I35","PAGA670111HNTLRR03  ","ARMANDO PALOMARES GARCIA                ","11DPT0013V",null,null,null,"X",null,null,null,null,null,null,null,null,null,null,null,1,0,0,91247.950000000012]
[null,"GUANAJUATO","PAGM5802105H5","PAGM580210HNTLRT06  ","MATIAS PALOMARES GARCIA                 ","11DPT0005M",null,null,null,"X",null,null,null,null,null,null,null,null,null,null,null,1,0,0,28144.83]
[null,"GUANAJUATO","PAGR7307144R1","PAGR730714MGTNMF00  ","MARIA DEL REFUGIO PANTOJA GOMEZ         ","11DPT0004N",null,null,null,"X",null,null,null,null,null,null,null,null,null,null,null,1,0,0,39982.120000000003]
[null,"GUANAJUATO","PAHM630123LJ6","PAHM630123HGTNRN05  ","MANUEL PANTOJA HERRERA                  ","11DPT0006L",null,null,null,"X",null,null,null,null,null,null,null,null,null,null,null,1,0,0,104473.68999999997]
[null,"GUANAJUATO","PAJJ830708SK1","PAJJ830708HQTTMR06  ","JORGE ADALBERTO PATINO JIMENEZ          ","11DPT0008J",null,null,null,"X",null,null,null,null,null,null,null,null,null,null,null,1,0,0,30869.700000000004]
[null,"GUANAJUATO","PALM711130LV9","PALM711130HGTRGG02  ","MIGUEL ANGEL PARAMO LAGUNA              ","11DPT0002P",null,null,null,"X",null,null,null,null,null,null,null,null,null,null,null,1,0,0,38213.129999999997]
[null,"GUANAJUATO","PAPA810618AR6","PAPA810618HGTLLB03  ","ABRAHAM PALACIOS PALACIOS               ","11DPT0003O",null,null,null,"X",null,null,null,null,null,null,null,null,null,null,null,1,0,0,26275.730000000003]
[null,"GUANAJUATO","PAZR620620HP0","PAZR620620MGTCPQ07  ","RAQUEL PACHECO ZAPIEN                   ","11DPT0007K",null,null,null,"X",null,null,null,null,null,null,null,null,null,null,null,1,0,0,73029.080000000016]
[null,"GUANAJUATO","PECE671111QE4","PECE671111HDFRSL09  ","ELOY MARTIN PEREZ CASTILLO              ","11DPT0012W",null,null,null,"X",null,null,null,null,null,null,null,null,null,null,null,1,0,0,104445.71999999999]
[null,"GUANAJUATO","PEGL590326TB4","PEGL590326MGTRMZ05  ","LUZ ELENA PERALES GOMEZ                 ","11APT0001T",null,null,null,"X",null,null,null,null,null,null,null,null,null,null,null,1,0,0,34556.89]
[null,"GUANAJUATO","PELI680925LM6","PELI680925MGTDPV03  ","IVONNE YOLANDA PEDROZA LOPEZ            ","11APT0001T",null,null,null,"X",null,null,null,null,null,null,null,null,null,null,null,1,0,0,108476.39999999998]
[null,"GUANAJUATO","PELL790204HW5","PELL790204MNTRRC05  ","LUCIA PEREZ LARA                        ","11DPT0010Y",null,null,null,"X",null,null,null,null,null,null,null,null,null,null,null,1,0,0,29475.839999999997]
[null,"GUANAJUATO","PESE6410262W2","PESE641026HTSRNR02  ","ERNESTO PEREZ SANCHEZ                   ","11APT0001T",null,null,null,null,null,null,null,null,null,null,null,null,"X",null,null,1,0,0,89158.079999999987]
[null,"GUANAJUATO","PEVG640422LA3","PEVG640422MGTRRR00  ","GEORGINA SOLEDAD PEREZ VERA             ","11DPT0002P",null,null,null,"X",null,null,null,null,null,null,null,null,null,null,null,1,0,0,44503.270000000004]
[null,"GUANAJUATO","PIAR680730PSA","PIAR680730MGTRGG01  ","MARIA REGINA PRIETO AGUILAR             ","11DPT0005M",null,null,null,"X",null,null,null,null,null,null,null,null,null,null,null,1,0,0,72089.66]
[null,"GUANAJUATO","PIOP550618BT2","PIOP550618HGTCLB08  ","PABLO PICHARDO OLVERA                   ","11DPT0001Q",null,null,null,"X",null,null,null,null,null,null,null,null,null,null,null,1,0,0,41077.86]
[null,"GUANAJUATO","POGA790726B24","POGA790726MGTNZL05  ","ALMA DELIA PONCE GUZMAN                 ","11DPT0012W",null,null,null,"X",null,null,null,null,null,null,null,null,null,null,null,1,0,0,39073.939999999995]
[null,"GUANAJUATO","POMR6708302N1","POMR670830MGTRNS05  ","ROSA MARIA PORRAS MANRIQUE              ","11DPT0007K",null,null,null,"X",null,null,null,null,null,null,null,null,null,null,null,1,0,0,68644.960000000006]
[null,"GUANAJUATO","POPG430527TB7","POPG430527HGTRDD09  ","J. GUADALUPE PORRAS PADILLA             ","11APT0001T",null,null,null,"X",null,null,null,null,null,null,null,null,null,null,null,1,0,0,35558.33]
[null,"GUANAJUATO","PUAJ821120LU8","PUAJ821120MJCGLN05  ","JUANA PUGA ALDANA                       ","11APT0001T",null,null,null,"X",null,null,null,null,null,null,null,null,null,null,null,1,0,0,28799.940000000002]
[null,"GUANAJUATO","QUDW870430HH4","QUDW870430MGTNMN07  ","WENDY YAZMIN QUINTANA DOMINGUEZ         ","11DPT0006L",null,null,null,"X",null,null,null,null,null,null,null,null,null,null,null,1,0,0,33651.989999999991]
[null,"GUANAJUATO","QUGE620101NK4","QUGE620101HGTNRF01  ","EFRAIN QUINTANA GARCIA                  ","11DPT0001Q",null,null,null,"X",null,null,null,null,null,null,null,null,null,null,null,1,0,0,29411.55]
[null,"GUANAJUATO","QUZJ6303282J5","QUZJ630328HSRLNN05  ","JUAN QUILES ZUNO                        ","11APT0001T",null,null,null,"X",null,null,null,null,null,null,null,null,null,null,null,1,0,0,36772.339999999997]
[null,"GUANAJUATO","RAAE850827HM7","RAAE850827MGTMNL05  ","ELVIA RAMIREZ ANDRADE                   ","11DPT0007K",null,null,null,"X",null,null,null,null,null,null,null,null,null,null,null,1,0,0,26540.300000000003]
[null,"GUANAJUATO","RAAG5908278S6","RAAG590827HMNNBL08  ","GUILLERMO RANGEL ABURTO                 ","11DPT0001Q",null,null,null,"X",null,null,null,null,null,null,null,null,null,null,null,1,0,0,44857.39]
[null,"GUANAJUATO","RAAI811229BW5","RAAI811229MMCMNS05  ","MARIA ISABEL RAMIREZ ANDRADE            ","11DPT0014U",null,null,null,"X",null,null,null,null,null,null,null,null,null,null,null,1,0,0,36902.339999999997]
[null,"GUANAJUATO","VACR780505180","VACR780505MGTRHS07","MARIA DEL ROSARIO VARGAS CHAVEZ","11APT0001T",null,null,null,null,null,null,null,null,null,null,null,null,"X",null,null,1,0,0,89158.079999999987]
[null,"GUANAJUATO","RABR820601BH9","RABR820601HGTMND08  ","RODOLFO OSVALDO RAMIREZ BUENO           ","11DPT0010Y",null,null,null,"X",null,null,null,null,null,null,null,null,null,null,null,1,0,0,82911.63]
[null,"GUANAJUATO","RACA8011159T0","RACA801115MGTMRD05  ","ADELA RAMIREZ CERRITOS                  ","11DPT0008J",null,null,null,"X",null,null,null,null,null,null,null,null,null,null,null,1,0,0,31607.379999999997]
[null,"GUANAJUATO","RACB5510265G3","RACB551026HGTMSN05  ","BENITO RAMIREZ CASTILLO                 ","11DPT0011X",null,null,null,"X",null,null,null,null,null,null,null,null,null,null,null,1,0,0,40915.279999999999]
[null,"GUANAJUATO","RAEL8409015U2","RAEL840901MGTMSR07  ","LAURA PATRICIA RAMOS ESTRADA            ","11APT0001T",null,null,null,"X",null,null,null,null,null,null,null,null,null,null,null,1,0,0,79587.97]
[null,"GUANAJUATO","RAFA620326696","RAFA620326HGTMNN00  ","JOSE ANTONIO RAMIREZ FUENTES            ","11DPT0005M",null,null,null,"X",null,null,null,null,null,null,null,null,null,null,null,1,0,0,104473.68999999997]
[null,"GUANAJUATO","RAFG691106392","RAFG691106HGTMRR04  ","GERARDO RAMIREZ FERNANDEZ               ","11DPT0008J",null,null,null,null,null,null,null,null,null,null,null,null,"X",null,null,1,0,0,89087.46]
[null,"GUANAJUATO","RAGJ8207054L2","RAGJ820705HGTNMN05  ","JUAN ANTONIO RANGEL GOMEZ               ","11DPT0010Y",null,null,null,"X",null,null,null,null,null,null,null,null,null,null,null,1,0,0,36688.83]
[null,"GUANAJUATO","RAGT730306AI0","RAGT730306HGTNRR07  ","JOSE TRINIDAD RANGEL GUERRERO           ","11DPT0012W",null,null,null,"X",null,null,null,null,null,null,null,null,null,null,null,1,0,0,39669.770000000004]
[null,"GUANAJUATO","RAHJ6410105C3","RAHJ641010MGTMRS04  ","MA. DE JESUS RAMIREZ HORTA              ","11DPT0007K",null,null,null,"X",null,null,null,null,null,null,null,null,null,null,null,1,0,0,111373.44]
[null,"GUANAJUATO","RAMA640606AQ0","RAMA640606HGTNXL06  ","ALBERTO RANGEL MUÑOZ                    ","11APT0001T",null,null,null,"X",null,null,null,null,null,null,null,null,null,null,null,1,0,0,39334.709999999992]
[null,"GUANAJUATO","RAMD6103291R4","RAMD610329HGTMNV10  ","DAVID RAMIREZ MONJARAZ                  ","11APT0001T",null,null,null,"X",null,null,null,null,null,null,null,null,null,null,null,1,0,0,34538.97]
[null,"GUANAJUATO","RARE590716V64","RARE590716MJCMMV05  ","EVELIA DEL CARMEN RAMIREZ RAMIREZ       ","11DPT0003O",null,null,null,"X",null,null,null,null,null,null,null,null,null,null,null,1,0,0,44591.8]
[null,"GUANAJUATO","RARP630605NP2","RARP630605HJCMMD06  ","PEDRO RAMIREZ RAMIREZ                   ","11DPT0007K",null,null,null,"X",null,null,null,null,null,null,null,null,null,null,null,1,0,0,34242.769999999997]
[null,"GUANAJUATO","RARR701207IA9","RARR701207MDFMMT08  ","RITA RAMIREZ RAMIREZ                    ","11DPT0003O",null,null,null,"X",null,null,null,null,null,null,null,null,null,null,null,1,0,0,37624.799999999996]
[null,"GUANAJUATO","RARR710422AB6","RARR710422HGTMDM09  ","RAMON RAMIREZ RODRIGUEZ                 ","11DPT0010Y",null,null,null,"X",null,null,null,null,null,null,null,null,null,null,null,1,0,0,70042.790000000008]
[null,"GUANAJUATO","RASE540830U28","RASE540830HGTYLL02  ","ELEAZAR RAYAS SILVA                     ","11DPT0008J",null,null,null,"X",null,null,null,null,null,null,null,null,null,null,null,1,0,0,42732.61]
[null,"GUANAJUATO","RALU580110A37","RAXL580110HGTMXS01  ","LUIS FERNANDO RAMOS                     ","11APT0001T",null,null,null,null,null,null,null,null,null,null,null,null,"X",null,null,1,0,0,77122.2]
[null,"GUANAJUATO","RELR6206286CA","RELR620628HGTYPG09  ","ROGELIO REYES LOPEZ                     ","11DPT0009I",null,null,null,"X",null,null,null,null,null,null,null,null,null,null,null,1,0,0,46589.05]
[null,"GUANAJUATO","RELS650704P63","RELS650704MGTXZL00  ","MA. SOLEDAD REA LOZANO                  ","11DPT0013V",null,null,null,"X",null,null,null,null,null,null,null,null,null,null,null,1,0,0,45533.380000000005]
[null,"GUANAJUATO","RERE8505068T2","RERE850506HMNYMD04  ","EDUARDO REYES RAMIREZ                   ","11DPT0001Q",null,null,null,"X",null,null,null,null,null,null,null,null,null,null,null,1,0,0,25996.510000000002]
[null,"GUANAJUATO","RESO730809AI4","RESO730809MGTYNF03  ","OFELIA REYES SANDOVAL                   ","11DPT0014U",null,null,null,"X",null,null,null,null,null,null,null,null,null,null,null,1,0,0,33117.68]
[null,"GUANAJUATO","RIAA790529868","RIAA790529MMNSGN11  ","ANA KATHERINE RIOS AGUILAR              ","11DPT0001Q",null,null,null,null,null,null,null,null,null,null,null,null,"X",null,null,1,0,0,77122.2]
[null,"GUANAJUATO","GOGD870617R99","GOGJ860617HGTMRS00","JOSE DANIEL GOMEZ GARZA","11DPT0010Y",null,null,null,"X",null,null,null,null,null,null,null,null,null,null,null,1,0,0,14809.119999999999]
[null,"GUANAJUATO","RIGA780625KX0","RIGA780625HGTVMG07  ","JOSE AUGUSTO RIVERA GOMEZ               ","11DPT0011X",null,null,null,"X",null,null,null,null,null,null,null,null,null,null,null,1,0,0,34160.119999999995]
[null,"GUANAJUATO","RIGJ550502E94","RIGJ550502HCLVRN04  ","JOSE JUAN RIVERA GARCIA                 ","11DPT0007K",null,null,null,"X",null,null,null,null,null,null,null,null,null,null,null,1,0,0,101149.74999999999]
[null,"GUANAJUATO","RIHR880331D30","RIHR880331HGTSRC09  ","RICARDO RIOS HERNANDEZ                  ","11DPT0014U",null,null,null,"X",null,null,null,null,null,null,null,null,null,null,null,1,0,0,49869.380000000005]
[null,"GUANAJUATO","RIOS5803272M4","RIOS580327MZSVLC03  ","MA. DEL SOCORRO RIVERA OLVERA           ","11DPT0007K",null,null,null,"X",null,null,null,null,null,null,null,null,null,null,null,1,0,0,65513.420000000013]
[null,"GUANAJUATO","ROBB6412029G0","ROBB641202MGTBRL04  ","BLANCA ESTELA ROBLES BRAVO              ","11DPT0002P",null,null,null,"X",null,null,null,null,null,null,null,null,null,null,null,1,0,0,43359.67]
[null,"GUANAJUATO","ROBY7612249Q3","ROBY761224MMCDCN00  ","YUNUEN RODRIGUEZ BECERRA                ","11DPT0001Q",null,null,null,"X",null,null,null,null,null,null,null,null,null,null,null,1,0,0,34727.840000000004]
[null,"GUANAJUATO","ROCS8704055G4","ROCS870405MMCDSL06  ","MARIA DEL SOL RODRIGUEZ CASTRO          ","11DPT0008J",null,null,null,"X",null,null,null,null,null,null,null,null,null,null,null,1,0,0,50679.380000000005]
[null,"GUANAJUATO","RODY660703MQ8","RODY660703MGTXLL07  ","YOLANDA ROA DELGADO                     ","11DPT0002P",null,null,null,"X",null,null,null,null,null,null,null,null,null,null,null,1,0,0,74211.37]
[null,"GUANAJUATO","ROEJ700824751","ROEJ700824HVZMSL05  ","JULIO CESAR ROMERO ESCOBAR              ","11DPT0001Q",null,null,null,"X",null,null,null,null,null,null,null,null,null,null,null,1,0,0,28379.040000000001]
[null,"GUANAJUATO","ROGA640613DQ5","ROGA640613MDFJTN05  ","ANTONIA ESTELA ROJAS GUTIERREZ          ","11DPT0011X",null,null,null,"X",null,null,null,null,null,null,null,null,null,null,null,1,0,0,91340.669999999984]
[null,"GUANAJUATO","ROGC891121D58","ROGC891121MGTJRR05  ","MARIA DEL CARMEN ROJAS GRANADOS         ","11DPT0002P",null,null,null,"X",null,null,null,null,null,null,null,null,null,null,null,1,0,0,12238.74]
[null,"GUANAJUATO","ROGJ631018GD6","ROGJ631018HGTMRN04  ","JUAN JOSE ROMERO GARCIA                 ","11DPT0003O",null,null,null,"X",null,null,null,null,null,null,null,null,null,null,null,1,0,0,46135.760000000009]
[null,"GUANAJUATO","ROGJ720412CD2","ROGJ720412HGTCNL01  ","JULIO BERNARDO ROCHA GONZALEZ           ","11DPT0007K",null,null,null,"X",null,null,null,null,null,null,null,null,null,null,null,1,0,0,40926.1]
[null,"GUANAJUATO","ROGJ7905253Y5","ROGJ790525HPLJDN05  ","JOSE JUAN ROJAS GODOY                   ","11DPT0008J",null,null,null,"X",null,null,null,null,null,null,null,null,null,null,null,1,0,0,90492.19]
[null,"GUANAJUATO","ROGL591003DS4","ROGL591003MGTMNN05  ","MA.LINA TERESA ROMERO GONZALEZ          ","11DPT0007K",null,null,null,"X",null,null,null,null,null,null,null,null,null,null,null,1,0,0,32835.599999999999]
[null,"GUANAJUATO","ROHH851230UU9","ROHH851230HGTJRR04  ","HERNAN ROJAS HERNANDEZ                  ","11DPT0008J",null,null,null,"X",null,null,null,null,null,null,null,null,null,null,null,1,0,0,20367.480000000003]
[null,"GUANAJUATO","ROHR681221N53","ROHR681221MGTJRB00  ","RUBISELA ROJAS HUARACHA                 ","11DPT0001Q",null,null,null,"X",null,null,null,null,null,null,null,null,null,null,null,1,0,0,74349.820000000007]
[null,"GUANAJUATO","ROMI501119KW9","ROMI501119HGTCZS06  ","J. ISABEL ROCHA MEZA                    ","11DPT0007K",null,null,null,"X",null,null,null,null,null,null,null,null,null,null,null,1,0,0,33638.720000000001]
[null,"GUANAJUATO","ROMR681004UF2","ROMR681004HGTDRM02  ","RAMIRO RODRIGUEZ MARTINEZ               ","11DPT0001Q",null,null,null,"X",null,null,null,null,null,null,null,null,null,null,null,1,0,0,41670.250000000007]
[null,"GUANAJUATO","ROMR861218274","ROMR861218HGTDGC00  ","RICARDO RODRIGUEZ MAGDALENO             ","11DPT0013V",null,null,null,"X",null,null,null,null,null,null,null,null,null,null,null,1,0,0,73109.76999999999]
[null,"GUANAJUATO","ROMV410405227","ROMV410306HGTCZC05  ","VICENTE ROCHA MEZA                      ","11DPT0007K",null,null,null,"X",null,null,null,null,null,null,null,null,null,null,null,1,0,0,33236.300000000003]
[null,"GUANAJUATO","MESL860213877","MESL860213MGTNNR09","LOURDES PAULINA MENDOZA SANCHEZ","11APT0001T",null,null,null,"X",null,null,null,null,null,null,null,null,null,null,null,1,0,0,25730.300000000003]
[null,"GUANAJUATO","ROPJ630922717","ROPJ630922MGTDRS08  ","JOSEFINA RODRIGUEZ PEREZ                ","11DPT0009I",null,null,null,"X",null,null,null,null,null,null,null,null,null,null,null,1,0,0,36807.120000000003]
[null,"GUANAJUATO","ROPR4911033YA","ROPR491103HGTDTF04  ","RAFAEL RODRIGUEZ PATINO                 ","11DPT0001Q",null,null,null,"X",null,null,null,null,null,null,null,null,null,null,null,1,0,0,31356.450000000004]
[null,"GUANAJUATO","ROPR8607125H9","ROPR860712MGTDNS08  ","ROSA AIDE RODRIGUEZ PANIAGUA            ","11DPT0011X",null,null,null,"X",null,null,null,null,null,null,null,null,null,null,null,1,0,0,73109.76999999999]
[null,"GUANAJUATO","RORC850223K78","RORC850223HGTDMR02  ","CARLOS ALBERTO RODRIGUEZ RAMIREZ        ","11DPT0013V",null,null,null,"X",null,null,null,null,null,null,null,null,null,null,null,1,0,0,34519.149999999994]
[null,"GUANAJUATO","RORF650224FV1","RORF650224HDFDDR03  ","FERNANDO RODRIGUEZ RODRIGUEZ            ","11DPT0005M",null,null,null,"X",null,null,null,null,null,null,null,null,null,null,null,1,0,0,28716.83]
[null,"GUANAJUATO","RORJ800328CB1","RORJ800328HGTDMN01  ","JUAN PABLO RODRIGUEZ RAMIREZ            ","11DPT0003O",null,null,null,"X",null,null,null,null,null,null,null,null,null,null,null,1,0,0,31682.73]
[null,"GUANAJUATO","ROSA621019UW4","ROSA621019HGTDNG01  ","AGAPITO RODRIGUEZ SANCHEZ               ","11DPT0002P",null,null,null,"X",null,null,null,null,null,null,null,null,null,null,null,1,0,0,38251.509999999995]
[null,"GUANAJUATO","ROSJ840320PL5","ROSJ840320MMCMGL06  ","JULIA OYUKI ROMERO SEGURA               ","11DPT0013V",null,null,null,"X",null,null,null,null,null,null,null,null,null,null,null,1,0,0,32211.159999999996]
[null,"GUANAJUATO","ROTF640526L74","ROTF640526HGTDVL07  ","FELIPE RODRIGUEZ TOVAR                  ","11DPT0010Y",null,null,null,"X",null,null,null,null,null,null,null,null,null,null,null,1,0,0,31878.02]
[null,"GUANAJUATO","ROVA500401GUA","ROVA500401HGTJLR05  ","ARTURO ROJAS VALENCIA                   ","11DPT0008J",null,null,null,"X",null,null,null,null,null,null,null,null,null,null,null,1,0,0,34635.93]
[null,"GUANAJUATO","ROVL470314635","ROVL470314HGTXGS09  ","LUIS RUBEN ROA VEGA                     ","11DPT0010Y",null,null,null,"X",null,null,null,null,null,null,null,null,null,null,null,1,0,0,33665.18]
[null,"GUANAJUATO","ROVR751027UW3","ROVR751027MGTBRS09  ","MARIA DEL ROSARI ROBLES VARGAS          ","11DPT0012W",null,null,null,"X",null,null,null,null,null,null,null,null,null,null,null,1,0,0,29232.6]
[null,"GUANAJUATO","ROVS5612313Z0","ROVS561231HGTBNL05  ","J. SILVESTRE ROBLEDO VENEGAS            ","11DPT0003O",null,null,null,"X",null,null,null,null,null,null,null,null,null,null,null,1,0,0,40284.25]
[null,"GUANAJUATO","ROMA570516SW1","ROXM570516HGTJXR04  ","MARIO ROJAS                             ","11DPT0007K",null,null,null,"X",null,null,null,null,null,null,null,null,null,null,null,1,0,0,73655.400000000009]
[null,"GUANAJUATO","ROZA560516SE3","ROZA560516HGTJPB08  ","ABEL ROJAS ZAPATERO                     ","11DPT0008J",null,null,null,"X",null,null,null,null,null,null,null,null,null,null,null,1,0,0,43795.03]
[null,"GUANAJUATO","RUER840817TJ2","RUER840817HGTZSN07  ","RENE RUIZ ESPINOZA                      ","11DPT0013V",null,null,null,"X",null,null,null,null,null,null,null,null,null,null,null,1,0,0,35212.19]
[null,"GUANAJUATO","RURO710818A13","RURO710818MGTZFL04  ","OLGA AMALIA RUIZ RUFINO                 ","11DPT0001Q",null,null,null,"X",null,null,null,null,null,null,null,null,null,null,null,1,0,0,48481.260000000009]
[null,"GUANAJUATO","ROBA710226BG0","RXBA710226MGTBRL07  ","ALMA ROBLES BRAVO                       ","11DPT0002P",null,null,null,"X",null,null,null,null,null,null,null,null,null,null,null,1,0,0,33392.31]
[null,"GUANAJUATO","SAAA790117M77","SAAA790117HGTNRL19  ","JOSE ALFREDO SANCHEZ ARREDONDO          ","11DPT0009I",null,null,null,"X",null,null,null,null,null,null,null,null,null,null,null,1,0,0,90464.18]
[null,"GUANAJUATO","SAAK880407FL7","SAAK880407MJCNNR03  ","KARLA ANGELINA SANDOVAL DE ANDA         ","11APT0001T",null,null,null,null,null,null,null,null,null,null,null,null,"X",null,null,1,0,0,77122.2]
[null,"GUANAJUATO","SAAL680317PF6","SAAL680317MGTLRR00  ","LAURA PATRICIA SALDAÑA ARELLANO         ","11DPT0003O",null,null,null,"X",null,null,null,null,null,null,null,null,null,null,null,1,0,0,73109.76999999999]
[null,"GUANAJUATO","SABA620417HF9","SABA620417HVZNTN05  ","ANICETO SANTIAGO BAUTISTA               ","11DPT0008J",null,null,null,"X",null,null,null,null,null,null,null,null,null,null,null,1,0,0,109372.11999999998]
[null,"GUANAJUATO","SABM631225F45","SABM631225HGTVRR06  ","MARTIN SALVADOR SAAVEDRA BRAVO          ","11DPT0005M",null,null,null,"X",null,null,null,null,null,null,null,null,null,null,null,1,0,0,25730.300000000003]
[null,"GUANAJUATO","SACA791207U75","SACA791207MGTLSL02  ","MARIA ALEJANDRA SALAZAR CASTANEDA       ","11APT0001T",null,null,null,"X",null,null,null,null,null,null,null,null,null,null,null,1,0,0,79911.61]
[null,"GUANAJUATO","SACM851223UV7","SACM851223MDFNSN01  ","MONSERRAT SANCHEZ CISNEROS              ","11DPT0002P",null,null,null,"X",null,null,null,null,null,null,null,null,null,null,null,1,0,0,26899.379999999997]
[null,"GUANAJUATO","SAGG7304218VA","SAGG730421MGTNLL02  ","GLORIA SANCHEZ GALVAN                   ","11DPT0007K",null,null,null,"X",null,null,null,null,null,null,null,null,null,null,null,1,0,0,38075.94]
[null,"GUANAJUATO","SAGM730131V93","SAGM730131MDFNRR07  ","MARCELA SANCHEZ GARCIA                  ","11DPT0001Q",null,null,null,"X",null,null,null,null,null,null,null,null,null,null,null,1,0,0,82630.22]
[null,"GUANAJUATO","SAGN550328R1A","SAGN550328HGTNMC00  ","NICOLAS SANTOYO GOMEZ                   ","11DPT0004N",null,null,null,"X",null,null,null,null,null,null,null,null,null,null,null,1,0,0,39430.050000000003]
[null,"GUANAJUATO","SAGS78112652A","SAGS781126HGTLTS16  ","SASHA EMMANUEL SALINAS GUTIERREZ        ","11DPT0002P",null,null,null,"X",null,null,null,null,null,null,null,null,null,null,null,1,0,0,30631.14]
[null,"GUANAJUATO","SAHA7408317B1","SAHA740831MDFNRR01  ","AURELIA SANDOVAL HERNANDEZ              ","11DPT0012W",null,null,null,"X",null,null,null,null,null,null,null,null,null,null,null,1,0,0,31186.329999999998]
[null,"GUANAJUATO","SAHE741012DCA","SAHE741012MGTNRS04  ","MA. ESTHER SANCHEZ HERNANDEZ            ","11APT0001T",null,null,null,null,null,null,null,null,null,null,null,null,"X",null,null,1,0,0,89158.079999999987]
[null,"GUANAJUATO","SAHI670121KQ3","SAHI670121MGTNRN07  ","MA. INES SANDOVAL HERNANDEZ             ","11DPT0002P",null,null,null,"X",null,null,null,null,null,null,null,null,null,null,null,1,0,0,38235.770000000004]
[null,"GUANAJUATO","SAHL6309234X5","SAHL630923HGTNRS00  ","LUIS MIGUEL SANCHEZ HERNANDEZ           ","11DPT0002P",null,null,null,"X",null,null,null,null,null,null,null,null,null,null,null,1,0,0,72674.66]
[null,"GUANAJUATO","SAHO620602LB0","SAHO620602HSRLRS06  ","OSMAN SALAZAR HERNANDEZ                 ","11DPT0004N",null,null,null,"X",null,null,null,null,null,null,null,null,null,null,null,1,0,0,27091.14]
[null,"GUANAJUATO","SALM811102IP0","SALG811102MGTNGD00  ","MA. GUADALUPE SANCHEZ LAGUNA            ","11DPT0002P",null,null,null,"X",null,null,null,null,null,null,null,null,null,null,null,1,0,0,49869.380000000005]
[null,"GUANAJUATO","SALS651213I40","SALS651213MGTNNN03  ","SANJUANA SANCHEZ LUNA                   ","11DPT0008J",null,null,null,"X",null,null,null,null,null,null,null,null,null,null,null,1,0,0,42861.68]
[null,"GUANAJUATO","SAMG651113CLA","SAMG651113MGTVDD08  ","MARIA GUADALUPE SAAVEDRA MEDRANO        ","11DPT0006L",null,null,null,"X",null,null,null,null,null,null,null,null,null,null,null,1,0,0,37360.230000000003]
[null,"GUANAJUATO","SAML830406CC2","SAML830406HDFNNS01  ","LUIS ENRIQUE SANCHEZ MENDOZA            ","11APT0001T",null,null,null,"X",null,null,null,null,null,null,null,null,null,null,null,1,0,0,50777.060000000005]
[null,"GUANAJUATO","SAMN650727TS7","SAMN650727MGTNJT03  ","MA. NATALIA SANCHEZ MOJICA              ","11APT0001T",null,null,null,"X",null,null,null,null,null,null,null,null,null,null,null,1,0,0,27302.019999999997]
[null,"GUANAJUATO","SAOC521104BAA","SAOC521104HGTNLR02  ","CARLOS SANCHEZ OLIVA                    ","11DPT0010Y",null,null,null,"X",null,null,null,null,null,null,null,null,null,null,null,1,0,0,37346.550000000003]
[null,"GUANAJUATO","SARA881017KA5","SARA881017HGTNXL07  ","ALBERTO ALEXANDR SANTILLAN REA          ","11DPT0002P",null,null,null,"X",null,null,null,null,null,null,null,null,null,null,null,1,0,0,25657.380000000005]
[null,"GUANAJUATO","SARF810815QJ5","SARF810815MDFNCB12  ","MARIA FABIOLA SANCHEZ RICO              ","11DPT0011X",null,null,null,"X",null,null,null,null,null,null,null,null,null,null,null,1,0,0,29475.839999999997]
[null,"GUANAJUATO","SARO9410041H4","SARO941004HGTNXL07  ","OLDAIR FERNANDO SANTILLAN REA           ","11DPT0009I",null,null,null,"X",null,null,null,null,null,null,null,null,null,null,null,1,0,0,20367.480000000003]
[null,"GUANAJUATO","SARR700714SU4","SARR700714MGTCMS06  ","MARIA DEL ROSARI SAUCILLO RAMIREZ       ","11DPT0001Q",null,null,null,"X",null,null,null,null,null,null,null,null,null,null,null,1,0,0,60940.94]
[null,"GUANAJUATO","SASJ650121CF2","SAST650121HGTNMR00  ","J. TRINIDAD SANCHEZ SAMANO              ","11DPT0002P",null,null,null,"X",null,null,null,null,null,null,null,null,null,null,null,1,0,0,60897.8]
[null,"GUANAJUATO","SATR640529JN3","SATR640529HGTLRB08  ","RUBEN SALAZAR TORRES                    ","11DPT0005M",null,null,null,"X",null,null,null,null,null,null,null,null,null,null,null,1,0,0,42852.810000000012]
[null,"GUANAJUATO","SEES881205VA7","SEES881205MGTRSR08  ","SARA SERRANO ESTRADA                    ","11DPT0011X",null,null,null,"X",null,null,null,null,null,null,null,null,null,null,null,1,0,0,34349.020000000004]
[null,"GUANAJUATO","SIFB790507EM8","SIFB790507HGTRRR00  ","BRAULIO ISAAC SIERRA FERREYRA           ","11DPT0005M",null,null,null,"X",null,null,null,null,null,null,null,null,null,null,null,1,0,0,82122.87]
[null,"GUANAJUATO","SIRI830722KG2","SIRI830722HGTXCG04  ","IGNACIO MANUEL SIXTOS RICO              ","11DPT0014U",null,null,null,"X",null,null,null,null,null,null,null,null,null,null,null,1,0,0,52810.280000000006]
[null,"GUANAJUATO","SIRO600318LE2","SIRO600318HGTRDC04  ","JOSE OCTAVIO SIERRA RODRIGUEZ           ","11DPT0006L",null,null,null,"X",null,null,null,null,null,null,null,null,null,null,null,1,0,0,66139.740000000005]
[null,"GUANAJUATO","SIRO740717FV0","SIRO740717HGTRCS06  ","OSWALDO SIERRA ROCHA                    ","11APT0001T",null,null,null,"X",null,null,null,null,null,null,null,null,null,null,null,1,0,0,11849.29]
[null,"GUANAJUATO","SOMC8307243E3","SOMC830724HGTTNH06  ","CHRISTIAN SOTO MENDOZA                  ","11DPT0014U",null,null,null,"X",null,null,null,null,null,null,null,null,null,null,null,1,0,0,72326.01999999999]
[null,"GUANAJUATO","SOMJ580901N40","SOMJ580901HMNLRS02  ","JESUS SOLIS MARIN                       ","11DPT0009I",null,null,null,"X",null,null,null,null,null,null,null,null,null,null,null,1,0,0,39233.979999999996]
[null,"GUANAJUATO","SOPA800206QN0","SOPA800206HMCRRB02  ","ABNER ISAI SORIA PEREZ                  ","11DPT0004N",null,null,null,"X",null,null,null,null,null,null,null,null,null,null,null,1,0,0,53545.520000000011]
[null,"GUANAJUATO","SOPL831024T56","SOPL831024MGTTRR09  ","LAURA ANGELICA SOTO PEREZ               ","11DPT0012W",null,null,null,"X",null,null,null,null,null,null,null,null,null,null,null,1,0,0,63943.11]
[null,"GUANAJUATO","SUFR660516C81","SUFR660516MDFRLQ08  ","RAQUEL SUAREZ FALCON                    ","11DPT0012W",null,null,null,"X",null,null,null,null,null,null,null,null,null,null,null,1,0,0,62368.280000000006]
[null,"GUANAJUATO","TAAS6205308FA","TAAS620530MJCPLR01  ","SARA TAPIA ALCANTARA                    ","11DPT0004N",null,null,null,"X",null,null,null,null,null,null,null,null,null,null,null,1,0,0,36999.550000000003]
[null,"GUANAJUATO","TAPM7310026U1","TAPM731002HDFRSG06  ","MIGUEL ANGEL TAURINO PASTEN             ","11DPT0003O",null,null,null,"X",null,null,null,null,null,null,null,null,null,null,null,1,0,0,32060.73]
[null,"GUANAJUATO","TEHM7408294G1","TEHM740829HGTLRR02  ","MARCO ANTONIO TELLEZ HERRERA            ","11DPT0001Q",null,null,null,"X",null,null,null,null,null,null,null,null,null,null,null,1,0,0,27674.31]
[null,"GUANAJUATO","TERY911028QH5","TERY911028MGTNMS08  ","YASMIN DEL CARME TENA RAMIREZ           ","11APT0001T",null,null,null,"X",null,null,null,null,null,null,null,null,null,null,null,1,0,0,21858.54]
[null,"GUANAJUATO","TOCB650526KH4","TOCB650526MGTRVR00  ","BERTHA TORRES COBARRUBIAS               ","11DPT0005M",null,null,null,null,null,null,null,null,null,null,null,null,"X",null,null,1,0,0,90974.399999999994]
[null,"GUANAJUATO","TOCF910415931","TOCF910415MGTRRT00  ","FATIMA DEL ROSAR TORRES CERVANTES       ","11DPT0001Q",null,null,null,"X",null,null,null,null,null,null,null,null,null,null,null,1,0,0,26089.380000000005]
[null,"GUANAJUATO","TOMP701231IUA","TOMP701231MGTRJT08  ","PATRICIA TORRES MEJIA                   ","11DPT0006L",null,null,null,"X",null,null,null,null,null,null,null,null,null,null,null,1,0,0,37536.18]
[null,"GUANAJUATO","TORM8008155Q9","TORM800815HGTRVR02  ","MARIO TORRES RIVERA                     ","11DPT0014U",null,null,null,"X",null,null,null,null,null,null,null,null,null,null,null,1,0,0,33523.119999999995]
[null,"GUANAJUATO","TOSS530312KL6","TOSS530312HDFRMM05  ","SAMUEL TORRES SUMOZA                    ","11DPT0001Q",null,null,null,"X",null,null,null,null,null,null,null,null,null,null,null,1,0,0,28663.870000000003]
[null,"GUANAJUATO","VAAM631105TU4","VAAM631105HGTLYR06  ","MARTIN VALENTE AYALA                    ","11DPT0001Q",null,null,null,"X",null,null,null,null,null,null,null,null,null,null,null,1,0,0,35910.22]
[null,"GUANAJUATO","VACM560124H46","VACM560124HGTZRR03  ","MAURILIO VAZQUEZ CERVANTES              ","11DPT0009I",null,null,null,"X",null,null,null,null,null,null,null,null,null,null,null,1,0,0,37811.509999999995]
[null,"GUANAJUATO","VACY6607278R7","VACY660727MGTRSL08  ","YOLANDA VARGAS CASTILLO                 ","11DPT0005M",null,null,null,"X",null,null,null,null,null,null,null,null,null,null,null,1,0,0,76206.000000000015]
[null,"GUANAJUATO","VAEA7904041V2","VAEA790404HGTLLL05  ","ALEJANDRO VALADEZ ELIAS                 ","11DPT0002P",null,null,null,"X",null,null,null,null,null,null,null,null,null,null,null,1,0,0,28451.97]
[null,"GUANAJUATO","VAGC6606185V3","VAGC660618MGTRRN09  ","CANDELARIA VARGAS GARCIA                ","11DPT0005M",null,null,null,"X",null,null,null,null,null,null,null,null,null,null,null,1,0,0,25730.300000000003]
[null,"GUANAJUATO","VALN7508285U9","VALN750828MGTZMR00  ","NORMA ADRIANA VAZQUEZ LOMELI            ","11DPT0005M",null,null,null,"X",null,null,null,null,null,null,null,null,null,null,null,1,0,0,39793.810000000005]
[null,"GUANAJUATO","VAMF590309CY5","VAMF590309HGTLNR07  ","FERNANDO VALDES MONTES                  ","11DPT0012W",null,null,null,"X",null,null,null,null,null,null,null,null,null,null,null,1,0,0,86433.489999999991]
[null,"GUANAJUATO","VARG660927MXA","VARG660927MDFLSL01  ","GLORIA GUADALUPE VALENZUELA RIOS        ","11APT0001T",null,null,null,null,null,null,null,null,null,null,null,null,"X",null,null,1,0,0,89158.079999999987]
[null,"GUANAJUATO","VASO730804UX2","VASO730804HGTRTC00  ","OCTAVIO VARGAS SOTO                     ","11DPT0004N",null,null,null,"X",null,null,null,null,null,null,null,null,null,null,null,1,0,0,92745.459999999992]
[null,"GUANAJUATO","VASS860602N16","VASS860602MQTLNN00  ","SANDRA YANET VALTIERRA SANCHEZ          ","11DPT0012W",null,null,null,"X",null,null,null,null,null,null,null,null,null,null,null,1,0,0,54875.649999999994]
[null,"GUANAJUATO","VEGG461124SB3","VEGG461124HGTLLD01  ","J. GUADALUPE VELAZQUEZ GALLARDO         ","11DPT0002P",null,null,null,"X",null,null,null,null,null,null,null,null,null,null,null,1,0,0,39012]
[null,"GUANAJUATO","VEGR631014AK5","VEGR631014HGTLRB01  ","RUBEN VELAZQUEZ GARCIA                  ","11DPT0001Q",null,null,null,"X",null,null,null,null,null,null,null,null,null,null,null,1,0,0,35037.17]
[null,"GUANAJUATO","VEHP610906SJ2","VEHP610906HGTRRT04  ","PETRONILO VERA HERNANDEZ                ","11DPT0001Q",null,null,null,"X",null,null,null,null,null,null,null,null,null,null,null,1,0,0,43537.040000000008]
[null,"GUANAJUATO","VEMM86100222D","VEMM861022MGTRNR00  ","MIRIAM SOLEDAD VERA MENDIETA            ","11DPT0001Q",null,null,null,"X",null,null,null,null,null,null,null,null,null,null,null,1,0,0,22373.86]
[null,"GUANAJUATO","VEMR6104101A1","VEMR610410HGTLRM02  ","JOSE RAMON VELEZ MORENO                 ","11DPT0010Y",null,null,null,"X",null,null,null,null,null,null,null,null,null,null,null,1,0,0,73109.76999999999]
[null,"GUANAJUATO","VIRS630902SUA","VIRS630902HMNLYL09  ","SALVADOR VILLANUEVA REYNOSO             ","11DPT0012W",null,null,null,"X",null,null,null,null,null,null,null,null,null,null,null,1,0,0,83760.34]
[null,"GUANAJUATO","VIVM841025NR4","VIVM841025MGTLRL07  ","MELINA VILLARREAL VARGAS                ","11DPT0008J",null,null,null,"X",null,null,null,null,null,null,null,null,null,null,null,1,0,0,76678.609999999986]
[null,"GUANAJUATO","YEGL891123ML2","YEGL891123MGTPRR08  ","LAURA VERONICA YEPEZ GARCIA             ","11DPT0006L",null,null,null,"X",null,null,null,null,null,null,null,null,null,null,null,1,0,0,20367.480000000003]
[null,"GUANAJUATO","ZAAF7902055E9","ZAAF790205HGTMLR09  ","FERNANDO ZAMARRIPA ALDAPE               ","11APT0001T",null,null,null,"X",null,null,null,null,null,null,null,null,null,null,null,1,0,0,90842.04]
[null,"GUANAJUATO","ZABS740117LZ8","ZABS740117MGRMLS00  ","SUSY ROCIO ZAMUDIO BALVUENA             ","11DPT0012W",null,null,null,"X",null,null,null,null,null,null,null,null,null,null,null,1,0,0,67015.62]
[null,"GUANAJUATO","ZABS850402N68","ZABS850402HGTMLR06  ","SERGIO LUIS ZAMUDIO BELTRAN             ","11DPT0012W",null,null,null,"X",null,null,null,null,null,null,null,null,null,null,null,1,0,0,32607.33]
[null,"GUANAJUATO","ZAHE711130S69","ZAHE711130MDFMRR03  ","ERIKA DE LOS ANGE ZAMORA HERNANDEZ      ","11APT0001T",null,null,null,"X",null,null,null,null,null,null,null,null,null,null,null,1,0,0,99911.16]
[null,"GUANAJUATO","ZALC5604237Q2","ZALC560423HGTVPR01  ","CARLOS ZAVALA LOPEZ                     ","11DPT0001Q",null,null,null,"X",null,null,null,null,null,null,null,null,null,null,null,1,0,0,34856.089999999997]
[null,"GUANAJUATO","ZALE620903MK9","ZALE620903HGTVND01  ","EDUARDO ZAVALA LEON                     ","11APT0001T",null,null,null,"X",null,null,null,null,null,null,null,null,null,null,null,1,0,0,60040.03]
[null,"GUANAJUATO","ZERV770303SS4","ZERV770303MGTNCN07  ","MARIA  VANESSA ZENDEJAS ROCHA           ","11DPT0013V",null,null,null,"X",null,null,null,null,null,null,null,null,null,null,null,1,0,0,41960.14]
[null,"GUANAJUATO","ZERY820116NN8","ZERY820116MGTNCD08  ","YADIRA BERENICE ZENDEJAS ROCHA          ","11APT0001T",null,null,null,"X",null,null,null,null,null,null,null,null,null,null,null,1,0,0,41885.850000000006]
[null,"GUANAJUATO","ZUGJ5210227C5","ZUGJ521022HGTXRV02  ","JAVIER ZUÑIGA GARCIA                    ","11DPT0001Q",null,null,null,null,null,null,null,null,null,null,null,null,"X",null,null,1,0,0,90974.399999999994]
[null,"GUANAJUATO","AAVB660401UL2","AAVB660401MDFLVL01","BLANCA IVETTE ALVAREZ DEL CASTILLO VENTRE","11DPT0001Q",null,null,null,null,null,null,null,"X",null,null,null,null,null,null,null,1,0,0,14672.36]
[null,"GUANAJUATO","AOOC650822A32","AOOC650822MGTRJR02","MA CRISTINA ARROYO OJEDA","11DPT0001Q",null,null,null,null,null,null,null,"X",null,null,null,null,null,null,null,1,0,0,7450]
[null,"GUANAJUATO","AOOS720925113","AOOS720925MGTBRN08","SANDRA ABOYTES OROZCO","11DPT0001Q",null,null,null,null,null,null,null,"X",null,null,null,null,null,null,null,1,0,0,10802.5]
[null,"GUANAJUATO","BOSC820326R12","BOSC820326HGTLRR09","CARLOS MARTIN BOLAÑOS SERVIN","11DPT0001Q",null,null,null,null,null,null,null,"X",null,null,null,null,null,null,null,1,0,0,3725]
[null,"GUANAJUATO","CAAL690628AM6","CAAL690628MGTRLT08","MARIA LETICIA CARDENAS ALMANZA","11DPT0001Q",null,null,null,null,null,null,null,"X",null,null,null,null,null,null,null,1,0,0,3725]
[null,"GUANAJUATO","CABD840721MI3","CABD840721HGTSNN09","DANIEL CASIQUE BUENAVISTA","11DPT0001Q",null,null,null,null,null,null,null,"X",null,null,null,null,null,null,null,1,0,0,5417.4]
[null,"GUANAJUATO","CAEL691012SG8","CAEL691012MDFRST01","LETICIA CARMONA  ESPINOSA ","11DPT0001Q",null,null,null,null,null,null,null,"X",null,null,null,null,null,null,null,1,0,0,8986.86]
[null,"GUANAJUATO","CALF930503GQ7","CALF930503HGTMPR00","FRANCISCO JAVIER CAMACHO LOPEZ","11DPT0001Q",null,null,null,null,null,null,null,"X",null,null,null,null,null,null,null,1,0,0,2071.0300000000002]
[null,"GUANAJUATO","CAOL581027513","CAOL581027HGTMLS01","JOSE LUIS CAMPOS OLALDE","11DPT0001Q",null,null,null,null,null,null,null,"X",null,null,null,null,null,null,null,1,0,0,18422.280000000002]
[null,"GUANAJUATO","CAPJ680119DJ7","CAPJ680119HGTZTN01","J. ANDRES CAZARES PATIÑO","11DPT0001Q",null,null,null,null,null,null,null,"X",null,null,null,null,null,null,null,1,0,0,12772.53]
[null,"GUANAJUATO","CARJ7608215KA","CARJ760821HTLRDN05","JOSE JUAN CARRILLO RODRIGUEZ","11DPT0001Q",null,null,null,null,null,null,null,"X",null,null,null,null,null,null,null,1,0,0,6668.26]
[null,"GUANAJUATO","CARL560630141","CARL560630HGTSVS09","JOSE LUIS CASTRO RIVAS","11DPT0001Q",null,null,null,null,null,null,null,"X",null,null,null,null,null,null,null,1,0,0,3725]
[null,"GUANAJUATO","CAVA820322S74","CAVA820322HDFHRB06","ABRAHAM CHAVEZ VARELA","11DPT0001Q",null,null,null,null,null,null,null,"X",null,null,null,null,null,null,null,1,0,0,20303.820000000003]
[null,"GUANAJUATO","CEGE7106304G8","CEGE710630MGTBML09","MA ELIZABETH CEBALLOS GOMEZ","11DPT0001Q",null,null,null,null,null,null,null,"X",null,null,null,null,null,null,null,1,0,0,3725]
[null,"GUANAJUATO","CIGM510313HX4","CIGM510313HVZSRG08","MIGUEL ANGEL CISNEROS GARCIA","11DPT0001Q",null,null,null,null,null,null,null,"X",null,null,null,null,null,null,null,1,0,0,4429.2299999999996]
[null,"GUANAJUATO","COMM610831NKA","COMM610831HDFRRG06","MIGUEL CORTES MORALES","11DPT0001Q",null,null,null,null,null,null,null,"X",null,null,null,null,null,null,null,1,0,0,5777.25]
[null,"GUANAJUATO","COVE740314GR2","COVE740314HGTRZN07","ENRIQUE CORTEZ VAZQUEZ","11DPT0001Q",null,null,null,null,null,null,null,"X",null,null,null,null,null,null,null,1,0,0,7929.6]
[null,"GUANAJUATO","DEPT800907TBA","DEPT800907MGTRDR04","MARIA TERESA DERRAMADERO PADILLA","11DPT0001Q",null,null,null,null,null,null,null,"X",null,null,null,null,null,null,null,1,0,0,14900]
[null,"GUANAJUATO","EICS7010205K2","EICS701020MMNNRR06","SERAFINA ENRIQUEZ CORDOVA","11DPT0001Q",null,null,null,null,null,null,null,"X",null,null,null,null,null,null,null,1,0,0,14818.36]
[null,"GUANAJUATO","FEHE800724TQ5","FEHE800724HGTRRD06","EDUARDO FERNANDEZ HERNANDEZ","11DPT0001Q",null,null,null,null,null,null,null,"X",null,null,null,null,null,null,null,1,0,0,8842.7000000000007]
[null,"GUANAJUATO","GODA691116ALA","GODA691116HDFMZL07","ALEJANDRO GOMEZ DIAZ","11DPT0001Q",null,null,null,null,null,null,null,"X",null,null,null,null,null,null,null,1,0,0,6629]
[null,"GUANAJUATO","GOGJ710330Q32","GOGJ710330HDFMMN08","JUAN MANUEL GOMEZ GOMEZ","11DPT0001Q",null,null,null,null,null,null,null,"X",null,null,null,null,null,null,null,1,0,0,11459.64]
[null,"GUANAJUATO","GOLG8308137R7","GOLG830813HSPNPB08","GABRIEL HUMBERTO GONZALEZ LOPEZ","11DPT0001Q",null,null,null,null,null,null,null,"X",null,null,null,null,null,null,null,1,0,0,6760.6599999999989]
[null,"GUANAJUATO","GOPE721215MA1","GOPE721215HGTNSD00","EDISON OSWALDO GONZALEZ PESCADOR","11DPT0001Q",null,null,null,null,null,null,null,"X",null,null,null,null,null,null,null,1,0,0,12838.36]
[null,"GUANAJUATO","GUCA621009A88","GUCA621009MGTTHR00","ARACELI GUTIERREZ CHACON","11DPT0001Q",null,null,null,null,null,null,null,"X",null,null,null,null,null,null,null,1,0,0,3851.5]
[null,"GUANAJUATO","GUCM630109EJ1","GUCM630109MGTTSR00","MARIA MARTINA MARGARITA GUTIERREZ CASTRO","11DPT0001Q",null,null,null,null,null,null,null,"X",null,null,null,null,null,null,null,1,0,0,5374.38]
[null,"GUANAJUATO","GUJE600723CI3","GUJE600723HGTZMR03","ERNESTO GUZMAN JIMENEZ","11DPT0001Q",null,null,null,null,null,null,null,"X",null,null,null,null,null,null,null,1,0,0,5374.38]
[null,"GUANAJUATO","GULA760327G74","GULA760327MCSLPN05","ANA CELIA GUILLEN LOPEZ","11DPT0001Q",null,null,null,null,null,null,null,"X",null,null,null,null,null,null,null,1,0,0,13347.470000000001]
[null,"GUANAJUATO","HEAM501110PP1","HEAM501110MDFRRN05","MINERVA HERNANDEZ ARMENDARIZ","11DPT0001Q",null,null,null,null,null,null,null,"X",null,null,null,null,null,null,null,1,0,0,7196.7000000000007]
[null,"GUANAJUATO","JIEC831030A73","JIEC831030MGTMSR07","MARIA CRISTHIAN JIMENEZ ESQUEDA","11DPT0001Q",null,null,null,null,null,null,null,"X",null,null,null,null,null,null,null,1,0,0,5483.6]
[null,"GUANAJUATO","JISS660630UT8","JISS660630HGTMNR01","SERGIO JIMENEZ SANCHEZ","11DPT0001Q",null,null,null,null,null,null,null,"X",null,null,null,null,null,null,null,1,0,0,13920.92]
[null,"GUANAJUATO","LOBA7910123P2","LOBA791012HJCPRL00","ALEJANDRO LOPEZ BRIONES","11DPT0001Q",null,null,null,null,null,null,null,"X",null,null,null,null,null,null,null,1,0,0,22856]
[null,"GUANAJUATO","LOGJ711211E25","LOGJ711211HGTMVN07","JUAN LOMAS GUEVARA","11DPT0001Q",null,null,null,null,null,null,null,"X",null,null,null,null,null,null,null,1,0,0,11175]
[null,"GUANAJUATO","LOJR7312299QW","LOJR731229HGTPRC05","RICARDO LOPEZ JUAREZ","11DPT0001Q",null,null,null,null,null,null,null,"X",null,null,null,null,null,null,null,1,0,0,4283.75]
[null,"GUANAJUATO","MACM811125AAA","MACM811125MGTSRR00","MARLENE SELENE MASCOTTE CRUZ","11DPT0001Q",null,null,null,null,null,null,null,"X",null,null,null,null,null,null,null,1,0,0,9498.75]
[null,"GUANAJUATO","MAMA711017CPA","MAMA711017HGTRNR02","ARTURO MARTINEZ MONCADA","11DPT0001Q",null,null,null,null,null,null,null,"X",null,null,null,null,null,null,null,1,0,0,21605]
[null,"GUANAJUATO","MAMA770820UT0","MAMA770820MGTRRN06","ANA LILIA MARTINEZ MARTINEZ","11DPT0001Q",null,null,null,null,null,null,null,"X",null,null,null,null,null,null,null,1,0,0,20745.72]
[null,"GUANAJUATO","MASJ651012DZ4","MASJ651012HVZRNN09","JUAN CARLOS MARTINEZ SANTOS","11DPT0001Q",null,null,null,null,null,null,null,"X",null,null,null,null,null,null,null,1,0,0,39752.000000000007]
[null,"GUANAJUATO","MEHE811224IH7","MEHE811224HGTNRM08","EMMANUEL MENDOZA HERNANDEZ","11DPT0001Q",null,null,null,null,null,null,null,"X",null,null,null,null,null,null,null,1,0,0,4971.76]
[null,"GUANAJUATO","MEMC880817J34","MEMC880817MDFDRL00","CLAUDIA CONCEPCION MEDINA MARIN","11DPT0001Q",null,null,null,null,null,null,null,"X",null,null,null,null,null,null,null,1,0,0,6046.7999999999993]
[null,"GUANAJUATO","MEOS540912EG6","MEOS540912HDFDCL09","SALVADOR MEDINA OCAÑA","11DPT0001Q",null,null,null,null,null,null,null,"X",null,null,null,null,null,null,null,1,0,0,3779.26]
[null,"GUANAJUATO","MOHD5903208E0","MOHD590320HMCCRL05","JOSE DOLORES GUADALUPE MOCTEZUMA HERNANDEZ","11DPT0001Q",null,null,null,null,null,null,null,"X",null,null,null,null,null,null,null,1,0,0,9312.5]
[null,"GUANAJUATO","MOPL8106219G5","MOPL810621MGTRLD07","LIDIA MORENO PALOALTO","11DPT0001Q",null,null,null,null,null,null,null,"X",null,null,null,null,null,null,null,1,0,0,15406]
[null,"GUANAJUATO","NUHG820619JC1","NUHG820619MGTXRR08","GRACIELA GUADALUPE NUÑEZ HERNANDEZ","11DPT0001Q",null,null,null,null,null,null,null,"X",null,null,null,null,null,null,null,1,0,0,9995.4000000000015]
[null,"GUANAJUATO","OIBM740215HY9","OIBM740215MGTRRR07","MIRIAM ORTIZ BARROSO","11DPT0001Q",null,null,null,null,null,null,null,"X",null,null,null,null,null,null,null,1,0,0,8891]
[null,"GUANAJUATO","PAGJ820614HB3","PAGJ820614MGTLRN07","JUANA ADRIANA PALOALTO GARCIA","11DPT0001Q",null,null,null,null,null,null,null,"X",null,null,null,null,null,null,null,1,0,0,3911.25]
[null,"GUANAJUATO","PEGR811217KS9","PEGR811217HGTRRC00","RICARDO PEREZ GARCIA","11DPT0001Q",null,null,null,null,null,null,null,"X",null,null,null,null,null,null,null,1,0,0,20359.499999999996]
[null,"GUANAJUATO","PIZM740723DV9","PIZM740723MGTZMR06","MIRYAM PIZANO ZAMORA","11DPT0001Q",null,null,null,null,null,null,null,"X",null,null,null,null,null,null,null,1,0,0,4971.76]
[null,"GUANAJUATO","RAGL820420UF7","RAGL820420MGTMMR03","LOURDES MIRELLA RAMOS GOMEZ","11DPT0001Q",null,null,null,null,null,null,null,"X",null,null,null,null,null,null,null,1,0,0,25423.72]
[null,"GUANAJUATO","RAGM860115N6A","RAGM860115HGTMRR00","MAURO RAMIREZ GARCIA","11DPT0001Q",null,null,null,null,null,null,null,"X",null,null,null,null,null,null,null,1,0,0,6629]
[null,"GUANAJUATO","RALG600418P69","RALG600418MGTMPD09","MARIA GUADALUPE RAMOS LOPEZ","11DPT0001Q",null,null,null,null,null,null,null,"X",null,null,null,null,null,null,null,1,0,0,29636.720000000001]
[null,"GUANAJUATO","RECT770406EE9","RECT770406MMNNHR04","TERESITA DEL NIÑO JESUS RENTERIA CHAVEZ","11DPT0001Q",null,null,null,null,null,null,null,"X",null,null,null,null,null,null,null,1,0,0,6629]
[null,"GUANAJUATO","RICM661008713","RICM661008MGTSSR09","MARIBEL RIOS CASTRO","11DPT0001Q",null,null,null,null,null,null,null,"X",null,null,null,null,null,null,null,1,0,0,15889.810000000001]
[null,"GUANAJUATO","ROBI8212203L0","ROBI821220MDFDCT00","ITZEL RODRIGUEZ BECERRA","11DPT0001Q",null,null,null,null,null,null,null,"X",null,null,null,null,null,null,null,1,0,0,19990.849999999999]
[null,"GUANAJUATO","ROCJ841011870","ROCJ841011MDFDSS04","MARIA DE JESUS RODRIGUEZ CASTRO","11DPT0001Q",null,null,null,null,null,null,null,"X",null,null,null,null,null,null,null,1,0,0,4971.76]
[null,"GUANAJUATO","RONB7703042K6","RONB770304MGTDTT07","BEATRIZ RODRIGUEZ NIETO","11DPT0001Q",null,null,null,null,null,null,null,"X",null,null,null,null,null,null,null,1,0,0,5186.3999999999996]
[null,"GUANAJUATO","ROSC730321AY9","ROSC730321HGTSLR07","JOSE CRUZ ROSALES SOLARZANO","11DPT0001Q",null,null,null,null,null,null,null,"X",null,null,null,null,null,null,null,1,0,0,22621.72]
[null,"GUANAJUATO","ROVD750821HSA","ROVD750821MMNCLM06","DAMARY BERENICE ROCHA VILLAGOMEZ","11DPT0001Q",null,null,null,null,null,null,null,"X",null,null,null,null,null,null,null,1,0,0,4223.2299999999996]
[null,"GUANAJUATO","SACJ630711ERA","SACJ630711MGTNRN08","JUANA PATRICIA SANCHEZ CORNEJO","11DPT0001Q",null,null,null,null,null,null,null,"X",null,null,null,null,null,null,null,1,0,0,10748.76]
[null,"GUANAJUATO","SAGB671230SK2","SAGB671230MGTNLR00","BLANCA ELBA SANCHEZ GARCIA","11DPT0001Q",null,null,null,null,null,null,null,"X",null,null,null,null,null,null,null,1,0,0,8891]
[null,"GUANAJUATO","SAGM870320FE0","SAGM870320MGTNNR07","MIRIAM LETICIA SANCHEZ GONZALEZ","11DPT0001Q",null,null,null,null,null,null,null,"X",null,null,null,null,null,null,null,1,0,0,587.9]
[null,"GUANAJUATO","SAJR580415PN8","SAJR580415HGTNMY05","RAYMUNDO SANTOYO JIMENEZ","11DPT0001Q",null,null,null,null,null,null,null,"X",null,null,null,null,null,null,null,1,0,0,18872.439999999995]
[null,"GUANAJUATO","SOAC781204EF3","SOAC781204HGTLLR00","CARLOS SOLIS ALCALA","11DPT0001Q",null,null,null,null,null,null,null,"X",null,null,null,null,null,null,null,1,0,0,5720.3700000000008]
[null,"GUANAJUATO","TAFE821210JV8","TAFE821210MMNPLL03","ELIDA TAPIA FLORES","11DPT0001Q",null,null,null,null,null,null,null,"X",null,null,null,null,null,null,null,1,0,0,16047.939999999999]
[null,"GUANAJUATO","TOOL570825A45","TOOL570825HOCRRS04","LUIS FIDEL TORRES ORDAZ","11DPT0001Q",null,null,null,null,null,null,null,"X",null,null,null,null,null,null,null,1,0,0,103118.8]
[null,"GUANAJUATO","TUMJ870625262","TUMJ870625HGTLLF00","JAFET GASSEN TULA MALDONADO","11DPT0001Q",null,null,null,null,null,null,null,"X",null,null,null,null,null,null,null,1,0,0,12565.66]
[null,"GUANAJUATO","VEGC620316675","VEGC620316MJCLTR03","CRISTINA VELAZCO GUTIERREZ","11DPT0001Q",null,null,null,null,null,null,null,"X",null,null,null,null,null,null,null,1,0,0,21497.52]
[null,"GUANAJUATO","VIRE830228NR9","VIRE830228HGTLDD01","EDUARDO VILLAFAÑA RODRIGUEZ","11DPT0001Q",null,null,null,null,null,null,null,"X",null,null,null,null,null,null,null,1,0,0,6629]
[null,"GUANAJUATO","ZAVJ481005MS5","ZAVJ481005HGTVLS09","JOSE DE JESUS ZAVALA VILLAGOMEZ","11DPT0001Q",null,null,null,null,null,null,null,"X",null,null,null,null,null,null,null,1,0,0,3314.5]
[null,"GUANAJUATO","AAGC731126M29","AAGC731126HDFLNN07","CONRRADO ARTURO ALVAREZ GONZALEZ","11DPT0002P",null,null,null,null,null,null,null,"X",null,null,null,null,null,null,null,1,0,0,7575.9]
[null,"GUANAJUATO","AUCL821209DC6","AUCL821209MVZRRT05","LETICIA CAROLINA ARGUELLES CRUZ","11DPT0002P",null,null,null,null,null,null,null,"X",null,null,null,null,null,null,null,1,0,0,2320.15]
[null,"GUANAJUATO","CAEL721019IZ9","CAEL721019MGTSLL08","LILIA ISELA CASTILLO ELIZARRARAZ","11DPT0002P",null,null,null,null,null,null,null,"X",null,null,null,null,null,null,null,1,0,0,4814.38]
[null,"GUANAJUATO","CAHJ750812FB7","CAHJ750812HGTHRR09","JORGE ALEJANDRO CHAGOYA HERNANDEZ","11DPT0002P",null,null,null,null,null,null,null,"X",null,null,null,null,null,null,null,1,0,0,9485.9000000000015]
[null,"GUANAJUATO","CAMH790325MK6","CAMH790325HGTSSC09","HECTOR CASTRO MOSQUEDA","11DPT0002P",null,null,null,null,null,null,null,"X",null,null,null,null,null,null,null,1,0,0,7703]
[null,"GUANAJUATO","CILG720124JZ9","CILG720124MGTSPD05","MA GUADALUPE CISNEROS LOPEZ","11DPT0002P",null,null,null,null,null,null,null,"X",null,null,null,null,null,null,null,1,0,0,11233.56]
[null,"GUANAJUATO","COAA820127CJ8","COAA820127MGTRYN00","ANA ERICKA CORRALES AYALA","11DPT0002P",null,null,null,null,null,null,null,"X",null,null,null,null,null,null,null,1,0,0,5587.5]
[null,"GUANAJUATO","COCF790524RG5","COCJ790524HGTNRR07","FRANCISCO JAVIER CONTRERAS CERVANTES","11DPT0002P",null,null,null,null,null,null,null,"X",null,null,null,null,null,null,null,1,0,0,11737.859999999999]
[null,"GUANAJUATO","COCJ790301RG5","COCJ790301HGTRRN06","JOSE JUAN CORRALES CORONA","11DPT0002P",null,null,null,null,null,null,null,"X",null,null,null,null,null,null,null,1,0,0,6061.2]
[null,"GUANAJUATO","COMS721010P5A","COMS721010MGTRSL09","SILVIA CORDOBA  MOSQUEDA","11DPT0002P",null,null,null,null,null,null,null,"X",null,null,null,null,null,null,null,1,0,0,8891]
[null,"GUANAJUATO","CUTP650130E94","CUTP650130HGTRRB03","PABLO CRUZ TORRES","11DPT0002P",null,null,null,null,null,null,null,"X",null,null,null,null,null,null,null,1,0,0,4971.76]
[null,"GUANAJUATO","DARE870421E95","DARE870421MGTMDD0","EDUARDINA ESAIG DAMIAN  RODRIGUEZ","11DPT0002P",null,null,null,null,null,null,null,"X",null,null,null,null,null,null,null,1,0,0,28815.999999999996]
[null,"GUANAJUATO","DEBY851217D4A","DEBJ851217MGTLLS09","JUSELY GUADALUPE DELGADO BELTRAN","11DPT0002P",null,null,null,null,null,null,null,"X",null,null,null,null,null,null,null,1,0,0,3725]
[null,"GUANAJUATO","DICI670401TA1","DICI670401MGTZMR00","IRENE DIAZ CAMPOS","11DPT0002P",null,null,null,null,null,null,null,"X",null,null,null,null,null,null,null,1,0,0,6449.26]
[null,"GUANAJUATO","DIJT521003PE9","DIJT521003MVZZCR03","MARIA TERESITA DIAZ JACOME","11DPT0002P",null,null,null,null,null,null,null,"X",null,null,null,null,null,null,null,1,0,0,5159.3999999999996]
[null,"GUANAJUATO","DOMN670802UR9","DOMN670802MGTMNT03","NATALIA DE LOS ANGELES DOMINGUEZ MANZANO","11DPT0002P",null,null,null,null,null,null,null,"X",null,null,null,null,null,null,null,1,0,0,11072.73]
[null,"GUANAJUATO","EIVG610404DLA","EIVG610404HDFLLR08","JORGE ALBERTO ELIZARRARAS VILLALPANDO","11DPT0002P",null,null,null,null,null,null,null,"X",null,null,null,null,null,null,null,1,0,0,8446.4599999999991]
[null,"GUANAJUATO","EIVJ6412112B7","EIVJ641211HGTLLN00","JUAN CARLOS ELIZARRARAZ VILLALPANDO","11DPT0002P",null,null,null,null,null,null,null,"X",null,null,null,null,null,null,null,1,0,0,7433.26]
[null,"GUANAJUATO","EUGC810902JNA","EUGC810902HGTSZS09","CESAR JAVIER ESQUIVEL GUZMAN","11DPT0002P",null,null,null,null,null,null,null,"X",null,null,null,null,null,null,null,1,0,0,17973.72]
[null,"GUANAJUATO","EUQJ600614JNA","EUQJ600614HDFSRN05","JUAN MIGUEL ESQUIVEL QUIROZ","11DPT0002P",null,null,null,null,null,null,null,"X",null,null,null,null,null,null,null,1,0,0,17915.160000000003]
[null,"GUANAJUATO","EURT6610036LA","EURT661003MMNSYR05","TERESA ESQUIVEL REYES","11DPT0002P",null,null,null,null,null,null,null,"X",null,null,null,null,null,null,null,1,0,0,2645.48]
[null,"GUANAJUATO","FAAJ620222E7A","FAAJ620222HGTRRS08","JOSE FRANCO ARREDONDO","11DPT0002P",null,null,null,null,null,null,null,"X",null,null,null,null,null,null,null,1,0,0,10748.76]
[null,"GUANAJUATO","GAMM750120RB8","GANN750120MGTRSR08","MARTHA ELBA GARCIA MOSQUEDA","11DPT0002P",null,null,null,null,null,null,null,"X",null,null,null,null,null,null,null,1,0,0,12196.42]
[null,"GUANAJUATO","GAVJ660521UR1","GAVJ660521HGTRGN08","JUAN CARLOS GARCIA VEGA","11DPT0002P",null,null,null,null,null,null,null,"X",null,null,null,null,null,null,null,1,0,0,5914]
[null,"GUANAJUATO","GULG780404F75","GULG780404HGTRGR06","JORGE GUADALUPE GUERRERO LAGUNA","11DPT0002P",null,null,null,null,null,null,null,"X",null,null,null,null,null,null,null,1,0,0,4385.7000000000007]
[null,"GUANAJUATO","GUPG670506661","GUPG670506HGTTLS06","GUSTAVO GUTIERREZ PELAGIO","11DPT0002P",null,null,null,null,null,null,null,"X",null,null,null,null,null,null,null,1,0,0,8986.86]
[null,"GUANAJUATO","HERA4412086H0","HERA441208HGTRSL07","ALFREDO HERRERA ROSALES","11DPT0002P",null,null,null,null,null,null,null,"X",null,null,null,null,null,null,null,1,0,0,5895.1599999999989]
[null,"GUANAJUATO","HERG630310IB0","HERG630310MGTRMB03","MARIA GABRIELA SUSANA HERRERA ZUBIETA ROMERO","11DPT0002P",null,null,null,null,null,null,null,"X",null,null,null,null,null,null,null,1,0,0,12898.5]
[null,"GUANAJUATO","MAPP7311016D0","MAPP731101MJCRRR02","PERLA ANDREA MARTINEZ PEREZ","11DPT0002P",null,null,null,null,null,null,null,"X",null,null,null,null,null,null,null,1,0,0,11175]
[null,"GUANAJUATO","MASS590809U18","MASS590809HGTRTL08","SALVADOR MARTINEZ SOTO","11DPT0002P",null,null,null,null,null,null,null,"X",null,null,null,null,null,null,null,1,0,0,13188.36]
[null,"GUANAJUATO","MATM690314EG4","MATM690314MGTRRT12","MATILDE MARTINEZ TORRES","11DPT0002P",null,null,null,null,null,null,null,"X",null,null,null,null,null,null,null,1,0,0,8307.76]
[null,"GUANAJUATO","OASF640805DW4","OASF640805HGTCTR00","FRANCISCO JAVIER OCAMPO SOTO","11DPT0002P",null,null,null,null,null,null,null,"X",null,null,null,null,null,null,null,1,0,0,9485.9000000000015]
[null,"GUANAJUATO","OIGE810723LS4","OIGE810723MVZRRD02","EDITH ORTIZ GARCIA","11DPT0002P",null,null,null,null,null,null,null,"X",null,null,null,null,null,null,null,1,0,0,4445.5]
[null,"GUANAJUATO","OIZG5306099RR","OIZG530609HGTRFL01","GUILLERMO ORTIZ ZAFRA","11DPT0002P",null,null,null,null,null,null,null,"X",null,null,null,null,null,null,null,1,0,0,6019.3]
[null,"GUANAJUATO","RISM640319LE9","RISM640319HGTCRR02","JOSE MARTIN RICO SERRITEÑO","11DPT0002P",null,null,null,null,null,null,null,"X",null,null,null,null,null,null,null,1,0,0,2485.88]
[null,"GUANAJUATO","SAGM820626E90","SAGR820626MGTNNS28","MA DEL ROSARIO SANCHEZ GONZALEZ","11DPT0002P",null,null,null,null,null,null,null,"X",null,null,null,null,null,null,null,1,0,0,3725]
[null,"GUANAJUATO","SALP780917IZ3","SALP780917HGTNRD04","PEDRO JESUS SANTIAGO LARA","11DPT0002P",null,null,null,null,null,null,null,"X",null,null,null,null,null,null,null,1,0,0,4283.75]
[null,"GUANAJUATO","VAGN761014IF8","VAGN761014MGTLVD09","NADIA VALLEJO GUEVARA","11DPT0002P",null,null,null,null,null,null,null,"X",null,null,null,null,null,null,null,1,0,0,9943.5]
[null,"GUANAJUATO","AABJ690919DQ5","AABJ690919MQTYRN07","JUANA ALMA DELIA AYALA BARRERA","11DPT0003O",null,null,null,null,null,null,null,"X",null,null,null,null,null,null,null,1,0,0,4621.8]
[null,"GUANAJUATO","AABR750608IB4","AABR750608MGTYRS01","ROSA MARGARITA AYALA BARRERA","11DPT0003O",null,null,null,null,null,null,null,"X",null,null,null,null,null,null,null,1,0,0,3334.13]
[null,"GUANAJUATO","AEGD640414KLA","AAPJ880904HGTRTN01","JUAN MIGUEL ARANDA PATLAN","11DPT0003O",null,null,null,null,null,null,null,"X",null,null,null,null,null,null,null,1,0,0,8567.5]
[null,"GUANAJUATO","AORS650107KK2","AORS650107MGTRML00","MA SOLEDAD ARROYO RAMIREZ","11DPT0003O",null,null,null,null,null,null,null,"X",null,null,null,null,null,null,null,1,0,0,16046.310000000001]
[null,"GUANAJUATO","BAFL750321MR1","BAFL730321HGTRLS09","LUIS EDUARDO BARRERA FLORES","11DPT0003O",null,null,null,null,null,null,null,"X",null,null,null,null,null,null,null,1,0,0,7450]
[null,"GUANAJUATO","BEMG7505027F8","BEMG750502HGTTNR02","GERMAN BETANCOURT MENDEZ","11DPT0003O",null,null,null,null,null,null,null,"X",null,null,null,null,null,null,null,1,0,0,19212.560000000001]
[null,"GUANAJUATO","BORA580910H59","BORA580910MGTNVN06","MA. DE LOS ANGELES BONILLA RIVERA","11DPT0003O",null,null,null,null,null,null,null,"X",null,null,null,null,null,null,null,1,0,0,5374.38]
[null,"GUANAJUATO","CAMA720409D58","CAMA720409HGTMRN04","JOSE ANTONIO CAMPOS MORENO","11DPT0003O",null,null,null,null,null,null,null,"X",null,null,null,null,null,null,null,1,0,0,16797.5]
[null,"GUANAJUATO","CARI751102000","CARI751102HGTSDV01","IVAN ALEJANDRO CASTAÑEDA RODRIGUEZ","11DPT0003O",null,null,null,null,null,null,null,"X",null,null,null,null,null,null,null,1,0,0,7558.5]
[null,"GUANAJUATO","CAVM6302079D4","CAVM630207MDFLLR04","MARIANA FEDERICA CALDERON VILLALOBOS","11DPT0003O",null,null,null,null,null,null,null,"X",null,null,null,null,null,null,null,1,0,0,4514.4799999999996]
[null,"GUANAJUATO","COHV730429DPA","COHV730429MGTRDR01","VIRGINIA FABIOLA CORNEJO HIDALGO","11DPT0003O",null,null,null,null,null,null,null,"X",null,null,null,null,null,null,null,1,0,0,23597.510000000002]
[null,"GUANAJUATO","CURP6903018I5","CURP690301MGTRYT08","PATRICIA DE LA CRUZ REYES","11DPT0003O",null,null,null,null,null,null,null,"X",null,null,null,null,null,null,null,1,0,0,4864.83]
[null,"GUANAJUATO","DAZM801018IR0","DAZM801018MGTVMR04","MIRIAM TERESA DÁVALOS ZAMORA","11DPT0003O",null,null,null,null,null,null,null,"X",null,null,null,null,null,null,null,1,0,0,6960.46]
[null,"GUANAJUATO","FABV830514ES9","FABV830514HGTRLC04","VICTOR ESTEBAN FRAUSTO BOLIO","11DPT0003O",null,null,null,null,null,null,null,"X",null,null,null,null,null,null,null,1,0,0,7450]
[null,"GUANAJUATO","FUBM760807455","FUBM760807MGTNRN06","MONICA GUADALUPE FUENTES BARRON","11DPT0003O",null,null,null,null,null,null,null,"X",null,null,null,null,null,null,null,1,0,0,14285.010000000002]
[null,"GUANAJUATO","GAGE660725EF1","GAGE660725MGTYNG09","MA. EUGENIA GAYTAN GONZALEZ","11DPT0003O",null,null,null,null,null,null,null,"X",null,null,null,null,null,null,null,1,0,0,3334.13]
[null,"GUANAJUATO","GALR880422QE7","GALR880422HGTRPG08","ROGELIO GARCIA LOPEZ","11DPT0003O",null,null,null,null,null,null,null,"X",null,null,null,null,null,null,null,1,0,0,7558.5]
[null,"GUANAJUATO","GIPE8705187T7","GIPE870718MGTRDR06","ERIKA ELIZABETH GRIMALDO PADILLA","11DPT0003O",null,null,null,null,null,null,null,"X",null,null,null,null,null,null,null,1,0,0,13483]
[null,"GUANAJUATO","GONS740424640","GONS740424MGTNXS08","SUSANA MAGNOLIA GONZALEZ NU?Z","11DPT0003O",null,null,null,null,null,null,null,"X",null,null,null,null,null,null,null,1,0,0,22539.75]
[null,"GUANAJUATO","HEAA581022HVA","HEAA581022HMCRTL07","JOSE ALBERTO HERRERA ATILANO","11DPT0003O",null,null,null,null,null,null,null,"X",null,null,null,null,null,null,null,1,0,0,39694.850000000006]
[null,"GUANAJUATO","IUMM800617VC2","IUMM800617MGTSRY06","MYRNA DENISSE ISUSQUIZA MARTÍNEZ","11DPT0003O",null,null,null,null,null,null,null,"X",null,null,null,null,null,null,null,1,0,0,18941.260000000002]
[null,"GUANAJUATO","LAGG811206L76","LAGG811206MGTRND04","MARIA GUADALUPE LARA GONZALEZ","11DPT0003O",null,null,null,null,null,null,null,"X",null,null,null,null,null,null,null,1,0,0,23597.510000000002]
[null,"GUANAJUATO","LOGG700109MF1","LOGG700109MGTPRD02","MA. GUADALUPE LOPEZ GARCIA","11DPT0003O",null,null,null,null,null,null,null,"X",null,null,null,null,null,null,null,1,0,0,11364.75]
[null,"GUANAJUATO","LOSM721211630","LOSM721211MGTPRR02","MARCELA LOPEZ SORIA","11DPT0003O",null,null,null,null,null,null,null,"X",null,null,null,null,null,null,null,1,0,0,6091.26]
[null,"GUANAJUATO","MAAJ840617R99","MAAJ840617HGTRLN05","JUAN GUILLERMO MARTIN DEL CAMPO ALMENDARIZ","11DPT0003O",null,null,null,null,null,null,null,"X",null,null,null,null,null,null,null,1,0,0,4283.75]
[null,"GUANAJUATO","MESF820630A32","MESF820630HGTNLR02","FRANCISCO JAVIER MENDOZA SOLORZANO","11DPT0003O",null,null,null,null,null,null,null,"X",null,null,null,null,null,null,null,1,0,0,6822.2]
[null,"GUANAJUATO","MOQR840307NN2","MOQR840307HGTRRC01","RICARDO MORALES QUIROZ","11DPT0003O",null,null,null,null,null,null,null,"X",null,null,null,null,null,null,null,1,0,0,13483]
[null,"GUANAJUATO","MUCM5811195T2","MUCM580119HGTXMR09","JOSE MARIO MUÑOZ CAMPUSANO","11DPT0003O",null,null,null,null,null,null,null,"X",null,null,null,null,null,null,null,1,0,0,3788.25]
[null,"GUANAJUATO","MUMJ581102LE9","MUMJ581102HGTXRM09","JAIME MUÑOZ MARTINEZ","11DPT0003O",null,null,null,null,null,null,null,"X",null,null,null,null,null,null,null,1,0,0,4729.45]
[null,"GUANAJUATO","NAJE70071623A","NAJE700716HGTVMN08","ENRIQUE NAVARRETE JIMENEZ","11DPT0003O",null,null,null,null,null,null,null,"X",null,null,null,null,null,null,null,1,0,0,13483]
[null,"GUANAJUATO","PAHF740428HK9","PAHF740428HGTDRR00","FRANCISCO JAVIER PADILLA HERNÁNDEZ","11DPT0003O",null,null,null,null,null,null,null,"X",null,null,null,null,null,null,null,1,0,0,3725]
[null,"GUANAJUATO","PARH580204E82","PARH580204HDFDYC09","HECTOR PADILLA REYES","11DPT0003O",null,null,null,null,null,null,null,"X",null,null,null,null,null,null,null,1,0,0,3788.25]
[null,"GUANAJUATO","PEJE510902DF6","PEJE510902HOCRRS08","ESTEBAN PEREZ JUAREZ","11DPT0003O",null,null,null,null,null,null,null,"X",null,null,null,null,null,null,null,1,0,0,4445.5]
[null,"GUANAJUATO","PUGH6104307WA","PUGH610430HMNRMC01","HECTOR GERARDO PURECO GOMEZ","11DPT0003O",null,null,null,null,null,null,null,"X",null,null,null,null,null,null,null,1,0,0,44275.06]
[null,"GUANAJUATO","RAGM730719C38","RAGM730719MGTNMG06","MIGUEL ANGEL RANGEL GAMIÑO","11DPT0003O",null,null,null,null,null,null,null,"X",null,null,null,null,null,null,null,1,0,0,4971.76]
[null,"GUANAJUATO","RAPA580921FZ2","RAPA580921HGTMDR04","AURELIO RAMIREZ PADRON","11DPT0003O",null,null,null,null,null,null,null,"X",null,null,null,null,null,null,null,1,0,0,3725]
[null,"GUANAJUATO","RIMM880823M49","RIMM880823HGTVDR03","MARCO ANTONIO RIVERA MEDINA","11DPT0003O",null,null,null,null,null,null,null,"X",null,null,null,null,null,null,null,1,0,0,6629]
[null,"GUANAJUATO","ROCU811126UY1","ROCU811126HGTMNR08","URIEL ROMO CONTRERAS","11DPT0003O",null,null,null,null,null,null,null,"X",null,null,null,null,null,null,null,1,0,0,39694.850000000006]
[null,"GUANAJUATO","SAGJ781103MJ3","SAGJ781103HGTLRR06","JORGE ARMANDO SALAS GUARDADO","11DPT0003O",null,null,null,null,null,null,null,"X",null,null,null,null,null,null,null,1,0,0,3725]
[null,"GUANAJUATO","SAHL880928KE7","SAHL880928HGTNRS02","LUIS DAVID SANCHEZ HERNANDEZ","11DPT0003O",null,null,null,null,null,null,null,"X",null,null,null,null,null,null,null,1,0,0,6629]
[null,"GUANAJUATO","VAPL6101037B8","VAPL610103HGTZRL05","SALVADOR EUGENIO VAZQUEZ PRECIADO","11DPT0003O",null,null,null,null,null,null,null,"X",null,null,null,null,null,null,null,1,0,0,4971.76]
[null,"GUANAJUATO","VASR930322QX5","VASR930322HGTLGL04","RAUL VALDIVIA SEGOVIANO","11DPT0003O",null,null,null,null,null,null,null,"X",null,null,null,null,null,null,null,1,0,0,13843.6]
[null,"GUANAJUATO","VEHR8310237SA","VEHR831023HGTGRB01","ROBERTO VEGA HERNANDEZ","11DPT0003O",null,null,null,null,null,null,null,"X",null,null,null,null,null,null,null,1,0,0,2817.33]
[null,"GUANAJUATO","VEMJ891002000","VEMJ891002HGTLÑN02","JUAN MANUEL VELAZQUEZ MUÑOZ","11DPT0003O",null,null,null,null,null,null,null,"X",null,null,null,null,null,null,null,1,0,0,7558.5]
[null,"GUANAJUATO","VESE620331G87","VESE620331HGTRLF03","EFREN VERA SALGADO","11DPT0003O",null,null,null,null,null,null,null,"X",null,null,null,null,null,null,null,1,0,0,8264.58]
[null,"GUANAJUATO","AERA900121CW4","AERA900121MGTBDD04","ADNARA YESSICA ABREGO RODRIGUEZ","11DPT0004N",null,null,null,null,null,null,null,"X",null,null,null,null,null,null,null,1,0,0,3104.16]
[null,"GUANAJUATO","AILE800526EB7","AILE800526MDFVPL03","MARIA ELENA AVILA LOPEZ","11DPT0004N",null,null,null,null,null,null,null,"X",null,null,null,null,null,null,null,1,0,0,1862.5]
[null,"GUANAJUATO","CIOR7805171L4","CIOR780517HGTNRB00","ROBERTO CINTORA JR.","11DPT0004N",null,null,null,null,null,null,null,"X",null,null,null,null,null,null,null,1,0,0,4299.5]
[null,"GUANAJUATO","CUGE880521IJ6","CUGE880521HGTSRR02","ERIK ALBERTO CUSTODIO GARCIA","11DPT0004N",null,null,null,null,null,null,null,"X",null,null,null,null,null,null,null,1,0,0,2485.88]
[null,"GUANAJUATO","CUSJ550902DF1","CUSJ550902MGTRTN09","MARIA JANET CRUZ SOTO","11DPT0004N",null,null,null,null,null,null,null,"X",null,null,null,null,null,null,null,1,0,0,2579.6999999999998]
[null,"GUANAJUATO","DIEM790506MK2","DIEM790506MGTZSR04","MARTHA SOFIA DIAZ ESCUTIA","11DPT0004N",null,null,null,null,null,null,null,"X",null,null,null,null,null,null,null,1,0,0,2888.63]
[null,"GUANAJUATO","EAMM710507IBA","EAMM710507MASSGR04","MARTHA PATRICIA ESTRADA MAGALLON","11DPT0004N",null,null,null,null,null,null,null,"X",null,null,null,null,null,null,null,1,0,0,5279.63]
[null,"GUANAJUATO","GAVJ851126FM4","GAVJ851126HGTRYV07","JAVIER GARCIA VIEYRA","11DPT0004N",null,null,null,null,null,null,null,"X",null,null,null,null,null,null,null,1,0,0,14063.630000000001]
[null,"GUANAJUATO","GUGG720101IA2","GUGG730101HGTTZN01","GONZALO GUTIERREZ GUZMAN","11DPT0004N",null,null,null,null,null,null,null,"X",null,null,null,null,null,null,null,1,0,0,4971.76]
[null,"GUANAJUATO","HEDA800812DP2","HEDA800812HGTTZD09","ADRIAN HERNANDEZ DIAZ","11DPT0004N",null,null,null,null,null,null,null,"X",null,null,null,null,null,null,null,1,0,0,14063.630000000001]
[null,"GUANAJUATO","IAGM7302032F2","IAGM730203HGTBRB08","JAIME IBARRA GUERRERO","11DPT0004N",null,null,null,null,null,null,null,"X",null,null,null,null,null,null,null,1,0,0,7450]
[null,"GUANAJUATO","IAQA850418A89","IAQA850418MGTBND07","ADRIANA IBARRA QUINTINO","11DPT0004N",null,null,null,null,null,null,null,"X",null,null,null,null,null,null,null,1,0,0,2651.6]
[null,"GUANAJUATO","LOBL610801UA2","LOBL610801HGTPDS05","LUIS LOPEZ BEDOLLA","11DPT0004N",null,null,null,null,null,null,null,"X",null,null,null,null,null,null,null,1,0,0,7703]
[null,"GUANAJUATO","LOLB790114RE0","HERN811104MMNRJB02","NUBIA VANNESA HERNANDEZ ROJAS","11DPT0004N",null,null,null,null,null,null,null,"X",null,null,null,null,null,null,null,1,0,0,9312.5]
[null,"GUANAJUATO","LOOE660716UY7","LOOE660716HGTPJD01","EDUARDO LOPEZ OJEDA","11DPT0004N",null,null,null,null,null,null,null,"X",null,null,null,null,null,null,null,1,0,0,3352.5]
[null,"GUANAJUATO","MAHS851214LA6","MAHS851214MGTRRN01","SANDRA MARTINEZ HERNANDEZ","11DPT0004N",null,null,null,null,null,null,null,"X",null,null,null,null,null,null,null,1,0,0,16436.86]
[null,"GUANAJUATO","MATJ861103RG1","MATJ861103MGTRPZ09","JAZMIN MONSERRAT MARTINEZ TAPIA","11DPT0004N",null,null,null,null,null,null,null,"X",null,null,null,null,null,null,null,1,0,0,1325.8]
[null,"GUANAJUATO","MELM880414RR6","MELM880414MGTNPR03","MARISOL MENDEZ LOPEZ","11DPT0004N",null,null,null,null,null,null,null,"X",null,null,null,null,null,null,null,1,0,0,4971.76]
[null,"GUANAJUATO","MOZR701212DS9","MOZR701212HGTRVG09","RIGOBERTO MORENO ZAVALA","11DPT0004N",null,null,null,null,null,null,null,"X",null,null,null,null,null,null,null,1,0,0,10969.019999999999]
[null,"GUANAJUATO","OOOC810927BA9","OOOC810927MGTRRL05","CLAUDIA KARINA OROZCO OROZCO","11DPT0004N",null,null,null,null,null,null,null,"X",null,null,null,null,null,null,null,1,0,0,14063.630000000001]
[null,"GUANAJUATO","PEAA590708RJ5","PEAA590708HDFRLD08","JOSE ADRIAN ARTURO PEREZ ALVAREZ","11DPT0004N",null,null,null,null,null,null,null,"X",null,null,null,null,null,null,null,1,0,0,7703]
[null,"GUANAJUATO","PEEJ780324IC1","PEEJ780324HMNRSN01","JUAN FERNANDO PEREZ ESPINO","11DPT0004N",null,null,null,null,null,null,null,"X",null,null,null,null,null,null,null,1,0,0,3334.13]
[null,"GUANAJUATO","ROZS831101KUA","ROZS831101MMNSVN07","SANDRA ROSAS ZAVALA","11DPT0004N",null,null,null,null,null,null,null,"X",null,null,null,null,null,null,null,1,0,0,2980]
[null,"GUANAJUATO","RUDJ780213NV6","RUDJ780213HGTZZN04","JUAN CARLOS RUIZ DIAZ","11DPT0004N",null,null,null,null,null,null,null,"X",null,null,null,null,null,null,null,1,0,0,20303.820000000003]
[null,"GUANAJUATO","SADF620323P95","SADF620323HDGNVD00","FIDEL SANCHEZ DAVILA","11DPT0004N",null,null,null,null,null,null,null,"X",null,null,null,null,null,null,null,1,0,0,5392.0999999999995]
[null,"GUANAJUATO","SAVE451129SN8","SAVE451129HGTLRL03","ELIGIO SALGADO VARGAS","11DPT0004N",null,null,null,null,null,null,null,"X",null,null,null,null,null,null,null,1,0,0,5752.92]
[null,"GUANAJUATO","SOGE770916E73","SOGE770916MDFLNL08","MARIA ELENA SOLIS GONZALEZ","11DPT0004N",null,null,null,null,null,null,null,"X",null,null,null,null,null,null,null,1,0,0,15177.46]
[null,"GUANAJUATO","SOGY851206464","SOGY851206MMNSZN01","YANETH SOSA GUZMÁN","11DPT0004N",null,null,null,null,null,null,null,"X",null,null,null,null,null,null,null,1,0,0,9312.5]
[null,"GUANAJUATO","TITC671201BBA","TITC671201HMNNNR07","CRESCENCIANO TINOCO TINOCO","11DPT0004N",null,null,null,null,null,null,null,"X",null,null,null,null,null,null,null,1,0,0,3778.68]
[null,"GUANAJUATO","VIRD850905EA2","VIRD850905MGTLDY04","DEYSI VILLANUEVA RODRIGUEZ","11DPT0004N",null,null,null,null,null,null,null,"X",null,null,null,null,null,null,null,1,0,0,14063.630000000001]
[null,"GUANAJUATO","ZAHR840210PN9","ZAHR840210HGTVRD05","RODOLFO ANTONIO ZAVALA HERNANDEZ","11DPT0004N",null,null,null,null,null,null,null,"X",null,null,null,null,null,null,null,1,0,0,6419.15]
[null,"GUANAJUATO","ZAPJ830703848","ZAPJ830703HGTMRN07","JUAN MARCIAL ZAMUDIO PEREZ","11DPT0004N",null,null,null,null,null,null,null,"X",null,null,null,null,null,null,null,1,0,0,6419.15]
[null,"GUANAJUATO","ZARC711228I59","ZARC711228HGTMMN02","JOSE CONCEPCION ZAMORA RAMIREZ","11DPT0004N",null,null,null,null,null,null,null,"X",null,null,null,null,null,null,null,1,0,0,2154.4299999999998]
[null,"GUANAJUATO","AICF790308Q83","AICF790308HGTMLR01","FERNANDO AMBRIZ COLIN","11DPT0005M",null,null,null,null,null,null,null,"X",null,null,null,null,null,null,null,1,0,0,3224.63]
[null,"GUANAJUATO","AOMR770309JR5","AOMR770309MGTCRS03","ROSAURA ACOSTA MORENO","11DPT0005M",null,null,null,null,null,null,null,"X",null,null,null,null,null,null,null,1,0,0,12665]
[null,"GUANAJUATO","AULG650807MX2","AULG650807MCLGPD08","MARIA GUADALUPE AGUILAR LOPEZ","11DPT0005M",null,null,null,null,null,null,null,"X",null,null,null,null,null,null,null,1,0,0,3725]
[null,"GUANAJUATO","AUPC781109","AUPC781109HGTGNR07","CARLOS ALBERTO AGUILAR PANIAGUA","11DPT0005M",null,null,null,null,null,null,null,"X",null,null,null,null,null,null,null,1,0,0,4640.3]
[null,"GUANAJUATO","AUPL770322NG0","AUPL770322MJCGNR05","LAURA ITZAMARAY AGUIRRE PUENTE","11DPT0005M",null,null,null,null,null,null,null,"X",null,null,null,null,null,null,null,1,0,0,10748.76]
[null,"GUANAJUATO","BACL660127PY3","BACL660127HGTRNS02","JOSE LUIS BRAVO CANO","11DPT0005M",null,null,null,null,null,null,null,"X",null,null,null,null,null,null,null,1,0,0,26075]
[null,"GUANAJUATO","BAGG740408RC0","BAGG740408MGTZRB07","GABRIELA BAEZA GARCIA","11DPT0005M",null,null,null,null,null,null,null,"X",null,null,null,null,null,null,null,1,0,0,9312.5]
[null,"GUANAJUATO","BAPA800509JH2","BAPA800509HDFRRL06","ALAN BAROJAS PEREZ","11DPT0005M",null,null,null,null,null,null,null,"X",null,null,null,null,null,null,null,1,0,0,4470]
[null,"GUANAJUATO","CABA581007J13","CABA581007MMNRZN16","MARIA DE LOS ANGELES CARDENAS BAEZA","11DPT0005M",null,null,null,null,null,null,null,"X",null,null,null,null,null,null,null,1,0,0,10748.76]
[null,"GUANAJUATO","CABD570205P26","CABD570205MMNRZL00","MARIA DE LOS DOLORES CARDENAS BAEZA","11DPT0005M",null,null,null,null,null,null,null,"X",null,null,null,null,null,null,null,1,0,0,3725]
[null,"GUANAJUATO","CACR540413CR4","CACR540413HBCSSL00","RAUL CASTAÑEDA CASTRO","11DPT0005M",null,null,null,null,null,null,null,"X",null,null,null,null,null,null,null,1,0,0,4470]
[null,"GUANAJUATO","CAGG711124NT7","CAGG711124MGTRTD19","MARIA GUADALUPE CARDENAS GUTIERREZ","11DPT0005M",null,null,null,null,null,null,null,"X",null,null,null,null,null,null,null,1,0,0,5847.6]
[null,"GUANAJUATO","CUGV730427G51","CUGV730427HGTLMC00","VICTOR MANUEL CUELLAR GOMEZ","11DPT0005M",null,null,null,null,null,null,null,"X",null,null,null,null,null,null,null,1,0,0,14126.880000000001]
[null,"GUANAJUATO","DABG810704HX9","DABG810704HGTMRR08","GERSON FALCAO DAMIAN BRAVO","11DPT0005M",null,null,null,null,null,null,null,"X",null,null,null,null,null,null,null,1,0,0,5401.25]
[null,"GUANAJUATO","DIGJ5805018S3","DIGJ580501HGTZTR09","JORGE DIAZ GUTIERREZ","11DPT0005M",null,null,null,null,null,null,null,"X",null,null,null,null,null,null,null,1,0,0,8381.25]
[null,"GUANAJUATO","EANE770730ID6","EANE770730HMNSXD06","EDGAR CUAUHTEMOC ESTRADA NUÑEZ","11DPT0005M",null,null,null,null,null,null,null,"X",null,null,null,null,null,null,null,1,0,0,10748.76]
[null,"GUANAJUATO","EIDR500307HY1","EIDR500307HGTNLN02","JOSE RENE ENRIQUEZ DELGADO","11DPT0005M",null,null,null,null,null,null,null,"X",null,null,null,null,null,null,null,1,0,0,5587.5]
[null,"GUANAJUATO","FAPR6706038JA","FAPR670603HGTRRB03","ROBERTO FRANCIA PEREZ","11DPT0005M",null,null,null,null,null,null,null,"X",null,null,null,null,null,null,null,1,0,0,10318.799999999999]
[null,"GUANAJUATO","FARR900712DJ6","FARR900712MGTRMC09","ROCIO IVONNE FRANCO ROMERO","11DPT0005M",null,null,null,null,null,null,null,"X",null,null,null,null,null,null,null,1,0,0,1491.53]
[null,"GUANAJUATO","GABM720316FV9","GABM720316MGTLRR09","MARTHA PATRICIA GARCIA BELTRAN","11DPT0005M",null,null,null,null,null,null,null,"X",null,null,null,null,null,null,null,1,0,0,5587.5]
[null,"GUANAJUATO","GABM731224PP4","GABM731224HGTRLG09","MIGUEL ANGEL GARCIA BELTRAN","11DPT0005M",null,null,null,null,null,null,null,"X",null,null,null,null,null,null,null,1,0,0,6558.76]
[null,"GUANAJUATO","GASR730617EQ9","GASR730619MGTRLS03","ROSA MARIA GARCIA  SILVA","11DPT0005M",null,null,null,null,null,null,null,"X",null,null,null,null,null,null,null,1,0,0,4470]
[null,"GUANAJUATO","GOHM880217IT0","GOHM880217HGTNRR05","MARCOS ELIAS GONZALEZ HERNANDEZ","11DPT0005M",null,null,null,null,null,null,null,"X",null,null,null,null,null,null,null,1,0,0,1827.38]
[null,"GUANAJUATO","GONJ690921H46","GONJ690921HGTMTS00","JOSE JESUS GOMEZ NIETO","11DPT0005M",null,null,null,null,null,null,null,"X",null,null,null,null,null,null,null,1,0,0,5587.5]
[null,"GUANAJUATO","LEGR710831DD0","LEGR710831HGTSNL02","RAUL LESSO GONZALEZ ","11DPT0005M",null,null,null,null,null,null,null,"X",null,null,null,null,null,null,null,1,0,0,6019.3]
[null,"GUANAJUATO","MASJ860305HY5","MASJ860305HGTRRN08","JUAN CARLOS MARTINEZ SARDINA","11DPT0005M",null,null,null,null,null,null,null,"X",null,null,null,null,null,null,null,1,0,0,3314.5]
[null,"GUANAJUATO","PAAM820226JB0","PAAM820226HGTRGR02","MARTIN PRADO AGUILAR","11DPT0005M",null,null,null,null,null,null,null,"X",null,null,null,null,null,null,null,1,0,0,7954.8]
[null,"GUANAJUATO","QUGL880501733","QUGL880501MGTRRR02","LORENA QUIROZ GARCÍA","11DPT0005M",null,null,null,null,null,null,null,"X",null,null,null,null,null,null,null,1,0,0,7077.5]
[null,"GUANAJUATO","RAAL791208PR9","RAAL791208MGTZNL07","LILIA CONCEPCION RAZO ANGELES","11DPT0005M",null,null,null,null,null,null,null,"X",null,null,null,null,null,null,null,1,0,0,16123.14]
[null,"GUANAJUATO","RAPW7805122P3","RAPW780512MGTMRN01","WENDY RAMIREZ PARRA","11DPT0005M",null,null,null,null,null,null,null,"X",null,null,null,null,null,null,null,1,0,0,12595.1]
[null,"GUANAJUATO","RIAM860508FPA","RIAM860508MGTVRR09","MARISA RIVERA ARREDONDO","11DPT0005M",null,null,null,null,null,null,null,"X",null,null,null,null,null,null,null,1,0,0,2980]
[null,"GUANAJUATO","RONI871027MR5","RONI871027HGTDGG00","JOSE IGNACIO RODRIGUEZ NEGRETE","11DPT0005M",null,null,null,null,null,null,null,"X",null,null,null,null,null,null,null,1,0,0,5303.2]
[null,"GUANAJUATO","SAMR641029MF0","SAMR641029HGTMNB09","ROBERTO SANTOYO MENDOZA","11DPT0005M",null,null,null,null,null,null,null,"X",null,null,null,null,null,null,null,1,0,0,9943.5]
[null,"GUANAJUATO","TOVJ770823IY6","TOVJ770823HGTRRM05","JUAN MANUEL TORRES  VERA","11DPT0005M",null,null,null,null,null,null,null,"X",null,null,null,null,null,null,null,1,0,0,6629]
[null,"GUANAJUATO","VIZM6610296H8","VIZM661029MMNLRN03","MONICA VILLAGOMEZ  ZARATE","11DPT0005M",null,null,null,null,null,null,null,"X",null,null,null,null,null,null,null,1,0,0,4470]
[null,"GUANAJUATO","ZARM650407FT5","ZARM650407MGTVCT02","MARIA MATILDE ZAVALA RICO","11DPT0005M",null,null,null,null,null,null,null,"X",null,null,null,null,null,null,null,1,0,0,3998.16]
[null,"GUANAJUATO","BEMG751210DE6","BEMG751210MDFLRD00","GUADALUPE KARINA BELTRAN MARTINEZ","11DPT0006L",null,null,null,null,null,null,null,"X",null,null,null,null,null,null,null,1,0,0,4299.5]
[null,"GUANAJUATO","CAGG841115NK6","CAGG841115MGTLNL08","GIULIANA CALDERON GONZALEZ","11DPT0006L",null,null,null,null,null,null,null,"X",null,null,null,null,null,null,null,1,0,0,7703]
[null,"GUANAJUATO","COPG691022N6A","COPG691022MGTNRD16","MA GUADALUPE CONTRERAS PEREZ","11DPT0006L",null,null,null,null,null,null,null,"X",null,null,null,null,null,null,null,1,0,0,18617.059999999998]
[null,"GUANAJUATO","COTR740102LT0","COTR740102MMCRRC00","ROCIO CORONA TIRADO","11DPT0006L",null,null,null,null,null,null,null,"X",null,null,null,null,null,null,null,1,0,0,34270]
[null,"GUANAJUATO","EILO590921526","EILO590921MGTSNF06","OFELIA ESPINOSA LUNA","11DPT0006L",null,null,null,null,null,null,null,"X",null,null,null,null,null,null,null,1,0,0,15559.320000000003]
[null,"GUANAJUATO","GASM760821854","GASS760821MGTRTC10","MA. DEL SOCORRO GARCIA SOTELO","11DPT0006L",null,null,null,null,null,null,null,"X",null,null,null,null,null,null,null,1,0,0,16176.319999999998]
[null,"GUANAJUATO","GUSG880306VD5","GUSG880306HGTLNR09","GERARDO GUILLEN SANCHEZ","11DPT0006L",null,null,null,null,null,null,null,"X",null,null,null,null,null,null,null,1,0,0,1827.38]
[null,"GUANAJUATO","GUSS851005CT6","GUSS851005MGTLNN08","SANDRA GUILLEN SANCHEZ","11DPT0006L",null,null,null,null,null,null,null,"X",null,null,null,null,null,null,null,1,0,0,4971.76]
[null,"GUANAJUATO","JAMJ8502091S3","JAMJ850209HDFSRL04","JULIO CESAR JASSO MARTINEZ","11DPT0006L",null,null,null,null,null,null,null,"X",null,null,null,null,null,null,null,1,0,0,17973.72]
[null,"GUANAJUATO","JAPM610407F53","JAPM610407HGTSRR00","MARCELINO JASSO PEREZ","11DPT0006L",null,null,null,null,null,null,null,"X",null,null,null,null,null,null,null,1,0,0,13258]
[null,"GUANAJUATO","LOHE8811064TA","LOHE881106MJCPRD00","EDITH LOPEZ HERNANDEZ","11DPT0006L",null,null,null,null,null,null,null,"X",null,null,null,null,null,null,null,1,0,0,7929.6]
[null,"GUANAJUATO","LUWR540208FX7","LUWR540208MDFNRB04","REBECA LUNA WIARCO","11DPT0006L",null,null,null,null,null,null,null,"X",null,null,null,null,null,null,null,1,0,0,32873.72]
[null,"GUANAJUATO","MASE831216GZ4","MASE831216MGTNTL05","ELIA MANDUJANO SOTO","11DPT0006L",null,null,null,null,null,null,null,"X",null,null,null,null,null,null,null,1,0,0,2485.88]
[null,"GUANAJUATO","MOSR800811KH0","MOSR800811HGTLNC05","RICARDO MOLINA SANCHEZ","11DPT0006L",null,null,null,null,null,null,null,"X",null,null,null,null,null,null,null,1,0,0,22350]
[null,"GUANAJUATO","OISA541015SQ0","OISA541015HGTRLL00","ALEJANDRO ORTIZ SILVA","11DPT0006L",null,null,null,null,null,null,null,"X",null,null,null,null,null,null,null,1,0,0,22227.580000000005]
[null,"GUANAJUATO","PEBJ680711PC1","PEBJ680711MGTRRN00","JUANA PEREZ BERNAL","11DPT0006L",null,null,null,null,null,null,null,"X",null,null,null,null,null,null,null,1,0,0,22227.580000000005]
[null,"GUANAJUATO","PIVC670724KD8","PIVC670724MMNLCR01","CRISTINA PLIEGO VICTORIA","11DPT0006L",null,null,null,null,null,null,null,"X",null,null,null,null,null,null,null,1,0,0,11175]
[null,"GUANAJUATO","RAAG811213NX5","RAAG811213MGTMGD09","MARIA GUADALUPE RAMIREZ AGUIRRE","11DPT0006L",null,null,null,null,null,null,null,"X",null,null,null,null,null,null,null,1,0,0,32873.72]
[null,"GUANAJUATO","RABS681021GFA","RABS681021MGTMRL03","MA SOLEDAD RAMIREZ BERMUDEZ","11DPT0006L",null,null,null,null,null,null,null,"X",null,null,null,null,null,null,null,1,0,0,14833.29]
[null,"GUANAJUATO","RAMO6702175A0","RAMO670217MMNNJL07","OLGA OFELIA RANGEL MEJIA","11DPT0006L",null,null,null,null,null,null,null,"X",null,null,null,null,null,null,null,1,0,0,11932.2]
[null,"GUANAJUATO","RORM6503108B9","RORM650310MGTSDL03","MILAGROS ROSAS RODRIGUEZ","11DPT0006L",null,null,null,null,null,null,null,"X",null,null,null,null,null,null,null,1,0,0,29250.720000000001]
[null,"GUANAJUATO","SAGI850902B58","SAGI850902MJCNNS03","ISAURA SANCHEZ GONZALEZ","11DPT0006L",null,null,null,null,null,null,null,"X",null,null,null,null,null,null,null,1,0,0,20359.499999999996]
[null,"GUANAJUATO","SAMC7308072M6","SAMC730807MGTNRR25","MA. DEL CARMEN SANCHEZ MORENO","11DPT0006L",null,null,null,null,null,null,null,"X",null,null,null,null,null,null,null,1,0,0,12122.400000000001]
[null,"GUANAJUATO","SAMM791219U15","SAMM791219MGTVDG08","MARIA MAGDALENA SAAVEDRA MEDRANO","11DPT0006L",null,null,null,null,null,null,null,"X",null,null,null,null,null,null,null,1,0,0,2741.6]
[null,"GUANAJUATO","SARP720603511","SARP720603HGTNMD03","PEDRO SANCHEZ RAMIREZ","11DPT0006L",null,null,null,null,null,null,null,"X",null,null,null,null,null,null,null,1,0,0,25423.72]
[null,"GUANAJUATO","SOAE851129KH7","SOAE851129MGTTCS09","ESPERANZA SOTO ACEVEDO","11DPT0006L",null,null,null,null,null,null,null,"X",null,null,null,null,null,null,null,1,0,0,14527.5]
[null,"GUANAJUATO","VAAJ751004U60","VAAJ751004MGTLRN04","JUANA YANET VALDEZ ARGUELLO","11DPT0006L",null,null,null,null,null,null,null,"X",null,null,null,null,null,null,null,1,0,0,10435.6]
[null,"GUANAJUATO","VAHI781011P33","VAHI781011MQTZRV06","IVETT CLARA VAZQUEZ HERNANDEZ","11DPT0006L",null,null,null,null,null,null,null,"X",null,null,null,null,null,null,null,1,0,0,12838.300000000003]
[null,"GUANAJUATO","VAMM770825UBA","VAMM770825HGTLLG05","JOSE MIGUEL VALDEZ MALDONADO","11DPT0006L",null,null,null,null,null,null,null,"X",null,null,null,null,null,null,null,1,0,0,6629]
[null,"GUANAJUATO","VEGJ690320CV6","VEGJ690320HGTGNN02","JUAN ANTONIO VEGA GONZALEZ","11DPT0006L",null,null,null,null,null,null,null,"X",null,null,null,null,null,null,null,1,0,0,26325.599999999995]
[null,"GUANAJUATO","VESJ58011884A","VESJ580118HGTGNN01","JUAN CARLOS VEGA SANCHEZ","11DPT0006L",null,null,null,null,null,null,null,"X",null,null,null,null,null,null,null,1,0,0,25936.240000000002]
[null,"GUANAJUATO","ZAGG741211FF0","ZAGG741211MMNCND04","MARIA GUADALUPE ZACARIAS GONZALEZ","11DPT0006L",null,null,null,null,null,null,null,"X",null,null,null,null,null,null,null,1,0,0,16176.319999999998]
[null,"GUANAJUATO","ZASJ710817C96","ZASJ710817MGTVLL06","JULIA XIOMARA ZAVALA SALAS","11DPT0006L",null,null,null,null,null,null,null,"X",null,null,null,null,null,null,null,1,0,0,8891]
[null,"GUANAJUATO","AAGE740808PN4","AAGE740808HGTLRM03","EMMANUEL FRANCISCO ALCARAZ GARCIA","11DPT0007K",null,null,null,null,null,null,null,"X",null,null,null,null,null,null,null,1,0,0,4445.5]
[null,"GUANAJUATO","AAGL5509065W0","AAGL550906HGTRZS02","JOSE LUIS ARAIZA GUZMAN","11DPT0007K",null,null,null,null,null,null,null,"X",null,null,null,null,null,null,null,1,0,0,5142.6100000000006]
[null,"GUANAJUATO","AEBM7404088T6","AEBM740408HGTRCG06","MIGUEL ANGEL ARELLANO BECERRA","11DPT0007K",null,null,null,null,null,null,null,"X",null,null,null,null,null,null,null,1,0,0,8986.86]
[null,"GUANAJUATO","AEIS580223D43","AEXI580223HGTDXS09","ISMAEL  AEDO","11DPT0007K",null,null,null,null,null,null,null,"X",null,null,null,null,null,null,null,1,0,0,28136.550000000003]
[null,"GUANAJUATO","AEME830910KL9","AEME830910MGTDRS08","ESPERANZA AEDO DE MARIA Y CAMPOS","11DPT0007K",null,null,null,null,null,null,null,"X",null,null,null,null,null,null,null,1,0,0,3334.13]
[null,"GUANAJUATO","AIVG860513KD0","AUVG860513MGTNZD03","MARIA GUADALUPE ANGUIANO VAZQUEZ","11DPT0007K",null,null,null,null,null,null,null,"X",null,null,null,null,null,null,null,1,0,0,9458.9]
[null,"GUANAJUATO","AONL720204923","AONL720204MGTLXT01"," MA. LETICIA ALONSO NUÑEZ","11DPT0007K",null,null,null,null,null,null,null,"X",null,null,null,null,null,null,null,1,0,0,4283.75]
[null,"GUANAJUATO","AULY531226UY7","AULY531226MDFGDL03","YOLANDA ERENDIRA AGUILAR LEDESMA","11DPT0007K",null,null,null,null,null,null,null,"X",null,null,null,null,null,null,null,1,0,0,6960.46]
[null,"GUANAJUATO","BEJE700403E37","BEXJ700403HGTLXS00","JESUS GERARDO  BELMONTE","11DPT0007K",null,null,null,null,null,null,null,"X",null,null,null,null,null,null,null,1,0,0,3778.68]
[null,"GUANAJUATO","CAGS660709C18","CAGS660709MGTHRS01","SUSANA CHAVEZ GUERRA","11DPT0007K",null,null,null,null,null,null,null,"X",null,null,null,null,null,null,null,1,0,0,14843.640000000001]
[null,"GUANAJUATO","CARS840701PT4","CARS840701MGTHMR06","SARAH GABRIELA CHAVEZ RAMIREZ","11DPT0007K",null,null,null,null,null,null,null,"X",null,null,null,null,null,null,null,1,0,0,10748.76]
[null,"GUANAJUATO","CIOV5211227Z3","CIOV521122HDFSRC01"," VICTOR SAMUEL CISNEROS ORTEGA","11DPT0007K",null,null,null,null,null,null,null,"X",null,null,null,null,null,null,null,1,0,0,3334.13]
[null,"GUANAJUATO","DIVA711128CB2","DIVA711128MMCZGL03","ALEJANDRA DIAZ VEGA","11DPT0007K",null,null,null,null,null,null,null,"X",null,null,null,null,null,null,null,1,0,0,8986.86]
[null,"GUANAJUATO","EOTJ551129MU2","EOTS551129HGTSPT10"," J. SATURNINO ESCOTO TAPIA","11DPT0007K",null,null,null,null,null,null,null,"X",null,null,null,null,null,null,null,1,0,0,12140.800000000001]
[null,"GUANAJUATO","GACM6402137QA","GACM640213MGTRNR05","MARICELA GARCIA CHAVEZ","11DPT0007K",null,null,null,null,null,null,null,"X",null,null,null,null,null,null,null,1,0,0,3334.13]
[null,"GUANAJUATO","GAGA6703123EA","GAGA670312HGTSNL02","JOSE ALFREDO GASCA GONZALEZ","11DPT0007K",null,null,null,null,null,null,null,"X",null,null,null,null,null,null,null,1,0,0,4445.5]
[null,"GUANAJUATO","GAML640822","GAML640822MDFRNT04","MARIA LETICIA GARCIA MENDEZ","11DPT0007K",null,null,null,null,null,null,null,"X",null,null,null,null,null,null,null,1,0,0,27109.519999999997]
[null,"GUANAJUATO","GAML700607LKJ","GAML700607HGTLXS02","LUIS ROBERTO GALLEGOS MUÑOZ","11DPT0007K",null,null,null,null,null,null,null,"X",null,null,null,null,null,null,null,1,0,0,2310.9]
[null,"GUANAJUATO","GARG881113FV7","GARG881113HGTRDL05","GUILLERMO GARCIA RODRIGUEZ","11DPT0007K",null,null,null,null,null,null,null,"X",null,null,null,null,null,null,null,1,0,0,7457.64]
[null,"GUANAJUATO","GOBA841110","GOBA841110MGTNNL06","ALMA CECILIA GONZALEZ BUENDIA","11DPT0007K",null,null,null,null,null,null,null,"X",null,null,null,null,null,null,null,1,0,0,4283.75]
[null,"GUANAJUATO","GOBD860212U8A","GOBD860212MGTNNL08","DELIA MELIZA GONZALEZ BUENDIA","11DPT0007K",null,null,null,null,null,null,null,"X",null,null,null,null,null,null,null,1,0,0,4997.5]
[null,"GUANAJUATO","GOME811008E64","GOME811008MGTMNL03","ELIZABETH GOMEZ MENDOZA","11DPT0007K",null,null,null,null,null,null,null,"X",null,null,null,null,null,null,null,1,0,0,6741.5]
[null,"GUANAJUATO","GOOC7007237B8","GOOC700123MGTMRR07","MA. DEL CARMEN GOMEZ OROPEZA","11DPT0007K",null,null,null,null,null,null,null,"X",null,null,null,null,null,null,null,1,0,0,10748.76]
[null,"GUANAJUATO","GOOE760928BN1","GOOE760928HGTMRN01","ENRIQUE ALEJANDRO GOMEZ OROPEZA","11DPT0007K",null,null,null,null,null,null,null,"X",null,null,null,null,null,null,null,1,0,0,12038.6]
[null,"GUANAJUATO","GOPS6802087F1","GOPS680208HGTNDN00","SANTIAGO GONZALEZ PADILLA","11DPT0007K",null,null,null,null,null,null,null,"X",null,null,null,null,null,null,null,1,0,0,15177.46]
[null,"GUANAJUATO","GUHG690324J87","GUHG690324HGTTRB00","GABRIEL GUTIERREZ HERNANDEZ","11DPT0007K",null,null,null,null,null,null,null,"X",null,null,null,null,null,null,null,1,0,0,3334.13]
[null,"GUANAJUATO","GUHM640516HF8","GUHM640516MGTTRR04","MARTHA GUTIERREZ HERNANDEZ","11DPT0007K",null,null,null,null,null,null,null,"X",null,null,null,null,null,null,null,1,0,0,10318.799999999999]
[null,"GUANAJUATO","GUHR661007QW0","GUHR661007MGTTRC18","ROCIO DEL ROSARIO GUTIERREZ HERNANDEZ","11DPT0007K",null,null,null,null,null,null,null,"X",null,null,null,null,null,null,null,1,0,0,46423.759999999995]
[null,"GUANAJUATO","GULM751128QC4","GULM751128HGTRNR07","MARIO DE JESUS GUERRERO LUNA","11DPT0007K",null,null,null,null,null,null,null,"X",null,null,null,null,null,null,null,1,0,0,4729.45]
[null,"GUANAJUATO","GUMR8110123U3","GUMR811012HCHZNM08","RAMIRO GUZMAN MONTES","11DPT0007K",null,null,null,null,null,null,null,"X",null,null,null,null,null,null,null,1,0,0,8281.65]
[null,"GUANAJUATO","GUVC900306TRT","GUVC900306HGTTNH09","CHRISTIAN JUAN DE DIOS GUTIERREZ VENEGAS","11DPT0007K",null,null,null,null,null,null,null,"X",null,null,null,null,null,null,null,1,0,0,3977.4]
[null,"GUANAJUATO","HEAM5406144E9","HEAM540614MDFRRR09","MARISELA HERRERA ARVIZU","11DPT0007K",null,null,null,null,null,null,null,"X",null,null,null,null,null,null,null,1,0,0,15653.399999999998]
[null,"GUANAJUATO","HUQL680518G68","HUQL680518HGTRNS08","LUIS GERARDO HURTADO QUINTANA","11DPT0007K",null,null,null,null,null,null,null,"X",null,null,null,null,null,null,null,1,0,0,7936.2199999999993]
[null,"GUANAJUATO","LAMV790816C4A","LAMV790816MGTRNN04","VANESSA GEOVANNA LARIOS MINJARES","11DPT0007K",null,null,null,null,null,null,null,"X",null,null,null,null,null,null,null,1,0,0,17137.550000000003]
[null,"GUANAJUATO","LELJ740926PK3","LELJ740926HJCNPN01","JUAN ANTONIO LEON LOPEZ","11DPT0007K",null,null,null,null,null,null,null,"X",null,null,null,null,null,null,null,1,0,0,11004.29]
[null,"GUANAJUATO","MAHE740312EP4","MAHE740312MJCLRR09","ERIKA GUADALUPE MALDONADO HERNANDEZ","11DPT0007K",null,null,null,null,null,null,null,"X",null,null,null,null,null,null,null,1,0,0,19920.479999999996]
[null,"GUANAJUATO","MAMD780104125","MAMD780104MGTTRL05","MARIA DOLORES MATA MARTINEZ","11DPT0007K",null,null,null,null,null,null,null,"X",null,null,null,null,null,null,null,1,0,0,4445.5]
[null,"GUANAJUATO","MAMX651202NJ5","MXME651202MGTTEV07","EVA MATA MARTINEZ","11DPT0007K",null,null,null,null,null,null,null,"X",null,null,null,null,null,null,null,1,0,0,14818.36]
[null,"GUANAJUATO","MEGL640103827","MEGL640103MGTLTT08","MA. LETICIA MELENDEZ GUTIERREZ","11DPT0007K",null,null,null,null,null,null,null,"X",null,null,null,null,null,null,null,1,0,0,7450]
[null,"GUANAJUATO","MESM670501FH5","MESM670501HDFNGR03","MARCO ALFREDO MENDOZA SEGURA","11DPT0007K",null,null,null,null,null,null,null,"X",null,null,null,null,null,null,null,1,0,0,6629]
[null,"GUANAJUATO","MEZJ750302AC9","MEZJ750302HGTNPR00","JORGE MENDOZA ZAPATA","11DPT0007K",null,null,null,null,null,null,null,"X",null,null,null,null,null,null,null,1,0,0,2149.75]
[null,"GUANAJUATO","MORB790906FV5","MORB790906MGTNSR05","BERTHA ALICIA MONJARAZ RIOS","11DPT0007K",null,null,null,null,null,null,null,"X",null,null,null,null,null,null,null,1,0,0,11113.79]
[null,"GUANAJUATO","MOVJ75111289A","MOVJ751112HJCRRR01","JORGE ARMANDO MORALES VARGAS","11DPT0007K",null,null,null,null,null,null,null,"X",null,null,null,null,null,null,null,1,0,0,2445.0300000000002]
[null,"GUANAJUATO","MOVM841118881","MOVM841118MGTNRR09","MARIELA MONTIEL  VERA","11DPT0007K",null,null,null,null,null,null,null,"X",null,null,null,null,null,null,null,1,0,0,2445.0300000000002]
[null,"GUANAJUATO","NAGM7308014C0","NAGM730801MGTJZR05"," MARCELA NAJERA GUZMAN ","11DPT0007K",null,null,null,null,null,null,null,"X",null,null,null,null,null,null,null,1,0,0,28815.999999999996]
[null,"GUANAJUATO","NAMK750429IB1","NAMK750429MGTTNR02","KARINA NATERA MONZON ","11DPT0007K",null,null,null,null,null,null,null,"X",null,null,null,null,null,null,null,1,0,0,3941.05]
[null,"GUANAJUATO","OEGR7911068I7","OEGR791106MGTRMS01"," ROSA MARIA ORNELAS  GOMEZ","11DPT0007K",null,null,null,null,null,null,null,"X",null,null,null,null,null,null,null,1,0,0,5186.3999999999996]
[null,"GUANAJUATO","OELL840306742","OELL840306MGTRNR06","LAURA DEL ROCIO ORNELAS LUNA","11DPT0007K",null,null,null,null,null,null,null,"X",null,null,null,null,null,null,null,1,0,0,5197.6000000000004]
[null,"GUANAJUATO","OIAE780131HL9","OIAE780131HGTNLD06","EDGAR JIONEL ONTIVEROS ALCALA","11DPT0007K",null,null,null,null,null,null,null,"X",null,null,null,null,null,null,null,1,0,0,9028.9500000000007]
[null,"GUANAJUATO","OIMD8504181Z5","OIMD850418MGTLRN00","DIANA OLIVA MORENO","11DPT0007K",null,null,null,null,null,null,null,"X",null,null,null,null,null,null,null,1,0,0,15889.810000000001]
[null,"GUANAJUATO","RALS8203241F7","RALS820324MGTMZL03","SILVIA AYDEE RAMIREZ LOZANO","11DPT0007K",null,null,null,null,null,null,null,"X",null,null,null,null,null,null,null,1,0,0,5112.33]
[null,"GUANAJUATO","RAMM8704167H6","RAMM870416MCMNRR00","MARGARITA ZARAHY RANGEL MARTINEZ","11DPT0007K",null,null,null,null,null,null,null,"X",null,null,null,null,null,null,null,1,0,0,2310.9]
[null,"GUANAJUATO","RAVM831112KP8","RAVM831112MGTMLN01","MONICA DE LA LUZ RAMIREZ VILLANUEVA","11DPT0007K",null,null,null,null,null,null,null,"X",null,null,null,null,null,null,null,1,0,0,5374.38]
[null,"GUANAJUATO","RELL7409136N7","RELL740913HGTYRS09","JOSE LUIS REYES LARA","11DPT0007K",null,null,null,null,null,null,null,"X",null,null,null,null,null,null,null,1,0,0,5006.96]
[null,"GUANAJUATO","RICE740107C14","RICE740107MGTVSR06","  ERIKA ADRIANA RIVERA CISNEROS   ","11DPT0007K",null,null,null,null,null,null,null,"X",null,null,null,null,null,null,null,1,0,0,12996.73]
[null,"GUANAJUATO","RICM7009187Q5","RICM700918HGTVSG07","MIGUEL ANGEL RIVERA CISNEROS","11DPT0007K",null,null,null,null,null,null,null,"X",null,null,null,null,null,null,null,1,0,0,11113.79]
[null,"GUANAJUATO","ROHO780227K98","ROXH780227MGTCXN02","HONORINA PAOLA * ROCHA","11DPT0007K",null,null,null,null,null,null,null,"X",null,null,null,null,null,null,null,1,0,0,3439.6]
[null,"GUANAJUATO","ROML710901QS2","ROML710901MGTDRT00","LETICIA RODRIGUEZ MORALES","11DPT0007K",null,null,null,null,null,null,null,"X",null,null,null,null,null,null,null,1,0,0,6932.7]
[null,"GUANAJUATO","ROOF850730521","ROOF850730HGTMLR06","FRANCISCO ROMERO OLMOS","11DPT0007K",null,null,null,null,null,null,null,"X",null,null,null,null,null,null,null,1,0,0,6536.41]
[null,"GUANAJUATO","ROOO570222BT6","ROOO570222HDFJRM05","OMAR   ROJAS OROZCO","11DPT0007K",null,null,null,null,null,null,null,"X",null,null,null,null,null,null,null,1,0,0,21497.52]
[null,"GUANAJUATO","RORL860709G29","RORL860709MGTDML06","LILIA BERENICE RODRIGUEZ RAMIREZ","11DPT0007K",null,null,null,null,null,null,null,"X",null,null,null,null,null,null,null,1,0,0,3255.65]
[null,"GUANAJUATO","ROZA8409121VA","ROZA840912MGTDXL02","ALMA ROSARIO RODRIGUEZ ZUÑIGA","11DPT0007K",null,null,null,null,null,null,null,"X",null,null,null,null,null,null,null,1,0,0,7336.15]
[null,"GUANAJUATO","RUBS800124TR0","RUBS800124HGTZRL06","SAUL RUIZ BERBENA","11DPT0007K",null,null,null,null,null,null,null,"X",null,null,null,null,null,null,null,1,0,0,18733.86]
[null,"GUANAJUATO","SAAM830517LU0","SAAM830517HDFNRG07","MIGUEL ANGEL SANCHEZ ARANDA","11DPT0007K",null,null,null,null,null,null,null,"X",null,null,null,null,null,null,null,1,0,0,4199.1499999999996]
[null,"GUANAJUATO","SOMJ5508087H2","SOMJ550808MGTTRN02","JUANA SOTO MORAN","11DPT0007K",null,null,null,null,null,null,null,"X",null,null,null,null,null,null,null,1,0,0,22539.75]
[null,"GUANAJUATO","TIEA7005021TA","TIEA700502MDFHSN02"," ANGELICA THIRION ESCUDER  ","11DPT0007K",null,null,null,null,null,null,null,"X",null,null,null,null,null,null,null,1,0,0,35842.1]
[null,"GUANAJUATO","UIRA650703JZ5","UIRA650703MDFRML07"," MARIA ALEJANDRA URIBE RAMIREZ  ","11DPT0007K",null,null,null,null,null,null,null,"X",null,null,null,null,null,null,null,1,0,0,4445.5]
[null,"GUANAJUATO","VAFE7901264H5","VAXF790126HNELXD12","FEDERICO DEL VAL ","11DPT0007K",null,null,null,null,null,null,null,"X",null,null,null,null,null,null,null,1,0,0,3779.25]
[null,"GUANAJUATO","VIBM7702283A2","VIBM770228HDFLRR01","MAURICIO VILCHIS BARCENAS ","11DPT0007K",null,null,null,null,null,null,null,"X",null,null,null,null,null,null,null,1,0,0,3334.13]
[null,"GUANAJUATO","(en blanco)","GAML640822MDFRNT04","MARIA LETICIA GARCIA MENDEZ","11DPT0007K",null,null,null,null,null,null,null,"X",null,null,null,null,null,null,null,1,0,0,6890.53]
[null,"GUANAJUATO","AETA681104M99","AETA681104MGTRPL00","ALEJANDRA ARREGUIN TAPIA","11DPT0008J",null,null,null,null,null,null,null,"X",null,null,null,null,null,null,null,1,0,0,5847.6]
[null,"GUANAJUATO","AUME740716A41","AUME740716HPLGDN13","ENRIQUE AGUILAR MEDRANO","11DPT0008J",null,null,null,null,null,null,null,"X",null,null,null,null,null,null,null,1,0,0,14625.36]
[null,"GUANAJUATO","BIEF750826Q65","BIEF750826HGTRSL05","FILIBERTO BRISEÑO ESPITIA","11DPT0008J",null,null,null,null,null,null,null,"X",null,null,null,null,null,null,null,1,0,0,4283.75]
[null,"GUANAJUATO","GACP660324G26","GACP660324HGTLPD03","PEDRO GALVEZ CAPORAL","11DPT0008J",null,null,null,null,null,null,null,"X",null,null,null,null,null,null,null,1,0,0,4143.13]
[null,"GUANAJUATO","GAFR660603435","GAFR660603MGTRRS00","ROSAICELA CRISTINA GARCIA FRIAS","11DPT0008J",null,null,null,null,null,null,null,"X",null,null,null,null,null,null,null,1,0,0,10318.799999999999]
[null,"GUANAJUATO","GOHM731017127","GOHM731017HGTMRG05","MIGUEL ANGEL GOMEZ HERNANDEZ","11DPT0008J",null,null,null,null,null,null,null,"X",null,null,null,null,null,null,null,1,0,0,5841.46]
[null,"GUANAJUATO","GOPA710319IB0","GOPA710319HGTNRD02","ADAN ALEJANDRO GONZALEZ PRESA","11DPT0008J",null,null,null,null,null,null,null,"X",null,null,null,null,null,null,null,1,0,0,3778.68]
[null,"GUANAJUATO","GOPR781214HT1","GOPR781214HGTNRD05","RODOLFO GONZALEZ PRESA","11DPT0008J",null,null,null,null,null,null,null,"X",null,null,null,null,null,null,null,1,0,0,10852.150000000001]
[null,"GUANAJUATO","GOVA7403201E8","GOVA740320HGTMLR06","JOSE ARMANDO GOMEZ VALENCIA","11DPT0008J",null,null,null,null,null,null,null,"X",null,null,null,null,null,null,null,1,0,0,13920.900000000001]
[null,"GUANAJUATO","HEEF6801012R8","HEEF680101HHGRSL09","FELIPE HERNANDEZ ESTRADA","11DPT0008J",null,null,null,null,null,null,null,"X",null,null,null,null,null,null,null,1,0,0,16123.14]
[null,"GUANAJUATO","HEFJ700120711","HEFG700120HGTRSD12","J. GUADALUPE HERNANDEZ FISCAL","11DPT0008J",null,null,null,null,null,null,null,"X",null,null,null,null,null,null,null,1,0,0,10748.76]
[null,"GUANAJUATO","HEMB820716LV7","HEMB820716MGTRDR06","BRENDA HERNANDEZ MEDINA","11DPT0008J",null,null,null,null,null,null,null,"X",null,null,null,null,null,null,null,1,0,0,4806.03]
[null,"GUANAJUATO","JULA7109296W5","JULA710929HGTRNL01","ALEJANDRO JUAREZ LEON","11DPT0008J",null,null,null,null,null,null,null,"X",null,null,null,null,null,null,null,1,0,0,11310.86]
[null,"GUANAJUATO","JULB700329347","JULB700329HGTRNN09","BENITO JUAREZ LEON","11DPT0008J",null,null,null,null,null,null,null,"X",null,null,null,null,null,null,null,1,0,0,7450]
[null,"GUANAJUATO","LOGS791206JH1","LOGS791206HGTPPR07","SERGIO LOPEZ GUAPO","11DPT0008J",null,null,null,null,null,null,null,"X",null,null,null,null,null,null,null,1,0,0,6629]
[null,"GUANAJUATO","LOVT730719N69","LOVT730719MGTPLR04","MARIA TERESITA LOPEZ VILLAGOMEZ","11DPT0008J",null,null,null,null,null,null,null,"X",null,null,null,null,null,null,null,1,0,0,36020.009999999995]
[null,"GUANAJUATO","LOVV821208K16","LOVV821208HGTPZC03","VICTOR HUGO LOPEZ VAZQUEZ","11DPT0008J",null,null,null,null,null,null,null,"X",null,null,null,null,null,null,null,1,0,0,13162.8]
[null,"GUANAJUATO","MACD620420JFA","MACD620420HGTRRV07","DAVID MARTINEZ CURTIDOR","11DPT0008J",null,null,null,null,null,null,null,"X",null,null,null,null,null,null,null,1,0,0,10748.76]
[null,"GUANAJUATO","MAMG691216UYA","MAMG691216HGTRRD04","JOSE GUADALUPE RAUL MARTINEZ MORENO","11DPT0008J",null,null,null,null,null,null,null,"X",null,null,null,null,null,null,null,1,0,0,6628.7]
[null,"GUANAJUATO","MOYS790226DL6","MOYS790226MGTNXC08","MARIA DEL SOCORRO MONTALVO YAÑEZ","11DPT0008J",null,null,null,null,null,null,null,"X",null,null,null,null,null,null,null,1,0,0,36020.009999999995]
[null,"GUANAJUATO","PAAJ6210093M0","PAAE621009HGTTCN04","J.ENCARNACION MOISES PATIÑO ACOSTA","11DPT0008J",null,null,null,null,null,null,null,"X",null,null,null,null,null,null,null,1,0,0,9436.2200000000012]
[null,"GUANAJUATO","QUMN8108073JA","QUMN810807MGTNRR05","NEIRA JENNIFER QUINTERO MORENO","11DPT0008J",null,null,null,null,null,null,null,"X",null,null,null,null,null,null,null,1,0,0,22539.75]
[null,"GUANAJUATO","RAFB620409PS9","RAFB620409MNLMNL08","BLANCA ESTHELA RAMOS FUENTES","11DPT0008J",null,null,null,null,null,null,null,"X",null,null,null,null,null,null,null,1,0,0,13696.739999999998]
[null,"GUANAJUATO","RIRJ8606049A1","RIRJ860604HGTSJN07","JUAN MANUEL RIOS ROJAS","11DPT0008J",null,null,null,null,null,null,null,"X",null,null,null,null,null,null,null,1,0,0,2485.88]
[null,"GUANAJUATO","ROGD8306177Y6","ROGD830617HGTDLG05","JOSE DIEGO RODRIGUEZ GALLEGOS","11DPT0008J",null,null,null,null,null,null,null,"X",null,null,null,null,null,null,null,1,0,0,7703]
[null,"GUANAJUATO","RONE740321QJ6","RONE740321MGTJTS01","MARIA ESTHER ROJAS NIETO","11DPT0008J",null,null,null,null,null,null,null,"X",null,null,null,null,null,null,null,1,0,0,16123.14]
[null,"GUANAJUATO","TOLJ711229Q89","TOLJ711229HGTRPV00","JAVIER TORRES LOPEZ","11DPT0008J",null,null,null,null,null,null,null,"X",null,null,null,null,null,null,null,1,0,0,18211.219999999998]
[null,"GUANAJUATO","VALS820325LX7","VALS820325MGTLNL09","SILVIA NANCY VALADEZ LEON","11DPT0008J",null,null,null,null,null,null,null,"X",null,null,null,null,null,null,null,1,0,0,22547.200000000004]
[null,"GUANAJUATO","VAME680312QT2","VAME680312MGTZLR00","ELISA VAZQUEZ MARTINEZ","11DPT0008J",null,null,null,null,null,null,null,"X",null,null,null,null,null,null,null,1,0,0,16957.849999999999]
[null,"GUANAJUATO","VEGR7209154U4","VEGR720915MDFNLC00","MARIA DEL ROCIO VENTURA GALLEGOS","11DPT0008J",null,null,null,null,null,null,null,"X",null,null,null,null,null,null,null,1,0,0,10802.5]
[null,"GUANAJUATO","AACN800319VC6","AACN800319MGTYRY15","NAYELI DE JESUS AYALA CARRERA","11DPT0009I",null,null,null,null,null,null,null,"X",null,null,null,null,null,null,null,1,0,0,20546.060000000005]
[null,"GUANAJUATO","AAVL730510P19","AAVL730510MGTYLR00","LAURA ELENA AYALA VALTIERRA","11DPT0009I",null,null,null,null,null,null,null,"X",null,null,null,null,null,null,null,1,0,0,3725]
[null,"GUANAJUATO","AOZL870509M00","AOZL870509MGTLRC04","LUCIA ALONSO ZARAGOZA","11DPT0009I",null,null,null,null,null,null,null,"X",null,null,null,null,null,null,null,1,0,0,4435.5]
[null,"GUANAJUATO","CACC741121MK3","CACC741121HGTSRR01","CARLOS ALBERTO CASTILLO CRUZ","11DPT0009I",null,null,null,null,null,null,null,"X",null,null,null,null,null,null,null,1,0,0,3081.2]
[null,"GUANAJUATO","CASM6003305D3","CASM600330HGTMTL02","MELCHOR CAMPOS SOTO","11DPT0009I",null,null,null,null,null,null,null,"X",null,null,null,null,null,null,null,1,0,0,4971.75]
[null,"GUANAJUATO","COGB581101LL6","COGB581101HGTRMN07","BENJAMIN CORONA GOMEZ","11DPT0009I",null,null,null,null,null,null,null,"X",null,null,null,null,null,null,null,1,0,0,2192.85]
[null,"GUANAJUATO","FEPD780323M00","FEPD780323MGTLRL01","DELIA FELIPE  PEREZ ","11DPT0009I",null,null,null,null,null,null,null,"X",null,null,null,null,null,null,null,1,0,0,7450]
[null,"GUANAJUATO","GOMO860112AC6","GOMO860112HDFNRM01","OMAR FRANCISCO GONZALEZ MARTINEZ","11DPT0009I",null,null,null,null,null,null,null,"X",null,null,null,null,null,null,null,1,0,0,11269.880000000001]
[null,"GUANAJUATO","IACC631023AI2","IACC631023HGTBNH06","CUAUHTEMOC IBARRA CANO","11DPT0009I",null,null,null,null,null,null,null,"X",null,null,null,null,null,null,null,1,0,0,14063.630000000001]
[null,"GUANAJUATO","LEHM650906984","LEHM650906HGTNRG07","MIGUEL ANGEL DE LEON HURTADO","11DPT0009I",null,null,null,null,null,null,null,"X",null,null,null,null,null,null,null,1,0,0,1259.75]
[null,"GUANAJUATO","MALS720215M37","MALS720215MGTRPR06","SARA MARTINEZ LOPEZ","11DPT0009I",null,null,null,null,null,null,null,"X",null,null,null,null,null,null,null,1,0,0,11682.9]
[null,"GUANAJUATO","MATG681016SW7","MATG681016HGTGFR08","GERARDO MAGAÑA TAFOYA","11DPT0009I",null,null,null,null,null,null,null,"X",null,null,null,null,null,null,null,1,0,0,11310.86]
[null,"GUANAJUATO","MEGM731204L93","MEGM731204MGTNZR02","MARISA MENDEZ GUZMAN","11DPT0009I",null,null,null,null,null,null,null,"X",null,null,null,null,null,null,null,1,0,0,10144.150000000001]
[null,"GUANAJUATO","MOCM7012151Q9","MOCM701215MGTRNN01","MANUELA MORALES CENDEJAS","11DPT0009I",null,null,null,null,null,null,null,"X",null,null,null,null,null,null,null,1,0,0,9485.9000000000015]
[null,"GUANAJUATO","PABG6901266Q2","PABG690126HGTZNR06","GERARDO PAZ BONILLA","11DPT0009I",null,null,null,null,null,null,null,"X",null,null,null,null,null,null,null,1,0,0,2485.88]
[null,"GUANAJUATO","PEFD7301136V8","PEFD730113HGTRLV06","DAVID PEREZ FELIPE","11DPT0009I",null,null,null,null,null,null,null,"X",null,null,null,null,null,null,null,1,0,0,12528.960000000001]
[null,"GUANAJUATO","PESA790927U25","PESA790927MGTRTN06","ANDREA MAGDALENA PEREZ SOTO","11DPT0009I",null,null,null,null,null,null,null,"X",null,null,null,null,null,null,null,1,0,0,20546.060000000005]
[null,"GUANAJUATO","RARM770914S13","RARM770914HGTNYR07","MAURICIO RANGEL REYES","11DPT0009I",null,null,null,null,null,null,null,"X",null,null,null,null,null,null,null,1,0,0,4971.76]
[null,"GUANAJUATO","RIRG760502K16","RIRG760502MGTVDW04","GWENDOLYNE ERENDIRA RIVAS RODRIGUEZ","11DPT0009I",null,null,null,null,null,null,null,"X",null,null,null,null,null,null,null,1,0,0,12006.650000000001]
[null,"GUANAJUATO","ROVA6201238U9","ROVA620123HGTDGL01","ALFONSO RODRIGUEZ VEGA","11DPT0009I",null,null,null,null,null,null,null,"X",null,null,null,null,null,null,null,1,0,0,4143.13]
[null,"GUANAJUATO","SAPR691204HS9","SAPR691204MGTNRS09","ROSA ELIA SANDOVAL PRADO","11DPT0009I",null,null,null,null,null,null,null,"X",null,null,null,null,null,null,null,1,0,0,7450]
[null,"GUANAJUATO","SATJ701026RC3","SATJ701026HGTNFS09","JOSE SANCHEZ TAFOYA","11DPT0009I",null,null,null,null,null,null,null,"X",null,null,null,null,null,null,null,1,0,0,6558.76]
[null,"GUANAJUATO","SOSP630208MC6","SOSP630208HGTTCD07","PEDRO SOTO SAUCEDO","11DPT0009I",null,null,null,null,null,null,null,"X",null,null,null,null,null,null,null,1,0,0,8842.7000000000007]
[null,"GUANAJUATO","TEAC711130CQ2","TEAC711130MGTJDL00","CLAUDIA ELENA TEJEDA ADAME","11DPT0009I",null,null,null,null,null,null,null,"X",null,null,null,null,null,null,null,1,0,0,2445.0300000000002]
[null,"GUANAJUATO","TEAR801024C6A","TEAR801024MGTJDS18","ROSA BEATRIZ TEJEDA ADAME","11DPT0009I",null,null,null,null,null,null,null,"X",null,null,null,null,null,null,null,1,0,0,2888.63]
[null,"GUANAJUATO","TOAA8408254S3","TOAA840825MGRRYD03","ADRIANA TORRES AYALA","11DPT0009I",null,null,null,null,null,null,null,"X",null,null,null,null,null,null,null,1,0,0,9943.52]
[null,"GUANAJUATO","TOAB770225NZ9","TOAB770225MGTRRR00","BERENICE TORRES ARROYO","11DPT0009I",null,null,null,null,null,null,null,"X",null,null,null,null,null,null,null,1,0,0,14625.36]
[null,"GUANAJUATO","VAEM800823M00","VAEM800823MGTZLR07","MARIA MARISELA VAZQUEZ  ELIZARRARAS ","11DPT0009I",null,null,null,null,null,null,null,"X",null,null,null,null,null,null,null,1,0,0,1259.75]
[null,"GUANAJUATO","VAMB781025M00","VAMB781025MGTZRT08","BEATRIZ VAZQUEZ  MARTINEZ ","11DPT0009I",null,null,null,null,null,null,null,"X",null,null,null,null,null,null,null,1,0,0,1259.75]
[null,"GUANAJUATO","AAFO86011729A","AAFO860117MGTRRL08","OLGA ELIZABETH ARAUJO FERNANDEZ","11DPT0010Y",null,null,null,null,null,null,null,"X",null,null,null,null,null,null,null,1,0,0,12441.91]
[null,"GUANAJUATO","AOOV770724DZ8","AOOV770724MGTRRR09","VERONICA ARZOLA ORTEGA","11DPT0010Y",null,null,null,null,null,null,null,"X",null,null,null,null,null,null,null,1,0,0,4308.8500000000004]
[null,"GUANAJUATO","AUCR760401U5A","AUCR760401HGTGRC06","RICARDO AGUILAR CORONA","11DPT0010Y",null,null,null,null,null,null,null,"X",null,null,null,null,null,null,null,1,0,0,2973.6000000000004]
[null,"GUANAJUATO","AURJ751104NX7","AURJ751104HGTGDN09","JUAN CARLOS  AGUIRRE RODRÌGUEZ","11DPT0010Y",null,null,null,null,null,null,null,"X",null,null,null,null,null,null,null,1,0,0,2980]
[null,"GUANAJUATO","BAVB810501LRA","BAVB810501MGTRLL01","BLANCA ELIZABETH BARAJAS VALLEJO","11DPT0010Y",null,null,null,null,null,null,null,"X",null,null,null,null,null,null,null,1,0,0,9943.5]
[null,"GUANAJUATO","CACX831109CP9","CXCA831109MGTMHM07","AMERICA CAMPOS CHAGOYA","11DPT0010Y",null,null,null,null,null,null,null,"X",null,null,null,null,null,null,null,1,0,0,11440.66]
[null,"GUANAJUATO","CAGG7503244Z4","CAGG750324MGTBTB00","GABRIELA DEL CARMEN CABRERA GUTIÉRREZ","11DPT0010Y",null,null,null,null,null,null,null,"X",null,null,null,null,null,null,null,1,0,0,11364.75]
[null,"GUANAJUATO","CALA6404086Z8","CALA640408HGTDXL04","ALBERTO CAUDILLO LIÑÁN","11DPT0010Y",null,null,null,null,null,null,null,"X",null,null,null,null,null,null,null,1,0,0,15162.190000000002]
[null,"GUANAJUATO","DIRS7905261S6","DIRS790526MJCZVR00","SAIRA  ESTHER DIAZ RIVERA","11DPT0010Y",null,null,null,null,null,null,null,"X",null,null,null,null,null,null,null,1,0,0,7752.73]
[null,"GUANAJUATO","EIDJ571003UH1","EIDC571003HGTSMS06","JOSÉ COSME ESPINOZA DOMÍNGUEZ","11DPT0010Y",null,null,null,null,null,null,null,"X",null,null,null,null,null,null,null,1,0,0,4371]
[null,"GUANAJUATO","FIOM790619I13","FIOM790619HDFLRH07","MAHY ROLANDO FILOMENO ORTIZ","11DPT0010Y",null,null,null,null,null,null,null,"X",null,null,null,null,null,null,null,1,0,0,24350]
[null,"GUANAJUATO","GAGA790221226","GAGA790221HGTSRR01","ARMANDO GASCA GUERRA","11DPT0010Y",null,null,null,null,null,null,null,"X",null,null,null,null,null,null,null,1,0,0,5606.64]
[null,"GUANAJUATO","GAME651110B38","GAME651110HDFRRD00","EDUARDO GARCÍA MORALES","11DPT0010Y",null,null,null,null,null,null,null,"X",null,null,null,null,null,null,null,1,0,0,9943.5]
[null,"GUANAJUATO","GOAA670428AHA","GOAA670428MGTNLR05","ARACELI GONZÁLEZ ÁLVAREZ","11DPT0010Y",null,null,null,null,null,null,null,"X",null,null,null,null,null,null,null,1,0,0,4971.76]
[null,"GUANAJUATO","GOHV780329HP0","GOHV780329MGTNRR00","VERÓNICA GONZÁLEZ HERNÁNDEZ","11DPT0010Y",null,null,null,null,null,null,null,"X",null,null,null,null,null,null,null,1,0,0,2310.9]
[null,"GUANAJUATO","HEDT700419HG2","HEDT700419HGTRRR01","JOSÉ TERESO HERNÁNDEZ DURÁN","11DPT0010Y",null,null,null,null,null,null,null,"X",null,null,null,null,null,null,null,1,0,0,3352.5]
[null,"GUANAJUATO","HERE800329V17","HERE800329HGTRDD03","EDGAR IVÁN HERNÁNDEZ RODRÍGUEZ","11DPT0010Y",null,null,null,null,null,null,null,"X",null,null,null,null,null,null,null,1,0,0,8195]
[null,"GUANAJUATO","HIBA631027337","HIBA631027HGTNLN08","ANTONIO HINOJOSA BALANDRÁN","11DPT0010Y",null,null,null,null,null,null,null,"X",null,null,null,null,null,null,null,1,0,0,4621.8]
[null,"GUANAJUATO","LORC760609NB1","LORC760609MDFPVL08","CLAUDETTE LÓPEZ DE LA RIVA","11DPT0010Y",null,null,null,null,null,null,null,"X",null,null,null,null,null,null,null,1,0,0,4442.5]
[null,"GUANAJUATO","LOVJ660127MI1","LOVJ660127HGTPLN03","JUAN LÓPEZ VALENCIA","11DPT0010Y",null,null,null,null,null,null,null,"X",null,null,null,null,null,null,null,1,0,0,24345.999999999996]
[null,"GUANAJUATO","MAVR720809AXA","MAVR720809MGTNZS05","ROSA BEATRIZ MANJARREZ VAZQUEZ","11DPT0010Y",null,null,null,null,null,null,null,"X",null,null,null,null,null,null,null,1,0,0,16123.14]
[null,"GUANAJUATO","MAZA690627N73","MAZA690627MGTTMN03","ANA ROSA MATA ZAMORA","11DPT0010Y",null,null,null,null,null,null,null,"X",null,null,null,null,null,null,null,1,0,0,8088.16]
[null,"GUANAJUATO","MEMV791203112","MEVM791203HGTDZR15","MARIO MEDINA VÁZQUEZ","11DPT0010Y",null,null,null,null,null,null,null,"X",null,null,null,null,null,null,null,1,0,0,14063.630000000001]
[null,"GUANAJUATO","MORA600920UJ0","MORA600920MGTSVN08","MARÍA DE LOS ÁNGELES MOSQUEDA RUVALCABA","11DPT0010Y",null,null,null,null,null,null,null,"X",null,null,null,null,null,null,null,1,0,0,25797]
[null,"GUANAJUATO","MORR630513CT2","MORR630513HGTSVD06","RODOLFO MOSQUEDA RUVALCABA","11DPT0010Y",null,null,null,null,null,null,null,"X",null,null,null,null,null,null,null,1,0,0,11106.3]
[null,"GUANAJUATO","NIGC7311229F4","NIGC731122HGTLSC01","CECILIO NILA GASCA","11DPT0010Y",null,null,null,null,null,null,null,"X",null,null,null,null,null,null,null,1,0,0,10318.799999999999]
[null,"GUANAJUATO","PATD7212262V2","PATD721226MGTCRL02","DULCE CONCEPCIÓN PACHECO TORRES","11DPT0010Y",null,null,null,null,null,null,null,"X",null,null,null,null,null,null,null,1,0,0,32570.060000000005]
[null,"GUANAJUATO","PEGO840715TW6","PEGO840715MGTRRL04","OLGA CRISTINA  PEREZ GUERRERO","11DPT0010Y",null,null,null,null,null,null,null,"X",null,null,null,null,null,null,null,1,0,0,11682.9]
[null,"GUANAJUATO","PESJ720529I40","PESJ720529HGTRNN06","JUAN JOSÉ PÉREZ SANTIAGO","11DPT0010Y",null,null,null,null,null,null,null,"X",null,null,null,null,null,null,null,1,0,0,14330.93]
[null,"GUANAJUATO","QUOG780110GB9","QUOG780110HGTNRN00","GONZALO  QUINTANA  ORTEGA ","11DPT0010Y",null,null,null,null,null,null,null,"X",null,null,null,null,null,null,null,1,0,0,19128.899999999998]
[null,"GUANAJUATO","RACM561219L8A","RACM561219HGTMNR07","MARIO RAMÍREZ CONTRERAS","11DPT0010Y",null,null,null,null,null,null,null,"X",null,null,null,null,null,null,null,1,0,0,12006.650000000001]
[null,"GUANAJUATO","RAPB721103D6A","RAPB721103MMNMZT09","BEATRIZ EUGENIA RAMOS PAZ","11DPT0010Y",null,null,null,null,null,null,null,"X",null,null,null,null,null,null,null,1,0,0,3331.88]
[null,"GUANAJUATO","REBJ861120CG2","REBJ861120HGTYNN00","JUAN CARLOS REYNOSO BANDERAS","11DPT0010Y",null,null,null,null,null,null,null,"X",null,null,null,null,null,null,null,1,0,0,15363.619999999999]
[null,"GUANAJUATO","RICA770621C14","RICA770621HDFCRL02","ALEJANDRO RICO CARMONA","11DPT0010Y",null,null,null,null,null,null,null,"X",null,null,null,null,null,null,null,1,0,0,11106.3]
[null,"GUANAJUATO","ROBJ680311LG6","ROBJ680311HGTCDR06","JORGE VICENTE ROCHA BEDIA","11DPT0010Y",null,null,null,null,null,null,null,"X",null,null,null,null,null,null,null,1,0,0,3411.1]
[null,"GUANAJUATO","ROFA780327DH3","ROFA780327HGTDLL03","JOSE ALVARO RODRIGUEZ FLORES","11DPT0010Y",null,null,null,null,null,null,null,"X",null,null,null,null,null,null,null,1,0,0,1889.63]
[null,"GUANAJUATO","ROGA700124964","ROGA700124MGTCZN09","ANA ELENA ROCHA GUZMÁN","11DPT0010Y",null,null,null,null,null,null,null,"X",null,null,null,null,null,null,null,1,0,0,9041.2000000000007]
[null,"GUANAJUATO","ROHA790902MQ8","ROHA790902HGTDRL09","ALEJANDRO RODRIGUEZ HERNANDEZ","11DPT0010Y",null,null,null,null,null,null,null,"X",null,null,null,null,null,null,null,1,0,0,6802.6500000000005]
[null,"GUANAJUATO","ROMO790623E30","ROMO790623HGTSRL08","OLIMPO ROSILLO MORENO","11DPT0010Y",null,null,null,null,null,null,null,"X",null,null,null,null,null,null,null,1,0,0,7450]
[null,"GUANAJUATO","ROMR620310CS2","ROMR620310MDFMNC01","ROCÍO ROMERO MENA","11DPT0010Y",null,null,null,null,null,null,null,"X",null,null,null,null,null,null,null,1,0,0,4442.5]
[null,"GUANAJUATO","SAMD841004000","SAMD841004MGTNLN03","DINORHA GEORGINA SANTIAGO MELCHOR","11DPT0010Y",null,null,null,null,null,null,null,"X",null,null,null,null,null,null,null,1,0,0,1988.7]
[null,"GUANAJUATO","SOGC7802151Z2","SOGC780215MDFLRL01","CLAUDIA SOLACHE GARCÍA","11DPT0010Y",null,null,null,null,null,null,null,"X",null,null,null,null,null,null,null,1,0,0,8986.86]
[null,"GUANAJUATO","TEAA800207442","TEAA800207MGTRGL00","ALEJANDRA ISABEL TREJO AGUILAR","11DPT0010Y",null,null,null,null,null,null,null,"X",null,null,null,null,null,null,null,1,0,0,2485.88]
[null,"GUANAJUATO","VELL651008V35","VELL651008MDFLGR02","MARÍA DE LOURDES JUANA VELÁZQUEZ LUGO","11DPT0010Y",null,null,null,null,null,null,null,"X",null,null,null,null,null,null,null,1,0,0,2364.73]
[null,"GUANAJUATO","VESX850703GKA","VESX850703MGTLLC16","XOCHITL TOMASA VELÁZQUEZ SILVA","11DPT0010Y",null,null,null,null,null,null,null,"X",null,null,null,null,null,null,null,1,0,0,4112.3999999999996]
[null,"GUANAJUATO","VIMU840526EL5","VIMU840526HDFLRR00","URIEL ALEJANDRO VILLÁGOMEZ MARTÍNEZ","11DPT0010Y",null,null,null,null,null,null,null,"X",null,null,null,null,null,null,null,1,0,0,9470.630000000001]
[null,"GUANAJUATO","AALJ750316LPA","AALJ750316HGTYLS05","JOSE  AYALA  LULE ","11DPT0011X",null,null,null,null,null,null,null,"X",null,null,null,null,null,null,null,1,0,0,4435.5]
[null,"GUANAJUATO","AAME860903","AAME860903HMNLDD08","EDGAR ALAN ALFARO MEDINA","11DPT0011X",null,null,null,null,null,null,null,"X",null,null,null,null,null,null,null,1,0,0,14443.14]
[null,"GUANAJUATO","AOGE690325D41","AOGE690325HGTBZM07","EMILIO ABONCE GUZMAN","11DPT0011X",null,null,null,null,null,null,null,"X",null,null,null,null,null,null,null,1,0,0,5682.38]
[null,"GUANAJUATO","AUGJ780722V55","AUGJ780722HGTGMN00","JUAN SIMON  AGUILAR  GOMEZ ","11DPT0011X",null,null,null,null,null,null,null,"X",null,null,null,null,null,null,null,1,0,0,5084.7599999999993]
[null,"GUANAJUATO","CABG7405015A5","CABG740501MGTSRB06","GABRIELA  CASTRO  BARBOSA ","11DPT0011X",null,null,null,null,null,null,null,"X",null,null,null,null,null,null,null,1,0,0,4445.5]
[null,"GUANAJUATO","CAER830626JA4","CAER830626MGTRSY00","REYNA LILIANA  CARDOSO  ESCUTIA ","11DPT0011X",null,null,null,null,null,null,null,"X",null,null,null,null,null,null,null,1,0,0,5028.75]
[null,"GUANAJUATO","CARH670101MS3","CARH670101HGTRZC08","HECTOR  CARDENAS  RUIZ ","11DPT0011X",null,null,null,null,null,null,null,"X",null,null,null,null,null,null,null,1,0,0,3466.35]
[null,"GUANAJUATO","CILH750107147","CILH750107MGTSPL00","HILDA LUCIA  CISNEROS  LOPEZ ","11DPT0011X",null,null,null,null,null,null,null,"X",null,null,null,null,null,null,null,1,0,0,13758.4]
[null,"GUANAJUATO","DICJ590119T4A","DICJ590119HGTZCS01","JOSE  DIAZ  COCILION ","11DPT0011X",null,null,null,null,null,null,null,"X",null,null,null,null,null,null,null,1,0,0,3594.7599999999993]
[null,"GUANAJUATO","EAMA860511UL8","EAMA860511MMNSRN08","ANA LUCIA ESCALANTE MARIN","11DPT0011X",null,null,null,null,null,null,null,"X",null,null,null,null,null,null,null,1,0,0,20546.060000000005]
[null,"GUANAJUATO","FAMD850123CZ0","FAMD850123HGTLNN04","DANIEL  FALCON  MONROY ","11DPT0011X",null,null,null,null,null,null,null,"X",null,null,null,null,null,null,null,1,0,0,17813.93]
[null,"GUANAJUATO","GAAM880803SI2","GAAM880803MGTNLR00","MARIANA GANTES ALCANTAR","11DPT0011X",null,null,null,null,null,null,null,"X",null,null,null,null,null,null,null,1,0,0,2485.88]
[null,"GUANAJUATO","GAFM620222JY6","GAFM620222HGTRLN19","JOSE MANUEL  GARCIA  FLORES ","11DPT0011X",null,null,null,null,null,null,null,"X",null,null,null,null,null,null,null,1,0,0,4445.5]
[null,"GUANAJUATO","GALL871108","GALL871108MGTRPL08","LILIANA GARCIA LOPEZ","11DPT0011X",null,null,null,null,null,null,null,"X",null,null,null,null,null,null,null,1,0,0,3725]
[null,"GUANAJUATO","GAMB800204HK9","GAMB800204MGTRRR01","BERENICE ELENA MARIA GARCIA MARQUEZ","11DPT0011X",null,null,null,null,null,null,null,"X",null,null,null,null,null,null,null,1,0,0,11113.79]
[null,"GUANAJUATO","GARR8203151UA","GARR820315HHGRBY08","REYMUNDO GARCIA ROBLES","11DPT0011X",null,null,null,null,null,null,null,"X",null,null,null,null,null,null,null,1,0,0,5006.96]
[null,"GUANAJUATO","GOVE850725","GOVE850725HTSMLD03","EDUARDO GOMEZ VILLAGOMEZ","11DPT0011X",null,null,null,null,null,null,null,"X",null,null,null,null,null,null,null,1,0,0,3788.25]
[null,"GUANAJUATO","GUCT560830E19","GUCT560830MGTRSR17","MA TERESA GUERRERO CASTRO","11DPT0011X",null,null,null,null,null,null,null,"X",null,null,null,null,null,null,null,1,0,0,9458.9]
[null,"GUANAJUATO","HECM670422CC4","HECM670422MDFRBR02","MARIA MARCELA  HERRERA  CEBALLOS ","11DPT0011X",null,null,null,null,null,null,null,"X",null,null,null,null,null,null,null,1,0,0,4445.5]
[null,"GUANAJUATO","HEJJ860302000","HEJJ860302HGTRMN01","JUAN CARLOS  HERNANDEZ  JIMENEZ ","11DPT0011X",null,null,null,null,null,null,null,"X",null,null,null,null,null,null,null,1,0,0,5777.25]
[null,"GUANAJUATO","LIRK810903L47","LIRK810903MCHNLR02","KARLA ROCIO LINO DEL REAL","11DPT0011X",null,null,null,null,null,null,null,"X",null,null,null,null,null,null,null,1,0,0,5777.25]
[null,"GUANAJUATO","LUCF7002115Q9","LUCF700211HGTLND05","FIDEL  LULE  CONTRERAS ","11DPT0011X",null,null,null,null,null,null,null,"X",null,null,null,null,null,null,null,1,0,0,6493.0499999999993]
[null,"GUANAJUATO","LUML8603214V6","LUML860321MGTNDN02","LINA LUNA MEDINA","11DPT0011X",null,null,null,null,null,null,null,"X",null,null,null,null,null,null,null,1,0,0,7425.1500000000005]
[null,"GUANAJUATO","MABR8302104V5","MABR830210HGTRRB02","ROBERTO  MARTINEZ  BARRERA ","11DPT0011X",null,null,null,null,null,null,null,"X",null,null,null,null,null,null,null,1,0,0,2485.88]
[null,"GUANAJUATO","MAHA821225TQ5","MAHA821225MGTRRL02","ALEJANDRA  MARTINEZ  HERNANDEZ ","11DPT0011X",null,null,null,null,null,null,null,"X",null,null,null,null,null,null,null,1,0,0,14063.630000000001]
[null,"GUANAJUATO","MAPJ880510","MAPJ880510MGTRXS01","MARIA DE JESUS MARTINEZ PEÑA","11DPT0011X",null,null,null,null,null,null,null,"X",null,null,null,null,null,null,null,1,0,0,9995]
[null,"GUANAJUATO","MAST560810KJ7","MAST560810HGTRNR00","J. TRINIDAD  MARTINEZ  SANCHEZ ","11DPT0011X",null,null,null,null,null,null,null,"X",null,null,null,null,null,null,null,1,0,0,2485.88]
[null,"GUANAJUATO","MERA6410168B4","MERA641016HGTDZL14","ALEJANDRO MEDINA REZA","11DPT0011X",null,null,null,null,null,null,null,"X",null,null,null,null,null,null,null,1,0,0,7779.66]
[null,"GUANAJUATO","MUAO8512081H3","MUAO851208HGTXCS06","OSCAR  MUÑOZ ACEVEDO ","11DPT0011X",null,null,null,null,null,null,null,"X",null,null,null,null,null,null,null,1,0,0,3466.35]
[null,"GUANAJUATO","NACJ810605U92","NACJ810605HGTRRR09","JORGE ALBERTO NARVAEZ CARDOSO","11DPT0011X",null,null,null,null,null,null,null,"X",null,null,null,null,null,null,null,1,0,0,13336.5]
[null,"GUANAJUATO","PACM790918HT8","PACM790918HGTNRR13","MAURICIO  PANIAGUA  CARRILLO ","11DPT0011X",null,null,null,null,null,null,null,"X",null,null,null,null,null,null,null,1,0,0,14338.420000000002]
[null,"GUANAJUATO","PACM9001045J2","PACM900104MGTNRR08","MIRIAM EDITH PANIAGUA CARRILLO","11DPT0011X",null,null,null,null,null,null,null,"X",null,null,null,null,null,null,null,1,0,0,7639.75]
[null,"GUANAJUATO","PEHS851206000","PEHS851206HGTXRL09","JOSE SALUD PEÑA HERNANDEZ","11DPT0011X",null,null,null,null,null,null,null,"X",null,null,null,null,null,null,null,1,0,0,14063.630000000001]
[null,"GUANAJUATO","RAGE851021JI8","RAGE851021MGTYML08","ELVIA SUSANA RAYA GOMEZ","11DPT0011X",null,null,null,null,null,null,null,"X",null,null,null,null,null,null,null,1,0,0,14625.36]
[null,"GUANAJUATO","RAGF920620","RAGF920620MGTYRR08","MARIA FERNANDA RAYA GUERRERO","11DPT0011X",null,null,null,null,null,null,null,"X",null,null,null,null,null,null,null,1,0,0,3314.5]
[null,"GUANAJUATO","RIOL830629124","RIOL830629MGTVJZ05","MARIA DE LA LUZ RIVERA OJEDA","11DPT0011X",null,null,null,null,null,null,null,"X",null,null,null,null,null,null,null,1,0,0,4236.66]
[null,"GUANAJUATO","RISA740722842","RISA740722MGTCNL08","ALEJANDRA  RICALDE  SANCHEZ ","11DPT0011X",null,null,null,null,null,null,null,"X",null,null,null,null,null,null,null,1,0,0,3725]
[null,"GUANAJUATO","SACF740918BK7","SACF740918HJCNML11","FELIX SANCHEZ CAMPOS","11DPT0011X",null,null,null,null,null,null,null,"X",null,null,null,null,null,null,null,1,0,0,1259.75]
[null,"GUANAJUATO","SACM860807000","SACM860807HGTMMN00","JOSE MANUEL  SAMANO  CAMARGO ","11DPT0011X",null,null,null,null,null,null,null,"X",null,null,null,null,null,null,null,1,0,0,3725]
[null,"GUANAJUATO","SAOF7912075J9","SAOF791207HGTLRR02","FRANCISCO JAVIER  SALGADO ORTIZ","11DPT0011X",null,null,null,null,null,null,null,"X",null,null,null,null,null,null,null,1,0,0,8599]
[null,"GUANAJUATO","SAPG631009QMA","SAPG631009MGTNRD02","MA GUADALUPE  SANCHEZ  PARRA ","11DPT0011X",null,null,null,null,null,null,null,"X",null,null,null,null,null,null,null,1,0,0,9943.52]
[null,"GUANAJUATO","SIPH640527P81","SIPH640527HGTRRG09","HUGO EVERARDO  SIERRA  PARADA ","11DPT0011X",null,null,null,null,null,null,null,"X",null,null,null,null,null,null,null,1,0,0,9619.5]
[null,"GUANAJUATO","TOCR790420PZ9","TOCR790420HGTRRB01","RUBEN  TORRES  CARMONA ","11DPT0011X",null,null,null,null,null,null,null,"X",null,null,null,null,null,null,null,1,0,0,11310.86]
[null,"GUANAJUATO","ZAMJ740416EMO","ZAMJ740416HDFMXR00","JORGE ZAMORA MUÑIZ","11DPT0011X",null,null,null,null,null,null,null,"X",null,null,null,null,null,null,null,1,0,0,8088.16]
[null,"GUANAJUATO","AARO850826GKA","AARO850826HGTMVR08","ORLANDO AMAYA RIVERA","11DPT0012W",null,null,null,null,null,null,null,"X",null,null,null,null,null,null,null,1,0,0,11364.75]
[null,"GUANAJUATO","AEDI770518OLA","AEDI770518HGTRRS01","ISRAEL ARMANDO ARREDONDO  DORANTES","11DPT0012W",null,null,null,null,null,null,null,"X",null,null,null,null,null,null,null,1,0,0,7392.5]
[null,"GUANAJUATO","AEPI820115AQ1","AEPI820115MDFRLS04","ISABEL ARREDONDO PLATA","11DPT0012W",null,null,null,null,null,null,null,"X",null,null,null,null,null,null,null,1,0,0,1713.5]
[null,"GUANAJUATO","AUMA910826000","AUMA910826MGTGXL03","ALEJANDRA AGUILLON MUÑOZ","11DPT0012W",null,null,null,null,null,null,null,"X",null,null,null,null,null,null,null,1,0,0,4435.5]
[null,"GUANAJUATO","AUMJ800706AM9","AUMJ800706HMCGRL14","JOEL AGUILLON MORALES","11DPT0012W",null,null,null,null,null,null,null,"X",null,null,null,null,null,null,null,1,0,0,37299.410000000003]
[null,"GUANAJUATO","BAAJ771007440","BAAJ771007HGTSLV00","JAVIER BASALDUA ALVAREZ","11DPT0012W",null,null,null,null,null,null,null,"X",null,null,null,null,null,null,null,1,0,0,46295.389999999992]
[null,"GUANAJUATO","BAMV8801104X4","BAMV880110MGTRNR09","VERONICA GUADALUPE BRAVO MONTES","11DPT0012W",null,null,null,null,null,null,null,"X",null,null,null,null,null,null,null,1,0,0,3370.75]
[null,"GUANAJUATO","BASC910503127","BASC910503MGTZNR03","MARIA CRUZ BAEZA SANCHEZ","11DPT0012W",null,null,null,null,null,null,null,"X",null,null,null,null,null,null,null,1,0,0,6091.26]
[null,"GUANAJUATO","CACV851205PW0","CACV851205MQTRRR00","VERA CABELLO  CORONA","11DPT0012W",null,null,null,null,null,null,null,"X",null,null,null,null,null,null,null,1,0,0,16952.25]
[null,"GUANAJUATO","CASL890905LA5","CASL890905HDFBRS01","LUIS EDGAR CABEZA SUAREZ","11DPT0012W",null,null,null,null,null,null,null,"X",null,null,null,null,null,null,null,1,0,0,2980]
[null,"GUANAJUATO","EIHA7010296Z8","EIHA701029HGTSRL01","ALEJANDRO ESPINOSA HERNANDEZ","11DPT0012W",null,null,null,null,null,null,null,"X",null,null,null,null,null,null,null,1,0,0,7513.25]
[null,"GUANAJUATO","GACI810611U19","GACI810611HGTRRS03","JOSE ISRAEL GARCIA CORONA","11DPT0012W",null,null,null,null,null,null,null,"X",null,null,null,null,null,null,null,1,0,0,5997]
[null,"GUANAJUATO","GARB840625CP8","GARB840625MQTLDR08","BRENDA LIDIA GALLEGOS RODRIGUEZ","11DPT0012W",null,null,null,null,null,null,null,"X",null,null,null,null,null,null,null,1,0,0,4806.03]
[null,"GUANAJUATO","GOHS8907177Z1","GOHS890717MQTMRN05","SANDRA IRAIS GOMEZ HERNANDEZ","11DPT0012W",null,null,null,null,null,null,null,"X",null,null,null,null,null,null,null,1,0,0,11088.75]
[null,"GUANAJUATO","GORC720101Q12","GORC720101MMNNBR04","CRISTINA GONZALEZ ROBLES","11DPT0012W",null,null,null,null,null,null,null,"X",null,null,null,null,null,null,null,1,0,0,3411.1]
[null,"GUANAJUATO","GOZV911104PZ4","GOZV911104HGTNMC06","VICTOR HUGO GONZALEZ ZAMUDIO","11DPT0012W",null,null,null,null,null,null,null,"X",null,null,null,null,null,null,null,1,0,0,4199.1499999999996]
[null,"GUANAJUATO","GUSA851101LLA","GUSA851101MGTLTN00","MARIA DE LOS ANGELES GUALITO SOTO","11DPT0012W",null,null,null,null,null,null,null,"X",null,null,null,null,null,null,null,1,0,0,3081.2]
[null,"GUANAJUATO","HEMJ750321M79","HEMJ750321HPLRRV10","JAVIER HERRERA MARTINEZ","11DPT0012W",null,null,null,null,null,null,null,"X",null,null,null,null,null,null,null,1,0,0,2680.16]
[null,"GUANAJUATO","LOHF8609268M2","LOHF860926MGTPRR03","MARIA FERNANDA LOPEZ HERNANDEZ","11DPT0012W",null,null,null,null,null,null,null,"X",null,null,null,null,null,null,null,1,0,0,3779.25]
[null,"GUANAJUATO","LOVE8010111T5","LOVE801011HDFPZD02","EDGAR LOPEZ VAZQUEZ","11DPT0012W",null,null,null,null,null,null,null,"X",null,null,null,null,null,null,null,1,0,0,2980]
[null,"GUANAJUATO","LOZE710604574","LOZE710604MGTZRG00","MA. EUGENIA LOZADA ZARAZUA ","11DPT0012W",null,null,null,null,null,null,null,"X",null,null,null,null,null,null,null,1,0,0,1925.75]
[null,"GUANAJUATO","MASA840303K12","MASA840303MDFRNN08","MARIA DE LOS ANGELES MARTINEZ SANCHEZ","11DPT0012W",null,null,null,null,null,null,null,"X",null,null,null,null,null,null,null,1,0,0,9943.5]
[null,"GUANAJUATO","MEGR720113GQ8","MEGR720113HMNRNM02","RAMIRO MERCADO  GONZALEZ","11DPT0012W",null,null,null,null,null,null,null,"X",null,null,null,null,null,null,null,1,0,0,8986.8000000000011]
[null,"GUANAJUATO","MESL721106M79","MESL721106HMCNNC01","LUCIANO MENDOZA SANCHEZ","11DPT0012W",null,null,null,null,null,null,null,"X",null,null,null,null,null,null,null,1,0,0,4283.75]
[null,"GUANAJUATO","MOHS911002127","MOHS911002HMCNRR00","SERGIO MONTES DE OCA HURTADO","11DPT0012W",null,null,null,null,null,null,null,"X",null,null,null,null,null,null,null,1,0,0,4199.1499999999996]
[null,"GUANAJUATO","NOIG870606719","NOIG870606HMCGNS09","GUSTAVO NOGUEZ INIESTA","11DPT0012W",null,null,null,null,null,null,null,"X",null,null,null,null,null,null,null,1,0,0,1713.5]
[null,"GUANAJUATO","OIMG610814NA3","OIMG610814MGTRLD00","MA. GUADALUPE ORTIZ MELENDEZ","11DPT0012W",null,null,null,null,null,null,null,"X",null,null,null,null,null,null,null,1,0,0,29089.160000000003]
[null,"GUANAJUATO","PABJ671110D69","PABJ671110HJCLRS08","JOSE DE JESUS PLASCENCIA BARAJAS","11DPT0012W",null,null,null,null,null,null,null,"X",null,null,null,null,null,null,null,1,0,0,7779.66]
[null,"GUANAJUATO","PARB8612287J6","PARB861228MGTCDR09","BARBARA PALOMA PACHECO  RODRIGUEZ","11DPT0012W",null,null,null,null,null,null,null,"X",null,null,null,null,null,null,null,1,0,0,18183.599999999999]
[null,"GUANAJUATO","PASA661227JN5","PASA661227HDFCLL05","ALBERTO ARTURO PACHECO SILVA","11DPT0012W",null,null,null,null,null,null,null,"X",null,null,null,null,null,null,null,1,0,0,5897.5]
[null,"GUANAJUATO","PEBG910930PM0","PEBG910930MQTRCD18","MARIA GUADALUPE PEREZ BECERRA","11DPT0012W",null,null,null,null,null,null,null,"X",null,null,null,null,null,null,null,1,0,0,4199.1499999999996]
[null,"GUANAJUATO","PEGA8608144V9","PEGA860814MGTRTD07","MARIA AIDA PEREZ  GUTIERREZ ","11DPT0012W",null,null,null,null,null,null,null,"X",null,null,null,null,null,null,null,1,0,0,36104.660000000003]
[null,"GUANAJUATO","PEGR750725A34","PEGR750725HDFRTC00","RICARDO PEREZ GUTIERREZ","11DPT0012W",null,null,null,null,null,null,null,"X",null,null,null,null,null,null,null,1,0,0,2485.88]
[null,"GUANAJUATO","PEQP6003137R3","PEQP600313MQTRNT01","PATRICIA ANTONIA PEREZ  QUINTERO ","11DPT0012W",null,null,null,null,null,null,null,"X",null,null,null,null,null,null,null,1,0,0,20637.599999999999]
[null,"GUANAJUATO","RIHS8511232P3","RIHS851123MGTVRC00","MARIA SOCORRO RIVERA HERNANDEZ","11DPT0012W",null,null,null,null,null,null,null,"X",null,null,null,null,null,null,null,1,0,0,21133.15]
[null,"GUANAJUATO","ROEL820326QF8","ROEL820326MGTCSZ05","MARIA DE LA LUZ ROCHA  ESCOBAR ","11DPT0012W",null,null,null,null,null,null,null,"X",null,null,null,null,null,null,null,1,0,0,16952.25]
[null,"GUANAJUATO","ROFD810129RM2","ROFD810129HDFDNV09","DAVID IGNACIO RODRIGUEZ FUENTES","11DPT0012W",null,null,null,null,null,null,null,"X",null,null,null,null,null,null,null,1,0,0,3779.25]
[null,"GUANAJUATO","ROFM640322BG7","ROFM640322HGTMRR00","MARTIN ROMERO  FERRO ","11DPT0012W",null,null,null,null,null,null,null,"X",null,null,null,null,null,null,null,1,0,0,36020.079999999994]
[null,"GUANAJUATO","ROGJ7510022G2","ROHJ751002HGTDNX00","JOEL  RODRIGUEZ  GONZALEZ","11DPT0012W",null,null,null,null,null,null,null,"X",null,null,null,null,null,null,null,1,0,0,4236.66]
[null,"GUANAJUATO","RORE431022TB0","RORE431022HGTDMD08","EDILBERTO RODRIGUEZ ROMERO","11DPT0012W",null,null,null,null,null,null,null,"X",null,null,null,null,null,null,null,1,0,0,4445.5]
[null,"GUANAJUATO","RORJ620506HP8","RORJ620506HTLDMN05","JUAN RODRIGUEZ ROMERO","11DPT0012W",null,null,null,null,null,null,null,"X",null,null,null,null,null,null,null,1,0,0,20303.820000000003]
[null,"GUANAJUATO","SAGE751202C27","SAGE751202HGTLLD01","EDGAR RICARDO SALINAS GUALITO","11DPT0012W",null,null,null,null,null,null,null,"X",null,null,null,null,null,null,null,1,0,0,3654.75]
[null,"GUANAJUATO","SAPG700911SZ4","SAPG700911HDFNRS05","GUSTAVO SANCHEZ  PEREZ ","11DPT0012W",null,null,null,null,null,null,null,"X",null,null,null,null,null,null,null,1,0,0,15992.66]
[null,"GUANAJUATO","SARN921110T2A","SARN921110HGTNMX07","JOSE NOE SANABRIA MARTINEZ","11DPT0012W",null,null,null,null,null,null,null,"X",null,null,null,null,null,null,null,1,0,0,11894.400000000001]
[null,"GUANAJUATO","SATE820405F51","SATE820405MGTNRV00","EVA MARIA DEL ROSARIO SANCHEZ TURRUBIARTES","11DPT0012W",null,null,null,null,null,null,null,"X",null,null,null,null,null,null,null,1,0,0,2485.88]
[null,"GUANAJUATO","SAVD840330123","SAVD840330MCLLGL06","DULCE IRENE SALINAS VEGA","11DPT0012W",null,null,null,null,null,null,null,"X",null,null,null,null,null,null,null,1,0,0,1713.5]
[null,"GUANAJUATO","SOMJ860107SDA","SOMJ860107MTSSNS08","JESSICA SOSA MENA","11DPT0012W",null,null,null,null,null,null,null,"X",null,null,null,null,null,null,null,1,0,0,25759.05]
[null,"GUANAJUATO","SORR730605V46","SORR730605HDFTMD03","RODOLFO SOTO  ROMERO ","11DPT0012W",null,null,null,null,null,null,null,"X",null,null,null,null,null,null,null,1,0,0,3224.63]
[null,"GUANAJUATO","SOZC590907935","SOZC590907HQTRXN08","JOSE CONRADO SORIA  ZUÑIGA ","11DPT0012W",null,null,null,null,null,null,null,"X",null,null,null,null,null,null,null,1,0,0,11178.7]
[null,"GUANAJUATO","VAMG850109N64","VAMG850109MBSZNB01","GABRIELA VAZQUEZ MONJARAZ","11DPT0012W",null,null,null,null,null,null,null,"X",null,null,null,null,null,null,null,1,0,0,13410]
[null,"GUANAJUATO","VAPG660502A11","VAPG660502HMCZRR05","GERMAN VAZQUEZ PERALTA","11DPT0012W",null,null,null,null,null,null,null,"X",null,null,null,null,null,null,null,1,0,0,9280.6]
[null,"GUANAJUATO","ZABA871015J40","ZABA871015HGTRCM04","AMANDO ZARAZUA BECERRA","11DPT0012W",null,null,null,null,null,null,null,"X",null,null,null,null,null,null,null,1,0,0,1827.38]
[null,"GUANAJUATO","ZAGE8607139H0","ZAGE860713HDFRTN06","ENRIQUE ALFONSO ZARAZUA GUTIERREZ","11DPT0012W",null,null,null,null,null,null,null,"X",null,null,null,null,null,null,null,1,0,0,11459.64]
[null,"GUANAJUATO","ZARI821025R29","ZARI821025MGTRBG09","MARIA IGNACIA ZARAZUA  RUBIO ","11DPT0012W",null,null,null,null,null,null,null,"X",null,null,null,null,null,null,null,1,0,0,4656.25]
[null,"GUANAJUATO","ZARJ781201E25","ZARJ781201HGTRNS07","JESUS ZARAZUA RANGEL","11DPT0012W",null,null,null,null,null,null,null,"X",null,null,null,null,null,null,null,1,0,0,5711.66]
[null,"GUANAJUATO","AAAL5409208IA","AAXA540920HDFLXL04","JOSE ALEJANDRO ALVAREZ ","11DPT0013V",null,null,null,null,null,null,null,"X",null,null,null,null,null,null,null,1,0,0,11310.86]
[null,"GUANAJUATO","AAMT550321C79","AAMT550321MGTLRR02","MARIA TERESA ALVAREZ MARES","11DPT0013V",null,null,null,null,null,null,null,"X",null,null,null,null,null,null,null,1,0,0,17245.400000000001]
[null,"GUANAJUATO","BURL821104LM8","BURL821104MGTTMT09","LETICIA BUTANDA RAMIREZ","11DPT0013V",null,null,null,null,null,null,null,"X",null,null,null,null,null,null,null,1,0,0,22204.22]
[null,"GUANAJUATO","CAMJ670419324","CAMJ670419HGTRRS00","JOSE DE JESUS CARRILLO MARTINEZ","11DPT0013V",null,null,null,null,null,null,null,"X",null,null,null,null,null,null,null,1,0,0,3556.4]
[null,"GUANAJUATO","COML571122DD6","COML571122MGTRRT18","LETICIA CORNEJO MARTINEZ","11DPT0013V",null,null,null,null,null,null,null,"X",null,null,null,null,null,null,null,1,0,0,3439.6]
[null,"GUANAJUATO","DOIB750304RM3","DOIB750304HGTRNN07","BENJAMIN DORANTES INFANTE","11DPT0013V",null,null,null,null,null,null,null,"X",null,null,null,null,null,null,null,1,0,0,1794.6499999999999]
[null,"GUANAJUATO","DULJ8108233XA","DULJ810823HGTQPN02","JUAN IGNACIO DUQUE LOPEZ","11DPT0013V",null,null,null,null,null,null,null,"X",null,null,null,null,null,null,null,1,0,0,27224.620000000006]
[null,"GUANAJUATO","EILL500310BA8","EILL500310MDFLLL09","LILIA SUSANA ELIZALDE LLOPIS","11DPT0013V",null,null,null,null,null,null,null,"X",null,null,null,null,null,null,null,1,0,0,3480.23]
[null,"GUANAJUATO","GOAJ880125GX4","GOAJ880125HGTNLS06","JOSUE ABRAHAM GONZALEZ ALCANTAR","11DPT0013V",null,null,null,null,null,null,null,"X",null,null,null,null,null,null,null,1,0,0,8398.36]
[null,"GUANAJUATO","LORM590406948","LORM590406MGTPDD05","MA GUADALUPE LOPEZ RODRIGUEZ","11DPT0013V",null,null,null,null,null,null,null,"X",null,null,null,null,null,null,null,1,0,0,11364.75]
[null,"GUANAJUATO","LOSC860106KF2","LOSC860106HGTPRH07","CHRISTIAN EMMANUEL LOPEZ SUAREZ","11DPT0013V",null,null,null,null,null,null,null,"X",null,null,null,null,null,null,null,1,0,0,2485.88]
[null,"GUANAJUATO","MAEC690729XXX","MAEC690729MGTTSL04","CLAUDIA MATA ESTRADA","11DPT0013V",null,null,null,null,null,null,null,"X",null,null,null,null,null,null,null,1,0,0,17156.759999999998]
[null,"GUANAJUATO","MAMF050210ZPA","MAFM770502MGTCNR08","MARICRUZ MACIAS FUENTES","11DPT0013V",null,null,null,null,null,null,null,"X",null,null,null,null,null,null,null,1,0,0,1713.5]
[null,"GUANAJUATO","MARM860927B16","MARM860927MGTRVN09","MARIA MONTSERRAT MARES RIVERA","11DPT0013V",null,null,null,null,null,null,null,"X",null,null,null,null,null,null,null,1,0,0,12029.48]
[null,"GUANAJUATO","MEGC861127FF5","MEGC861127HGTZRR00","CARLOS FRANCISCO MEZA GARCIA","11DPT0013V",null,null,null,null,null,null,null,"X",null,null,null,null,null,null,null,1,0,0,6925.5499999999993]
[null,"GUANAJUATO","MORJ631227S89","MORJ631227HGTTMN01","JUAN  MOTA RAMIREZ","11DPT0013V",null,null,null,null,null,null,null,"X",null,null,null,null,null,null,null,1,0,0,22812.700000000004]
[null,"GUANAJUATO","OINM651022J76","OINM651022HGTRVR07","MARTIN ORTIZ NAVARRO","11DPT0013V",null,null,null,null,null,null,null,"X",null,null,null,null,null,null,null,1,0,0,4445.5]
[null,"GUANAJUATO","RAEM750806613","RAEM750806MDFMLN07","MONICA MARCELA RAMIREZ ELIZALDE","11DPT0013V",null,null,null,null,null,null,null,"X",null,null,null,null,null,null,null,1,0,0,3202.27]
[null,"GUANAJUATO","REDA870319HH9","REDA870319HGTGVR03","ARTURO REGALADO DAVILA","11DPT0013V",null,null,null,null,null,null,null,"X",null,null,null,null,null,null,null,1,0,0,1827.56]
[null,"GUANAJUATO","SAPJ7305052R5","SAPJ730505HGTNRN06","JUAN CARLOS SANCHEZ PEREZ","11DPT0013V",null,null,null,null,null,null,null,"X",null,null,null,null,null,null,null,1,0,0,6472.16]
[null,"GUANAJUATO","SECJ780511UPA","SECJ780511MGTRHN02","JUANA MARIA CONCEPCION SERRANO CHAGOYA","11DPT0013V",null,null,null,null,null,null,null,"X",null,null,null,null,null,null,null,1,0,0,2289.6800000000003]
[null,"GUANAJUATO","VIBM750212ED8","VIBM750212MDFLRN06","MONICA VILCHIS BARCENAS","11DPT0013V",null,null,null,null,null,null,null,"X",null,null,null,null,null,null,null,1,0,0,25360.440000000006]
[null,"GUANAJUATO","RIMF850611721","RIMF850611MGTNJB09","FABIOLA RINCON  MOJICA","11DPT0014U",null,null,null,null,null,null,null,"X",null,null,null,null,null,null,null,1,0,0,13037.5]
[null,"GUANAJUATO","SAPG841029F61","SAPG841029HGTNRD01","JOSE GUADALUPE SANDOVAL PEREZ","11DPT0014U",null,null,null,null,null,null,null,"X",null,null,null,null,null,null,null,1,0,0,3411.1]
[]
[]
[]
[]
[]
[]
[]
[]
[]
[]
[]
[]
[]
[]
[]
[]
[null,"Total Personas : ",1030,null,null,null,null,null,null,null,null,null,null,null,null,null,null,null,null,null,null,"Total Recursos Ejercidos:",null,null,{"$f":"SUBTOTAL(109,Tabla11[Total de recursos presupuestales ejercidos en servicios personales en el periodo\n(2)])","v":29876481.949999973}]
[]
[null,"Fuente : Información proporcionada por las Entidades Federativas."]

{"sheet":"II C y 1_","index":5,"n_rows":1067,"n_cols":22,"rows_kept":1067,"cut":false,"hidden":false,"merged":[[1061,18,1061,19],[11,6,12,6],[11,7,12,7],[11,18,11,19],[11,3,12,3],[11,4,12,4],[8,1,8,8],[11,1,12,1],[11,2,12,2],[11,5,12,5],[11,20,12,20],[11,21,12,21],[11,8,12,8],[11,9,11,15],[11,16,12,16],[11,17,12,17]]}
[]
[]
[]
[]
[]
[]
[]
[null,"Formato: Personal Federalizado por Registro Federal de Contribuyentes"]
[null,{"$f":"IF('Caratula Resumen'!D22=\"Elige el Periodo…\",\"\",'Caratula Resumen'!D22)","v":"Fondo de Aportaciones para la Educación Tecnológica y de Adultos/Colegio Nacional de Educación Profesional Técnica (FAETA/CONALEP)"},null,null,null,null,null,null,null,null,null,null,null,null,null,null,null,null,null,null,{"$f":"IF('Caratula Resumen'!D23=\"Elige el Periodo…\",\"\",'Caratula Resumen'!D23)","v":"4to. Trimestre"}]
[]
[]
[null,"Entidad Federativa","Clave CT","Turno","RFC","CURP","Nombre","Funcion Real","Horas que labora en el Centro de Trabajo","Clave Presupuestal",null,null,null,null,null,null,"Tipo de Categoría","Identificador de Contrato de Honorarios","Periodo de efecto de pago en el trimestre",null,"Percepciones pagadas en el Periodo de Comisión con Presupuesto Federal*","Percepciones pagadas en el Periodo de Comisión con Presupuesto de otra fuente*"]
[null,null,null,null,null,null,null,null,null,"Partida Presupuestal","Código de Pago","Clave de Unidad","Clave de Sub Unidad","Clave de Categoría","Horas Semana Mes ","Número de Plaza",null,null,"Inicial","Termino"]
[]
[null,"Entidad Federativa","Clave CT","Turno","RFC","CURP","Nombre","Funcion Real","Horas que labora en el Centro de Trabajo","Partida Presupuestal","Código de Pago","Clave de Unidad","Clave de Sub Unidad","Clave de Categoría","Horas semana mes","Número de plaza","Tipo de Categoría","Identificador de Contrato de Honorarios","Periodo de efecto de pago en el trimestre\nInicial","Periodo de efecto de pago en el trimestre\nTermino","Percepciones pagadas en el Periodo de Comisión con Presupuesto Federal*","Percepciones pagadas en el Periodo de Comisión con Presupuesto de otra fuente*"]
[null,"GUANAJUATO","11DPT0009I",120,"GARG5704245R5","GARG570424HGTRZB08  ","GABRIEL GARCIA RAZO                     ",2,0,1130,1003,"01",74,"S01202",0,8082,2,null,20151001,20151231,0,0]
[null,"GUANAJUATO","11DPT0002P",120,"GUAA600320L51","GUAA600320MGTTLL03  ","ALEJANDRA GUTIERREZ ALVAREZ             ",2,0,1130,1003,"00",29,"A03202",0,2563,2,null,20151001,20151231,0,0]
[null,"GUANAJUATO","11DPT0010Y",120,"IAGY780906K26","IAGY780906MGTBMD00  ","YADIRA ADRIANA IBARRA GOMEZ             ",2,0,1130,1003,"02","04","CF33206",0,13683,2,null,20151001,20151231,0,0]
[null,"GUANAJUATO","11DPT0014U",120,"LARV631103246","LARV631103MGTRCR01  ","VERONICA LARA RICO                      ",2,0,1130,1003,"03","03","CF18203",0,18873,2,null,20151001,20151231,0,0]
[null,"GUANAJUATO","11DPT0002P",120,"LOBM750809KY1","LOBM750809HGTPRG01  ","MIGUEL LOPEZ BARRAGAN                   ",2,0,1130,1003,"00",29,"S01201",0,11909,2,null,20151001,20151231,0,0]
[null,"GUANAJUATO","11DPT0002P",120,"MOFD741006FM4","MOFD741006HGTSLV05  ","DAVID MOSQUEDA FLORES                   ",2,0,1130,1003,"00",29,"CF18203",0,11914,2,null,20151001,20151231,37083.910000000003,0]
[null,"GUANAJUATO","11DPT0002P",120,"SAVJ890118LK2","SAVJ890118HGTNZS05  ","JOSE DE JESUS SANCHEZ VAZQUEZ           ",2,0,1130,1003,"00",29,"S01202",0,2568,2,null,20151001,20151231,0,0]
[null,"GUANAJUATO","11DPT0011X",120,"AABC680116196","AABC680116MMCBNL09  ","CLAUDIA CECILIA D ABDALA BUENDIA        ",2,0,1130,1003,"02",49,"S01202",0,7692,2,null,20151001,20151231,0,0]
[null,"GUANAJUATO","11DPT0009I",120,"AABC720527RL6","AABC720527HGTLRR03  ","CARLOS ALVARADO BARRIOS                 ",2,0,1130,1003,"01",74,"S01201",0,8081,2,null,20151001,20151231,0,0]
[null,"GUANAJUATO","11DPT0004N",120,"AACG691218L13","AACG691218MMNLSR08  ","GRACIELA ALVAREZ CASTRO                 ",2,0,1130,1003,"01",28,"A03202",0,6496,2,null,20151001,20151231,0,0]
[null,"GUANAJUATO","11DPT0002P",120,"AAGA521215AI7","AAGA521215HDFLRR19  ","ARTURO GERARDO ALVAREZ GARCIA           ",2,0,1130,1003,"00",29,"S01201",0,2567,2,null,20151001,20151231,0,0]
[null,"GUANAJUATO","11DPT0014U",120,"AALA880119VB9","AALA880119MGTLPL06  ","ALESSA ALVARADO LOPEZ                   ",2,0,1130,1003,"03","03","A01801",0,18884,2,null,20151001,20151231,0,0]
[null,"GUANAJUATO","11DPT0008J",120,"AALR590709UH6","AALR590709MGTNPC06  ","MARIA ROCIO ANAYA LOPEZ                 ",2,0,1130,1003,"02",33,"CF33206",0,14312,2,null,20151001,20151231,110267.82999999999,0]
[null,"GUANAJUATO","11DPT0006L",120,"AALS670904235","AALS670904MGTNPL09  ","SILVIA ANAYA LOPEZ                      ",2,0,1130,1003,"01",63,"CF33204",0,7715,2,null,20151001,20151231,0,0]
[null,"GUANAJUATO","11APT0001T",100,"AAMD810413AX8","AAMD810413MGTNRN03  ","DIANA LORENA ANAYA MARTINEZ             ",2,0,1130,1003,"07","05","CF04201",0,11092,2,null,20151001,20151231,33583.47,0]
[null,"GUANAJUATO","11DPT0011X",120,"AAMR650620AB4","AAMR650620HGTLGB03  ","ROBERTO ALVARADO MAGAÑA                 ",2,0,1130,1003,"02",49,"CF19201",0,10606,2,null,20151001,20151231,0,0]
[null,"GUANAJUATO","11DPT0011X",120,"AAMR671130JR0","AAMR671130HGTLGB00  ","RUBEN ALVARADO MAGANA                   ",2,0,1130,1003,"02",49,"S01201",0,10613,2,null,20151001,20151231,0,0]
[null,"GUANAJUATO","11DPT0006L",120,"AARL760126331","AARL760126HGTLMN06  ","LEONARDO ISRAEL ALVAREZ ROMO            ",2,0,1130,1003,"01",63,"CF04201",0,7691,2,null,20151001,20151231,0,0]
[null,"GUANAJUATO","11DPT0002P",120,"AARM7802157H4","AARM780215MGTLDY03  ","MYRIAM DEL ROSAR ALVARADO RODRIGUEZ     ",2,0,1130,1003,"00",29,"CF18201",0,2573,2,null,20151001,20151231,0,0]
[null,"GUANAJUATO","11DPT0001Q",120,"AATE760606N24","AATE760606MGTLNV03  ","EVA ALMANZA TINOCO                      ",2,0,1130,1003,"00",28,"S01202",0,9252,2,null,20151001,20151231,0,0]
[null,"GUANAJUATO","11DPT0008J",120,"AEAC630530Q21","AEAC630530MGTLLN08  ","MA. CONCEPCION ALEJOS ALONSO            ",2,0,1130,1003,"02",33,"CF33204",0,10196,2,null,20151001,20151231,0,0]
[null,"GUANAJUATO","11DPT0011X",120,"AECJ7908035L8","AECJ790803HGTLRS03  ","JOSE JESUS ALEJO CARRENO                ",2,0,1130,1003,"02",49,"S01201",0,10594,2,null,20151001,20151231,0,0]
[null,"GUANAJUATO","11APT0001T",100,"AECL710621SE4","AECL710621HGTRRS02  ","JOSE LUIS ARELLANO CRUZ                 ",2,0,1130,1003,"05",13,"A03202",0,10301,2,null,20151001,20151231,30024.639999999999,0]
[null,"GUANAJUATO","11DPT0011X",120,"AECM720103NB9","AECM720103MGTLRR09  ","MARCELA ALEJO CARREÑO                   ",2,0,1130,1003,"02",49,"CF33206",0,14056,2,null,20151001,20151231,0,0]
[null,"GUANAJUATO","11DPT0003O",120,"AEGJ5311191A4","AEGJ531119HGTSRR09  ","JORGE ASCENCIO GARCIA                   ",2,0,1130,1003,"00",30,"S01202",0,2650,2,null,20151001,20151231,0,0]
[null,"GUANAJUATO","11DPT0006L",120,"AERG571209NWA","AERG571209HGTRML09  ","GILBERTO ARREOLA ROMERO                 ",2,0,1130,1003,"01",63,"S01202",0,7707,2,null,20151001,20151231,0,0]
[null,"GUANAJUATO","11DPT0003O",120,"AETA880105TQ0","AETA880105HGTCNN01  ","ANTONIO ACEVEDO TINAJERO                ",2,0,1130,1003,"00",30,"CF33206",0,13322,2,null,20151001,20151231,72130.079999999987,0]
[null,"GUANAJUATO","11APT0001T",100,"AIGG6105048S8","AIGG610504HGTRZL05  ","GUILLERMO ARIAS GUZMAN                  ",5,0,1130,1003,"05",13,"CF02100",0,12460,5,null,20151001,20151231,0,0]
[null,"GUANAJUATO","11APT0001T",100,"AIMK880805R10","AIMK880805MGTRXR05  ","KARLA GABRIELA ARIAS MUÑOZ              ",2,0,1130,1003,"05",13,"CF33206",0,14142,2,null,20151001,20151231,0,0]
[null,"GUANAJUATO","11DPT0011X",120,"AOFA670123A81","AOFA670123MGTBLD06  ","ADRIANA DEL CARM ABONCE FLORES          ",2,0,1130,1003,"02",49,"CF33206",0,14057,2,null,20151001,20151231,0,0]
[null,"GUANAJUATO","11APT0001T",100,"AOGI790809G38","AOGI790809MGTLRM04  ","IMELDA SUSANA ALONSO GARCIA             ",2,0,1130,1003,"05",13,"CF33204",0,4416,2,null,20151001,20151231,0,0]
[null,"GUANAJUATO","11DPT0007K",120,"AOLJ820429DY4","AOLJ820429HGTCPL06  ","JOEL ADOLFO ACOSTA LOPEZ                ",2,0,1130,1003,"02","03","S01201",0,9192,2,null,20151001,20151231,0,0]
[null,"GUANAJUATO","11APT0001T",100,"AORJ6109147M3","AORJ610914HDFMZR05  ","JORGE AMOR RUIZ                         ",5,0,1130,1003,"05",13,"CF02100",0,12459,5,null,20151001,20151231,0,0]
[null,"GUANAJUATO","11DPT0003O",120,"AOVP751006KA9","AOVP751006MGTLLL04  ","MA. DEL PILAR ALMONACI VALADEZ          ",2,0,1130,1003,"00",30,"CF33204",0,2518,2,null,20151001,20151231,0,0]
[null,"GUANAJUATO","11DPT0001Q",120,"AUDM660425P52","AUDM660425MGTGRR18  ","MIRIAM AGUILAR DURON                    ",2,0,1130,1003,"00",28,"CF33206",0,12913,2,null,20151001,20151231,0,0]
[null,"GUANAJUATO","11DPT0004N",120,"AUPM640422KR2","AUPM640422HGTGLR03  ","MARTIN AGUIRRE PALMERIN                 ",2,0,1130,1003,"01",28,"S01201",0,6502,2,null,20151001,20151231,0,0]
[null,"GUANAJUATO","11DPT0001Q",120,"BACM8402274W0","BACM840227HGTRNG03  ","MIGUEL ANGEL BARRON CONEJO              ",2,0,1130,1003,"00",28,"CF33206",0,12911,2,null,20151001,20151231,0,0]
[null,"GUANAJUATO","11DPT0011X",120,"BAGJ5004309G9","BAGJ500430HGTRRR03  ","JORGE BARRERA GARCIA                    ",2,0,1130,1003,"02",49,"CF18201",0,10593,2,null,20151001,20151231,0,0]
[null,"GUANAJUATO","11DPT0011X",120,"BAGS470901EG4","BAGS470901MGTRRL03  ","SILVIA BARRERA GARCIA                   ",2,0,1130,1003,"02",49,"S01202",0,10616,2,null,20151001,20151231,0,0]
[null,"GUANAJUATO","11DPT0008J",120,"BAJR800429CA7","BAJR800429MGTLRC00  ","ROCIO BALDERAS JUAREZ                   ",2,0,1130,1003,"02",33,"T08201",0,770,2,null,20151001,20151231,0,0]
[null,"GUANAJUATO","11APT0001T",100,"BAMJ6207121X4","BAMJ620712HGTRNN19  ","JUAN ANGEL BRAVO MONTOYA                ",2,0,1130,1003,"05",13,"CF33204",0,4390,2,null,20151001,20151231,0,0]
[null,"GUANAJUATO","11DPT0013V",120,"BAMJ651013MA3","BAMJ651013HGTRRN08  ","JUAN PEDRO BARBOSA MORALES              ",2,0,1130,1003,"03","02","CF33206",0,18850,2,null,20151001,20151231,0,0]
[null,"GUANAJUATO","11DPT0007K",120,"BAPA711019KLA","BAPA711019MGTRRN03  ","ANA LOURDES BARAJAS PEREZ               ",2,0,1130,1003,"02","03","CF33204",0,3880,2,null,20151001,20151231,0,0]
[null,"GUANAJUATO","11DPT0005M",120,"BAQL620315PN5","BAQL620315HGTRRS00  ","LUIS MANUEL BRAVO QUIROZ                ",2,0,1130,1003,"00",72,"CF33206",0,13773,2,null,20151001,20151231,0,0]
[null,"GUANAJUATO","11DPT0008J",120,"BARJ8305267S1","BARJ830526HGTRYN02  ","JUAN ANGEL BRAVO REYES                  ",2,0,1130,1003,"02",33,"CF33206",0,13503,2,null,20151001,20151231,0,0]
[null,"GUANAJUATO","11DPT0005M",120,"BASS600608U7A","BASS600608MGTRRL08  ","MARIA SOLEDAD ROS BRAVO SERRANO         ",2,0,1130,1003,"00",72,"A03202",0,4388,2,null,20151001,20151231,0,0]
[null,"GUANAJUATO","11DPT0010Y",120,"BAUM780104T8A","BAUM780104MGTRRC01  ","MICAELA BARCENAS URBINA                 ",2,0,1130,1003,"02","04","S01201",0,2514,2,null,20151001,20151231,0,0]
[null,"GUANAJUATO","11DPT0001Q",120,"BAUR7105213K8","BAUR710521MDFRRT02  ","RITA BARCENAS URBINA                    ",2,0,1130,1003,"00",28,"A03202",0,2495,2,null,20151001,20151231,0,0]
[null,"GUANAJUATO","11DPT0001Q",120,"BEEJ790327230","BEEJ790327HGTLSN06  ","JUAN GUSTAVO BELMAN ESPINOSA            ",2,0,1130,1003,"00",28,"S01202",0,2512,2,null,20151001,20151231,0,0]
[null,"GUANAJUATO","11DPT0002P",120,"BERC880813NK7","BERC880813MGTLMN05  ","CINDIA ELIZABETH BELTRAN RAMOS          ",2,0,1130,1003,"00",29,"CF04201",0,2561,2,null,20151001,20151231,0,0]
[null,"GUANAJUATO","11DPT0003O",120,"BUSG720302VE9","BUSG720302MGTLND02  ","MA. GUADALUPE BULLONS SANTIAGO          ",2,0,1130,1003,"00",30,"A03202",0,9164,2,null,20151001,20151231,0,0]
[null,"GUANAJUATO","11DPT0008J",120,"CAAO740517PC6","CAAO740517HGTMRC05  ","OCTAVIANO CAMPOS ARRIAGA                ",2,0,1130,1003,"02",33,"CF33204",0,2522,2,null,20151001,20151231,0,0]
[null,"GUANAJUATO","11DPT0003O",120,"CACF600221UD2","CACF600221HSPMSR07  ","FORTUNATO CAMACHO CASTILLO              ",2,0,1130,1003,"00",30,"S01201",0,2618,2,null,20151001,20151231,0,0]
[null,"GUANAJUATO","11DPT0007K",120,"CACL650308V86","CACL650308MGTMLZ03  ","MA. DE LA LUZ CAMARILLO COLLAZO         ",2,0,1130,1003,"02","03","CF33206",0,10298,2,null,20151001,20151231,0,0]
[null,"GUANAJUATO","11DPT0007K",120,"CADG5812029W6","CADG581202MGTHLR09  ","GRACIELA CHAVEZ DELGADO                 ",2,0,1130,1003,"02","03","CF21202",0,9211,2,null,20151001,20151231,0,0]
[null,"GUANAJUATO","11DPT0003O",120,"CAGM670126RV9","CAGM670126MGTHNR09  ","MARTHA DELIA CHAVEZ GONZALEZ            ",2,0,1130,1003,"00",30,"CF33206",0,13682,2,null,20151001,20151231,0,0]
[null,"GUANAJUATO","11DPT0005M",120,"CAGR660928KD7","CAGR660928MGTSNB07  ","RUBICELIA CASTRO GONZALEZ               ",2,0,1130,1003,"00",72,"CF33204",0,7424,2,null,20151001,20151231,0,0]
[null,"GUANAJUATO","11DPT0001Q",120,"CAGT7903078F3","CAGT790307HGTMRM01  ","TOMAS ESTEBAN CAMACHO GARCIA            ",2,0,1130,1003,"00",28,"S01201",0,2533,2,null,20151001,20151231,0,0]
[null,"GUANAJUATO","11DPT0003O",120,"CALA611023U79","CALA611023MZSRZD15  ","ADRIANA CARDENAS LOZA                   ",2,0,1130,1003,"00",30,"CF33206",0,14317,2,null,20151001,20151231,89169.609999999986,0]
[null,"GUANAJUATO","11APT0001T",100,"CALA7006204L0","CALA700620MGTMPL09  ","ALEJANDRA CAMACHO LOPEZ                 ",2,0,1130,1003,"05",13,"CF33204",0,11710,2,null,20151001,20151231,0,0]
[null,"GUANAJUATO","11DPT0011X",120,"CALA880830IGA","CALA880830MGTLPD08  ","ADRIANA CALDERON LOPEZ                  ",2,0,1130,1003,"02",49,"CF04201",0,10296,2,null,20151001,20151231,0,0]
[null,"GUANAJUATO","11DPT0005M",120,"CAML640420FH8","CAML640420HDFSRS06  ","JOSE LUIS CASILLAS MIRANDA              ",2,0,1130,1003,"00",72,"CF34201",0,4394,2,null,20151001,20151231,0,0]
[null,"GUANAJUATO","11DPT0013V",120,"CAML820820U36","CAML820820HGTNNS09  ","LUIS MIGUEL CANO MENDOZA                ",2,0,1130,1003,"03","02","CF33204",0,18853,2,null,20151001,20151231,0,0]
[null,"GUANAJUATO","11DPT0005M",120,"CANS730714K3A","CANS730714MGTSTR04  ","SARA CASTILLO NIETO                     ",2,0,1130,1003,"00",72,"CF04201",0,4386,2,null,20151001,20151231,0,0]
[null,"GUANAJUATO","11DPT0007K",120,"CAPE530526869","CAPE530526MGTRRL07  "," M.ELENA CARDIEL PEREZ                  ",2,0,1130,1003,"02","03","CF33204",0,9174,2,null,20151001,20151231,70210.7,0]
[null,"GUANAJUATO","11DPT0002P",120,"CAPR810416EKA","CAPR810416HGTLRB07  ","ROBERTO CALDERON PEREZ                  ",2,0,1130,1003,"00",29,"CF33204",0,2560,2,null,20151001,20151231,0,0]
[null,"GUANAJUATO","11DPT0001Q",120,"CARM520206UK0","CARM520206HGTBCR09  ","MARIO CABRERA RICO                      ",5,0,1130,1003,"00",28,"CF02103",0,12566,5,null,20151001,20151231,0,0]
[null,"GUANAJUATO","11DPT0002P",120,"CASI750121969","CASI750121HGTSNS13  ","ISAAC CASTRO SANTILLANES                ",2,0,1130,1003,"00",29,"CF18203",0,2576,2,null,20151001,20151231,0,0]
[null,"GUANAJUATO","11DPT0007K",120,"CAUF560705QGA","CAUF560705HGTHRL05  ","FILOMENO CHAGOYA URRUTIA                ",2,0,1130,1003,"02","03","S01201",0,9177,2,null,20151001,20151231,0,0]
[null,"GUANAJUATO","11DPT0002P",120,"CAVT730609CSA","CAVT730609MGTRRR12  ","MA. TERESA CARPIO VARGAS                ",2,0,1130,1003,"00",29,"ED01201",0,2571,2,null,20151001,20151231,0,0]
[null,"GUANAJUATO","11APT0001T",100,"CAJU780116N75","CAXJ780116HGTMXN05  ","JUAN JOSE CAMACHO                       ",2,0,1130,1003,"05",13,"CF33206",0,14140,2,null,20151001,20151231,0,0]
[null,"GUANAJUATO","11DPT0001Q",120,"CEFS680324L40","CEFS680324HJCRLL06  ","SAUL CERPA FLORES                       ",2,0,1130,1003,"00",28,"S01202",0,2544,2,null,20151001,20151231,0,0]
[null,"GUANAJUATO","11DPT0009I",120,"CELM960313G89","CELM960313MGTRPY09  ","MAYRA FRANCISCA CERVANTES LOPEZ         ",2,0,1130,1003,"01",74,"S01201",0,8089,2,null,20151001,20151231,0,0]
[null,"GUANAJUATO","11DPT0002P",120,"CEOS781213SN3","CEOS781213HGTBCL04  ","SALOMON CEBALLOS OCHOA                  ",5,0,1130,1003,"00",29,"CF02103",0,12628,5,null,20151001,20151231,0,0]
[null,"GUANAJUATO","11APT0001T",100,"CESA870418K76","CESA870418MGTRMN08  ","ANA GABRIELA CERVERA SAMANO             ",2,0,1130,1003,"05",13,"CF34201",0,8065,2,null,20151001,20151231,0,0]
[null,"GUANAJUATO","11DPT0014U",120,"CEVB731120C46","CEVB731120HGTDRR00  ","BERNARDO CEDILLO VERA                   ",2,0,1130,1003,"03","03","A01801",0,18872,2,null,20151001,20151231,37138.300000000003,0]
[null,"GUANAJUATO","11DPT0002P",120,"CIEE710907TK8","CIEE710907HDFSSD04  ","EDUARDO ALEJANDR CISNEROS ESPINOZA      ",2,0,1130,1003,"00",29,"S01201",0,2607,2,null,20151001,20151231,0,0]
[null,"GUANAJUATO","11DPT0006L",120,"CIGP680809983","CIGP680809HGTDRB07  ","PABLO MARTIN CID GARCIA                 ",2,0,1130,1003,"01",63,"CF33206",0,13988,2,null,20151001,20151231,0,0]
[null,"GUANAJUATO","11DPT0005M",120,"COAD7908184B7","COAD790818MGTVRN00  ","DENY COVARRUBIAS ARREGUIN               ",2,0,1130,1003,"00",72,"S01201",0,4398,2,null,20151001,20151231,0,0]
[null,"GUANAJUATO","11DPT0002P",120,"COCA760915JU4","COCA760915HGTRLL02  ","ALEJANDRO CORIA CALDERON                ",2,0,1130,1003,"00",29,"S01202",0,2593,2,null,20151001,20151231,0,0]
[null,"GUANAJUATO","11DPT0009I",120,"COCM710215JF9","COCM710215HMNBMR04  ","MARIO COBIAN CAMACHO                    ",2,0,1130,1003,"01",74,"CF33206",0,13501,2,null,20151001,20151231,0,0]
[null,"GUANAJUATO","11DPT0012W",120,"COMI671203D76","COMI671203MGTNLR18  ","MA. IRAIS CONTRERAS MALDONADO           ",5,0,1130,1003,"04","02","CF02105",0,12780,5,null,20151001,20151231,0,0]
[null,"GUANAJUATO","11DPT0006L",120,"COMP630327QN2","COMP630327HGTNRB00  ","PABLO GERARDO CONTRERAS MARTINEZ        ",2,0,1130,1003,"01",63,"CF33206",0,13987,2,null,20151001,20151231,0,0]
[null,"GUANAJUATO","11DPT0010Y",120,"CORJ890525619","CORJ890525HGTRMR07  ","JORGE ARMANDO CORONA RAMIREZ            ",2,0,1130,1003,"02","04","S01202",0,9228,2,null,20151001,20151231,0,0]
[null,"GUANAJUATO","11DPT0008J",120,"COVA700831PW6","COVA700831MGRNRM03  ","AMADA CONDE VERA                        ",2,0,1130,1003,"02",33,"T08201",0,760,2,null,20151001,20151231,0,0]
[null,"GUANAJUATO","11DPT0008J",120,"COVF720114623","COVF720114HGTNRR02  ","FRANCISCO JAVIER CONDE VERA             ",2,0,1130,1003,"02",33,"S01201",0,10181,2,null,20151001,20151231,0,0]
[null,"GUANAJUATO","11DPT0007K",120,"CUAC760716LS6","CUAC760716HGTVCR00  ","JOSE CARMEN NOE CUEVAS ACOSTA           ",5,0,1130,1003,"02","03","CF02105",0,12840,5,null,20151001,20151231,77122.2,0]
[null,"GUANAJUATO","11DPT0002P",120,"CUHC5501119F9","CUHC550111HGTLNS08  ","CESAR CUELLAR HINOJOSA                  ",2,0,1130,1003,"00",29,"A03202",0,2565,2,null,20151001,20151231,0,0]
[null,"GUANAJUATO","11DPT0010Y",120,"CUTR610723JC8","CUTR610723MGTLTS06  ","ROSA MARIA CUELLAR TETUAN               ",2,0,1130,1003,"02","04","CF33203",0,9216,2,null,20151001,20151231,0,0]
[null,"GUANAJUATO","11DPT0010Y",120,"CUVL741004T6A","CUVL741004MGTRRR08  ","LAURA CRUZ VARGAS                       ",2,0,1130,1003,"02","04","CF33206",0,13545,2,null,20151001,20151231,0,0]
[null,"GUANAJUATO","11DPT0002P",120,"CUVY830805JA3","CUVY830805MGTSRH00  ","YAHAIRA ALICIA E CUESTAS VARGAS         ",2,0,1130,1003,"00",29,"S01201",0,2595,2,null,20151001,20151231,0,0]
[null,"GUANAJUATO","11DPT0009I",120,"CACX500817KXA","CXCA500817MGTBMN03  ","ANITA CABEZA CAMARGO                    ",2,0,1130,1003,"01",74,"S01202",0,8082,2,null,20151001,20151231,0,0]
[null,"GUANAJUATO","11DPT0003O",120,"DAFT8701278E1","DAFT870127MZSVLN04  ","TANIA LIZETH DAVILA FLORES              ",2,0,1130,1003,"00",30,"S01202",0,2623,2,null,20151001,20151231,0,0]
[null,"GUANAJUATO","11DPT0002P",120,"DEHM860518J96","DEHM860518HMCLRG02  ","MIGUEL ANGEL DELGADO HERNANDEZ          ",2,0,1130,1003,"00",29,"CF34202",0,305,2,null,20151001,20151231,0,0]
[null,"GUANAJUATO","11DPT0002P",120,"DEJA790116B16","DEJA790116HMCLMN00  ","JOSE ANTONIO DELGADO JIMENEZ            ",2,0,1130,1003,"00",29,"CF33206",0,13544,2,null,20151001,20151231,0,0]
[null,"GUANAJUATO","11DPT0004N",120,"DIJL7203079A3","DIJL720307MGTGCR01  ","MA. DE LOURDES DIEGO JACOBO             ",2,0,1130,1003,"01",28,"CF19201",0,6523,2,null,20151001,20151231,0,0]
[null,"GUANAJUATO","11DPT0002P",120,"DONA780620F80","DONA780620HGTMTL04  ","ALEJANDRO DOMINGUEZ NIETO               ",2,0,1130,1003,"00",29,"S01201",0,2635,2,null,20151001,20151231,0,0]
[null,"GUANAJUATO","11APT0001T",100,"DOZL761001RD2","DOZL761001HMNMVS18  ","LUIS ADRIAN DOMINGUEZ ZAVALA            ",5,0,1130,1003,"05",13,"CF02105",0,14598,5,null,20151001,20151231,0,0]
[null,"GUANAJUATO","11DPT0004N",120,"DUAJ8704098Q4","DUAJ870409HGTRGR00  ","JORGE LUIS DURAN AGUILERA               ",2,0,1130,1003,"01",28,"S01201",0,6520,2,null,20151001,20151231,0,0]
[null,"GUANAJUATO","11DPT0010Y",120,"DUFC8505038R7","DUFC850503MGTRLR04  ","MARIA CRUZ DURAN FLORES                 ",2,0,1130,1003,"02","04","CF19201",0,8513,2,null,20151001,20151231,0,0]
[null,"GUANAJUATO","11DPT0013V",120,"EACA751029DJ3","EACA751029MGTSRN06  ","MA DE LOS ANGELE ESPARZA CORONA         ",2,0,1130,1003,"03","02","S01201",0,18882,2,null,20151001,20151231,0,0]
[null,"GUANAJUATO","11DPT0011X",120,"EAFM570902GM4","EAFM570902HGTSLS06  ","MOISES ESTRADA FLORES                   ",2,0,1130,1003,"02",49,"CF18201",0,6504,2,null,20151001,20151231,0,0]
[null,"GUANAJUATO","11DPT0006L",120,"EAMG8704104G8","EAMG870410MGTSRR00  ","GRECIA ROXANA ESPARZA MARES             ",2,0,1130,1003,"01",63,"S01201",0,7709,2,null,20151001,20151231,0,0]
[null,"GUANAJUATO","11APT0001T",100,"EAVG760111SA9","EAVG760111MGTSLD04  ","MA GUADALUPE ESPARZA VALENCIA           ",2,0,1130,1003,"07","05","CF33204",0,2605,2,null,20151001,20151231,0,0]
[null,"GUANAJUATO","11DPT0009I",120,"EICA641219IS3","EICA641219MGTLRL01  ","ALTAGRACIA ELIZARRARAS CERVANTES        ",2,0,1130,1003,"01",74,"CF21202",0,8100,2,null,20151001,20151231,0,0]
[null,"GUANAJUATO","11DPT0001Q",120,"EICA780130NQ1","EICA780130MGTSRN03  ","ANA MARIA ESPINOZA CERVANTES            ",2,0,1130,1003,"00",28,"A03202",0,2492,2,null,20151001,20151231,0,0]
[null,"GUANAJUATO","11DPT0008J",120,"EICT8203073V8","EICT820307HGTSRM05  ","TOMAS ROGELIO ESPINOZA CERVANTES        ",2,0,1130,1003,"02",33,"ED01201",0,4430,2,null,20151001,20151231,0,0]
[null,"GUANAJUATO","11DPT0009I",120,"EIMJ620524ID9","EIMJ620524HGTLRS02  ","JOSE ELIAS MORENO                       ",2,0,1130,1003,"01",74,"CF33206",0,14311,2,null,20151001,20151231,0,0]
[null,"GUANAJUATO","11DPT0006L",120,"EIMJ880812BK0","EIMJ880812MGTLRH07  ","JHOANA IVON ELIZALDE MARTINEZ           ",2,0,1130,1003,"01",63,"CF18201",0,7699,2,null,20151001,20151231,0,0]
[null,"GUANAJUATO","11APT0001T",100,"EIPA861113S53","EIPA861113HGTSRB08  ","JOSE ABRAHAM ESPINOZA PORRAS            ",2,0,1130,1003,"07","05","CF34202",0,5581,2,null,20151001,20151231,29230.34,0]
[null,"GUANAJUATO","11DPT0002P",120,"EIPM591011QG5","EIPM591011MGTSRR09  ","MARTHA ALICIA ESPINOSA PEREZ            ",2,0,1130,1003,"00",29,"CF33206",0,13246,2,null,20151001,20151231,0,0]
[null,"GUANAJUATO","11DPT0010Y",120,"EISB881118DD0","EISB881118MGTSPT05  ","BETSAIDA MAGDALE ESPINOZA SEPULVEDA     ",2,0,1130,1003,"02","04","CF18201",0,9223,2,null,20151001,20151231,0,0]
[null,"GUANAJUATO","11DPT0009I",120,"EITG6112096F3","EITG611209MDFSBD05  ","MARIA GUADALUPE ESPINOSA TABLEROS       ",2,0,1130,1003,"01",74,"CF33204",0,2591,2,null,20151001,20151231,0,0]
[null,"GUANAJUATO","11DPT0009I",120,"EIVC851005GF2","EIVC851005HGTLRR07  ","CARLOS ELIZARRARAS VARGAS               ",2,0,1130,1003,"01",74,"S01201",0,8099,2,null,20151001,20151231,0,0]
[null,"GUANAJUATO","11DPT0012W",120,"EUVA760924363","EUVA760924HGTSLN02  ","ANTONIO ESQUEDA VILLALON                ",2,0,1130,1003,"04","02","CF33204",0,1800,2,null,20151001,20151231,0,0]
[null,"GUANAJUATO","11DPT0003O",120,"FAAF540219KI2","FAAF540219MGTRGX06  ","MARIA FE FRAUSTO AGUILAR                ",2,0,1130,1003,"00",30,"A03202",0,2613,2,null,20151001,20151231,0,0]
[null,"GUANAJUATO","11DPT0001Q",120,"FABC530210FR5","FABC530210MDFRRR00  ","MARIA DEL CARMEN FRANCO BOURET          ",2,0,1130,1003,"00",28,"CF33202",0,2551,2,null,20151001,20151231,0,0]
[null,"GUANAJUATO","11DPT0005M",120,"FIGP640907QP7","FIGP640907HGTGRD01  ","PEDRO FIGUEROA GARCIA                   ",2,0,1130,1003,"00",72,"S01202",0,4404,2,null,20151001,20151231,0,0]
[null,"GUANAJUATO","11DPT0005M",120,"FIRG871015PB5","FIRG871015MGTGMB07  ","GABRIELA FIGUEROA RAMIREZ               ",2,0,1130,1003,"00",72,"S01201",0,4419,2,null,20151001,20151231,0,0]
[null,"GUANAJUATO","11DPT0010Y",120,"FOCJ7406233X9","FOCJ740623MGTLLS01  ","JOSEFINA FLORES CALVA                   ",2,0,1130,1003,"02","04","T08201",0,658,2,null,20151001,20151231,0,0]
[null,"GUANAJUATO","11APT0001T",100,"FOGA580527FU1","FOGA580527HGTLRL09  ","ALEJANDRO FLORES GARCIA                 ",5,0,1130,1003,"05",13,"CF01601",0,18847,5,null,20151001,20151231,0,0]
[null,"GUANAJUATO","11DPT0012W",120,"FOGH740517223","FOGH740517HGTLTC07  ","HECTOR FLORES GUTIERREZ                 ",2,0,1130,1003,"04","02","CF33202",0,3394,2,null,20151001,20151231,0,0]
[null,"GUANAJUATO","11DPT0003O",120,"FOSA610902SG9","FOSA610902MGTLNL09  ","ALEJANDRA PATRICI FLORES SANDOVAL       ",2,0,1130,1003,"00",30,"CF33204",0,2611,2,null,20151001,20151231,0,0]
[null,"GUANAJUATO","11APT0001T",100,"FOTE790312PL3","FOTE790312MGTLRR00  ","ERIKA DEL ROCIO FLORES TERRONES         ",5,0,1130,1003,"05",13,"CF02105",0,14599,5,null,20151001,20151231,0,0]
[null,"GUANAJUATO","11DPT0008J",120,"FOJU6701074Z1","FOXJ670107HGTLXN09  ","JUAN ANTONIO FLORES                     ",2,0,1130,1003,"02",33,"CF33204",0,10193,2,null,20151001,20151231,0,0]
[null,"GUANAJUATO","11DPT0014U",120,"GAAE770204JK3","GAAE770204MDFYLL06  ","ELIA GAYTAN ALCARAZ                     ",5,0,1130,1003,"03","03","CF02104",0,18883,5,null,20151001,20151231,0,0]
[null,"GUANAJUATO","11DPT0001Q",120,"GAAR6310249B2","GAAR631024HGTLRF01  ","RAFAEL GALLEGOS ARELLANO                ",2,0,1130,1003,"00",28,"ED01201",0,2511,2,null,20151001,20151231,0,0]
[null,"GUANAJUATO","11DPT0014U",120,"GABI850102NDA","GABI850102MGTRRS03  ","MARIA ISABEL GARCIA BARRIENTOS          ",2,0,1130,1003,"03","03","CF33206",0,18864,2,null,20151001,20151231,0,0]
[null,"GUANAJUATO","11DPT0004N",120,"GACR6704153I2","GACR670415MGTRRT06  ","MARIA RITA GARCIA CERRATO               ",2,0,1130,1003,"01",28,"CF19201",0,6506,2,null,20151001,20151231,0,0]
[null,"GUANAJUATO","11DPT0008J",120,"GAFV6609298F9","GAFV660929MGTRRR06  ","VERONICA ROCIO GRANADOS FRIAS           ",2,0,1130,1003,"02",33,"CF21202",0,10176,2,null,20151001,20151231,0,0]
[null,"GUANAJUATO","11DPT0012W",120,"GAGY700725MG2","GAGY700725MGTRNS04  ","YESENIA GRANADOS GONZALEZ               ",5,0,1130,1003,"04","02","CF02102",0,12518,5,null,20151001,20151231,0,0]
[null,"GUANAJUATO","11DPT0002P",120,"GAHJ561230M55","GAHJ561230HGTRRN04  ","JUAN GRANADOS HERNANDEZ                 ",2,0,1130,1003,"00",29,"CF33206",0,13249,2,null,20151001,20151231,0,0]
[null,"GUANAJUATO","11DPT0011X",120,"GAJJ660505P94","GAJJ660505HGTRMN06  ","JUAN GARCIA JIMENEZ                     ",2,0,1130,1003,"02",49,"CF19201",0,10602,2,null,20151001,20151231,0,0]
[null,"GUANAJUATO","11DPT0001Q",120,"GALE770303QD2","GALE770303HGTRSD04  ","EDUARDO GARCIA LESSO                    ",2,0,1130,1003,"00",28,"CF33204",0,2545,2,null,20151001,20151231,0,0]
[null,"GUANAJUATO","11DPT0003O",120,"GALJ930324KX8","GALJ930324HGTRPN06  ","JUAN CARLOS GARCIA LOPEZ                ",2,0,1130,1003,"00",30,"S01202",0,9200,2,null,20151001,20151231,0,0]
[null,"GUANAJUATO","11DPT0001Q",120,"GAMM680220L32","GAMM680220MGTLRR01  ","MARTHA NORMA GALLEGOS MARISCAL          ",2,0,1130,1003,"00",28,"ED01201",0,2509,2,null,20151001,20151231,0,0]
[null,"GUANAJUATO","11DPT0001Q",120,"GAOH8102061G0","GAOH810206HDFLLM04  ","HUMBERTO ISRAEL GALVAN OLVERA           ",2,0,1130,1003,"00",28,"S01202",0,2520,2,null,20151001,20151231,0,0]
[null,"GUANAJUATO","11DPT0003O",120,"GARJ690126G3A","GARJ690126HQTRVN01  ","JOSÉ JUAN GARCIA RIVERA                 ",2,0,1130,1003,"00",30,"S01201",0,2500,2,null,20151001,20151231,0,0]
[null,"GUANAJUATO","11DPT0007K",120,"GARJ840526678","GARJ840526HGTRMV04  ","JAVIER ARTURO GARCIA ROMERO             ",2,0,1130,1003,"02","03","S01202",0,9193,2,null,20151001,20151231,0,0]
[null,"GUANAJUATO","11DPT0007K",120,"GARL720427FX0","GARL720427MGTRMZ12  ","LUZ MA. GARCIA ROMERO                   ",2,0,1130,1003,"02","03","ED01201",0,9180,2,null,20151001,20151231,0,0]
[null,"GUANAJUATO","11DPT0004N",120,"GARS670416A54","GARS670416MGTRYL05  ","SILVIA GARCIA REYES                     ",2,0,1130,1003,"01",28,"CF33204",0,10604,2,null,20151001,20151231,0,0]
[null,"GUANAJUATO","11DPT0013V",120,"GASM690929112","GASM690929HDFRLR02  ","MARIO MIGUEL GARCIA SALINAS             ",2,0,1130,1003,"03","02","CF33204",0,18854,2,null,20151001,20151231,0,0]
[null,"GUANAJUATO","11DPT0002P",120,"GATG451128UX1","GATG451128HDFYRS05  ","GUSTAVO GAYTAN TORRES                   ",2,0,1130,1003,"00",29,"CF33206",0,13248,2,null,20151001,20151231,73109.76999999999,0]
[null,"GUANAJUATO","11DPT0004N",120,"GAZE690718GX3","GAZE690718MGTRVL07  ","ELIZABETH GARCIA ZAVALA                 ",2,0,1130,1003,"01",28,"CF04201",0,6498,2,null,20151001,20151231,0,0]
[null,"GUANAJUATO","11DPT0001Q",120,"GIAJ670517N7A","GIAJ670517HGTRLN07  ","JUAN MANUEL GRIMALDO ALFARO             ",2,0,1130,1003,"00",28,"CF34201",0,10177,2,null,20151001,20151231,0,0]
[null,"GUANAJUATO","11DPT0005M",120,"GOAA770911HT1","GOAA770911MGTMLN09  ","ANA ROSA GOMEZ ALBA                     ",2,0,1130,1003,"00",72,"CF33204",0,4409,2,null,20151001,20151231,0,0]
[null,"GUANAJUATO","11DPT0008J",120,"GOCH8410237R3","GOCH841023HGTNBC04  ","HECTOR HUGO GONZALEZ CABRERA            ",2,0,1130,1003,"02",33,"CF18201",0,10175,2,null,20151001,20151231,0,0]
[null,"GUANAJUATO","11DPT0010Y",120,"GOGD870617R99","GOGD870617HNLMRN00  ","JOSE DANIEL GOMEZ GARZA                 ",2,0,1130,1003,"02","04","CF33206",0,14315,2,null,20151001,20151231,0,0]
[null,"GUANAJUATO","11DPT0004N",120,"GOGE730923ME8","GOGE730923MMNNNL00  ","ELIZABETH GONZALEZ GONZALEZ             ",2,0,1130,1003,"01",28,"A03202",0,6497,2,null,20151001,20151231,0,0]
[null,"GUANAJUATO","11DPT0012W",120,"GOGI750427GM1","GOGI750427HMCMYS02  ","ISRAEL GOMEZ GAYTAN                     ",2,0,1130,1003,"04","02","CF33206",0,14068,2,null,20151001,20151231,0,0]
[null,"GUANAJUATO","11DPT0001Q",120,"GOGK890902JT3","GOGK890902MGTNLR04  ","KARLA RAFAELA GONZALEZ GALLARDO         ",2,0,1130,1003,"00",28,"CF33204",0,2526,2,null,20151001,20151231,0,0]
[null,"GUANAJUATO","11DPT0007K",120,"GOGL6009014D1","GOGL600901MGTNLN08  ","LINA ENGRACIA GONZALEZ GALLARDO         ",2,0,1130,1003,"02","03","CF18203",0,9181,2,null,20151001,20151231,0,0]
[null,"GUANAJUATO","11APT0001T",100,"GOLA7812182KA","GOLA781218MQTMPN05  ","ANA GLORIA GOMEZ LOPEZ                  ",2,0,1130,1003,"07","05","CF33204",0,11094,2,null,20151001,20151231,0,0]
[null,"GUANAJUATO","11DPT0005M",120,"GOLR590503HDA","GOLR590503HGTNDB04  ","ROBERTO GONZALEZ LEDESMA                ",5,0,1130,1003,"00",72,"CF02105",0,14597,5,null,20151001,20151231,0,0]
[null,"GUANAJUATO","11DPT0001Q",120,"GOMG8812289D6","GOMG881228HQTMLB01  ","GABRIEL GOMEZ MOLINERO                  ",2,0,1130,1003,"00",28,"CF33204",0,2530,2,null,20151001,20151231,0,0]
[null,"GUANAJUATO","11DPT0003O",120,"GOML690426EW2","GOML690426MGTNDZ08  ","LUZ ESTELA GONZALEZ MEDINA              ",2,0,1130,1003,"00",30,"CF33204",0,2666,2,null,20151001,20151231,0,0]
[null,"GUANAJUATO","11APT0001T",100,"GONM790924B46","GONM790924HGTNVG00  ","MIGUEL ANGEL GONZALEZ NAVARRO           ",2,0,1130,1003,"07","05","CF33204",0,2578,2,null,20151001,20151231,62154.97,0]
[null,"GUANAJUATO","11DPT0011X",120,"GOSA4507257Y0","GOXS450725HGTNXN07  ","SANTIAGO GONZALEZ                       ",2,0,1130,1003,"02",49,"S01202",0,10294,2,null,20151001,20151231,0,0]
[null,"GUANAJUATO","11DPT0006L",120,"GUFO930509HR3","GUFO930509MGTVRL06  ","OLIVIA GUEVARA FARFAN                   ",2,0,1130,1003,"01",63,"S01201",0,7716,2,null,20151001,20151231,0,0]
[null,"GUANAJUATO","11DPT0003O",120,"GUFV820306TSA","GUFV820306HGRZLC04  ","VICTOR MANUEL GUZMAN FLORES             ",2,0,1130,1003,"00",30,"CF33206",0,13684,2,null,20151001,20151231,0,0]
[null,"GUANAJUATO","11DPT0013V",120,"GUGA7312084M6","GUGA731208HGTTZL01  ","ALFREDO GUTIERREZ GUZMAN                ",2,0,1130,1003,"03","02","CF21202",0,18881,2,null,20151001,20151231,0,0]
[null,"GUANAJUATO","11DPT0007K",120,"GUGE730901EC4","GUGE730901MGTTNS07  ","ESPERANZA GUTIERREZ GONZALEZ            ",2,0,1130,1003,"02","03","CF04201",0,2612,2,null,20151001,20151231,0,0]
[null,"GUANAJUATO","11DPT0007K",120,"GUGM650603GP3","GUGM650603MJCTZR08  ","MA. MARTINA GUTIERREZ GUZMAN            ",2,0,1130,1003,"02","03","CF33206",0,13321,2,null,20151001,20151231,0,0]
[null,"GUANAJUATO","11APT0001T",100,"GUJE870107661","GUJE870107MGTTRL01  ","ELIZABETH VERONI GUTIERREZ JUAREZ       ",2,0,1130,1003,"07","05","CF33204",0,2546,2,null,20151001,20151231,54280.760000000009,0]
[null,"GUANAJUATO","11DPT0005M",120,"GULH680121BP6","GULH680121HDFTPR01  ","HORACIO GUTIERREZ LOPEZ                 ",2,0,1130,1003,"00",72,"CF34202",0,9195,2,null,20151001,20151231,0,0]
[null,"GUANAJUATO","11DPT0002P",120,"GULM790929U80","GULM790929HGTRGG04  ","MIGUEL ANGEL GUERRERO LAGUNA            ",2,0,1130,1003,"00",29,"S01202",0,2582,2,null,20151001,20151231,0,0]
[null,"GUANAJUATO","11DPT0010Y",120,"GUMB860612B77","GUMB860612MGTTRL01  ","BLANCA EDITH GUTIERREZ MORENO           ",2,0,1130,1003,"02","04","CF19201",0,9226,2,null,20151001,20151231,0,0]
[null,"GUANAJUATO","11DPT0010Y",120,"GUPD810705I4A","GUPD810705HQTRDM04  ","DOMINGO DANIEL GUERRERO PADILLA         ",5,0,1130,1003,"02","04","CF02104",0,12744,5,null,20151001,20151231,0,0]
[null,"GUANAJUATO","11DPT0013V",120,"GURG711212BH3","GURG711212MGTRXD01  ","MA GUADALUPE GUARDADO REA               ",2,0,1130,1003,"03","02","A03202",0,18859,2,null,20151001,20151231,0,0]
[null,"GUANAJUATO","11DPT0008J",120,"GUTR690427DSA","GUTR690427MDFPRC02  ","ROCIO GUAPO TORRECILLAS                 ",2,0,1130,1003,"02",33,"T08201",0,514,2,null,20151001,20151231,0,0]
[null,"GUANAJUATO","11DPT0009I",120,"GUZA720514FG4","GUZA720514MDFTVL06  ","ALEJANDRA GUTIERREZ ZAVALA              ",2,0,1130,1003,"01",74,"CF04201",0,8079,2,null,20151001,20151231,0,0]
[null,"GUANAJUATO","11DPT0007K",120,"HEBL680226MH6","HEBL680226HDFRNS05  ","LUIS FELIPE HERRERA BUENDIA             ",2,0,1130,1003,"02","03","S01202",0,9206,2,null,20151001,20151231,0,0]
[null,"GUANAJUATO","11APT0001T",100,"HECH720907NC1","HECH720907MDFRNL01  ","HILDA HERNANDEZ CANCHOLA                ",2,0,1130,1003,"07","05","S01201",0,2653,2,null,20151001,20151231,0,0]
[null,"GUANAJUATO","11DPT0010Y",120,"HECL500618L95","HECL500618HGTRRS04  ","JOSE LUIS HERNANDEZ CORTES              ",2,0,1130,1003,"02","04","CF21202",0,9210,2,null,20151001,20151231,0,0]
[null,"GUANAJUATO","11DPT0003O",120,"HECL6401228X2","HECL640122MDFRLT03  ","LETICIA HERNANDEZ CALVILLO              ",2,0,1130,1003,"00",30,"CF21202",0,2663,2,null,20151001,20151231,0,0]
[null,"GUANAJUATO","11DPT0005M",120,"HECS621213HZ5","HECS621213HGTRLR02  ","SERGIO HERNANDEZ CALDERON               ",2,0,1130,1003,"00",72,"CF18203",0,4411,2,null,20151001,20151231,0,0]
[null,"GUANAJUATO","11DPT0003O",120,"HEFM781229PE6","HEFM781229MGTRRL06  ","MARIA MILAGROS HERNANDEZ FRAUSTO        ",2,0,1130,1003,"00",30,"S01202",0,2659,2,null,20151001,20151231,0,0]
[null,"GUANAJUATO","11DPT0012W",120,"HEGC870427C96","HEGC870427HCSRNR00  ","CRISTOBAL DE JES HERNANDEZ GONZALEZ     ",2,0,1130,1003,"04","02","CF18201",0,9301,2,null,20151001,20151231,0,0]
[null,"GUANAJUATO","11DPT0006L",120,"HEGN8708165Y4","HEGN870816MGTRRY05  ","NAYELI HERREJON GUERRERO                ",2,0,1130,1003,"01",63,"CF18201",0,7705,2,null,20151001,20151231,0,0]
[null,"GUANAJUATO","11DPT0003O",120,"HEGS590916A12","HEGS590916HGTRMR05  ","SERAFIN HERNANDEZ GAMIÑO                ",2,0,1130,1003,"00",30,"CF34201",0,2622,2,null,20151001,20151231,0,0]
[null,"GUANAJUATO","11DPT0010Y",120,"HEHA830216PP3","HEHA830216MGTRRL04  ","ALMA DELIA HERNANDEZ HERNANDEZ          ",2,0,1130,1003,"02","04","CF18201",0,9229,2,null,20151001,20151231,0,0]
[null,"GUANAJUATO","11DPT0003O",120,"HEHA900701UB1","HEHA900701MGTRRN03  ","ANA LETICIA HERNANDEZ HERRERA           ",2,0,1130,1003,"00",30,"S01202",0,2630,2,null,20151001,20151231,0,0]
[null,"GUANAJUATO","11DPT0010Y",120,"HELB7109192T6","HELB710919MGTRNT04  ","BEATRIZ HERNANDEZ LONA                  ",2,0,1130,1003,"02","04","A03202",0,9213,2,null,20151001,20151231,0,0]
[null,"GUANAJUATO","11DPT0013V",120,"HELJ790519GT9","HELJ790519HGTRPN03  ","JUAN MANUEL HERNANDEZ LOPEZ             ",2,0,1130,1003,"03","02","CF18203",0,18857,2,null,20151001,20151231,0,0]
[null,"GUANAJUATO","11DPT0013V",120,"HEMG620422565","HEMG620422MGTRRR08  ","GRACIELA HERNANDEZ MARTINEZ             ",2,0,1130,1003,"03","02","CF33203",0,18858,2,null,20151001,20151231,0,0]
[null,"GUANAJUATO","11DPT0001Q",120,"HEMM6706104M9","HEMM670610MGTRNR09  ","MA. MERCEDES HERRERA MANCERA            ",2,0,1130,1003,"00",28,"CF33206",0,12912,2,null,20151001,20151231,0,0]
[null,"GUANAJUATO","11APT0001T",100,"HEOS630818TG4","HEOS630818MDFRRN00  ","SONIA GUADALUPE HERNANDEZ OROZCO        ",2,0,1130,1003,"05",13,"CF33206",0,13318,2,null,20151001,20151231,0,0]
[null,"GUANAJUATO","11APT0001T",100,"HEPL670716M36","HEPL670716HGTRRS02  ","JOSE LUIS HERNANDEZ PEREZ               ",5,0,1130,1003,"05",13,"CF01601",0,18847,5,null,20151001,20151231,0,0]
[null,"GUANAJUATO","11DPT0014U",120,"HEPU760412GG8","HEPU760412HPLRRZ03  ","UZIEL HERNANDEZ PEREZ                   ",2,0,1130,1003,"03","03","S01201",0,18885,2,null,20151001,20151231,0,0]
[null,"GUANAJUATO","11DPT0010Y",120,"HEVL6006012YA","HEVL600601HGTRLZ00  ","J.LUZ HERNANDEZ VELAZQUEZ               ",2,0,1130,1003,"02","04","CF19201",0,9217,2,null,20151001,20151231,0,0]
[null,"GUANAJUATO","11DPT0007K",120,"HELU501011H62","HEXL501011HGTRXZ04  ","DE LA LUZ HERNANDEZ JOSE                ",2,0,1130,1003,"02","03","S01201",0,9184,2,null,20151001,20151231,0,0]
[null,"GUANAJUATO","11DPT0010Y",120,"HIMK800908LB0","HIMK800908HGTNNR04  ","KRISTIAN MANUEL HINOJOSA MONROY         ",2,0,1130,1003,"02","04","S01202",0,10600,2,null,20151001,20151231,0,0]
[null,"GUANAJUATO","11DPT0007K",120,"IAVC761114FE1","IAVC761114MNTBLL00  ","CLAUDIA ELIZABET IBARRA VILLANUEVA      ",2,0,1130,1003,"02","03","CF33206",0,13320,2,null,20151001,20151231,0,0]
[null,"GUANAJUATO","11DPT0008J",120,"JACF700609GI1","JACF700609HGTRML07  ","FELIPE JARAMILLO CAMPOS                 ",2,0,1130,1003,"02",33,"S01202",0,10195,2,null,20151001,20151231,0,0]
[null,"GUANAJUATO","11DPT0006L",120,"JALS470121DUA","JALS470121HMNMPR04  ","SERGIO JAIMES LOPEZ                     ",5,0,1130,1003,"01",63,"CF02103",0,12618,5,null,20151001,20151231,0,0]
[null,"GUANAJUATO","11DPT0007K",120,"JAMC821119QK9","JAMC821119MGTMSL07  ","CLAUDIA MARCELA JAIME MOSQUEDA          ",2,0,1130,1003,"02","03","S01201",0,9173,2,null,20151001,20151231,0,0]
[null,"GUANAJUATO","11DPT0001Q",120,"JAMJ591122Q73","JAMJ591122HGTRNV07  ","JAVIER JARALEÑO MANCERA                 ",2,0,1130,1003,"00",28,"A03202",0,9832,2,null,20151001,20151231,0,0]
[null,"GUANAJUATO","11DPT0011X",120,"JILD710426DB9","JILD710426HGTMPR06  ","DARIO DAMIAN JIMENEZ LOPEZ              ",5,0,1130,1003,"02",49,"CF02103",0,12685,5,null,20151001,20151231,0,0]
[null,"GUANAJUATO","11DPT0003O",120,"JIOL8008248F7","JIOL800824MGTMRZ11  ","LIZETH ARIADNA JIMENEZ ORTEGA           ",2,0,1130,1003,"00",30,"CF33204",0,2510,2,null,20151001,20151231,0,0]
[null,"GUANAJUATO","11DPT0001Q",120,"JOOM700802BM5","JOOM700802HGTYRG06  ","MIGUEL ANGEL JOYA ORTIZ                 ",2,0,1130,1003,"00",28,"CF33206",0,12916,2,null,20151001,20151231,0,0]
[null,"GUANAJUATO","11DPT0002P",120,"JUHF791105831","JUHF791105HDFRLR06  ","FERNANDO JUAREZ HELGUERA                ",2,0,1130,1003,"00",29,"S01201",0,2579,2,null,20151001,20151231,0,0]
[null,"GUANAJUATO","11DPT0005M",120,"JUMH681213NW0","JUMH681213HGTRGL00  ","JOSE HILARIO JUAREZ MAGAÑA              ",2,0,1130,1003,"00",72,"CF33206",0,13770,2,null,20151001,20151231,0,0]
[null,"GUANAJUATO","11DPT0006L",120,"JUPA730712HA3","JUPA730712MGTRRN04  ","ANA LAURA JUAREZ PEREZ                  ",2,0,1130,1003,"01",63,"CF18203",0,7703,2,null,20151001,20151231,0,0]
[null,"GUANAJUATO","11DPT0014U",120,"JUSD780922L87","JUSD780922MQTRRL03  ","DULCE MARIA JUAREZ SORIA                ",2,0,1130,1003,"03","03","A01801",0,18870,2,null,20151001,20151231,0,0]
[null,"GUANAJUATO","11DPT0002P",120,"LAMA800707D83","LAMA800707HGTRRL05  ","JOSE ALEJANDRO LARA MERCADO             ",2,0,1130,1003,"00",29,"S01202",0,2570,2,null,20151001,20151231,0,0]
[null,"GUANAJUATO","11DPT0008J",120,"LAVA8108019Q9","LAVA810801MGTGRN09  ","MARIA DE LOS ANG LAGUNA VARGAS          ",2,0,1130,1003,"02",33,"CF33206",0,14313,2,null,20151001,20151231,0,0]
[null,"GUANAJUATO","11DPT0008J",120,"LAVD841123J58","LAVD841123HGTGRN02  ","DANIEL LAGUNA VARGAS                    ",2,0,1130,1003,"02",33,"S01201",0,10179,2,null,20151001,20151231,0,0]
[null,"GUANAJUATO","11DPT0005M",120,"LEAC581017M56","LEAC581017MGTDLN17  ","MARIA CONSEPCION LEDESMA ALMANZA        ",2,0,1130,1003,"00",72,"CF21202",0,4412,2,null,20151001,20151231,0,0]
[null,"GUANAJUATO","11DPT0005M",120,"LELE610112FLA","LELE610112MGTMRL09  ","ELSA GUADALUPE LEMUS LIRA               ",2,0,1130,1003,"00",72,"CF33206",0,14321,2,null,20151001,20151231,0,0]
[null,"GUANAJUATO","11APT0001T",100,"LERD770827UM0","LERD770827HGTNDM00  ","JOSE DOMINGO DE LEON RODRIGUEZ          ",5,0,1130,1003,"05",13,"CF01601",0,11084,5,null,20151001,20151231,0,0]
[null,"GUANAJUATO","11DPT0009I",120,"LILB720207HV3","LILB720207MGTNML02  ","BLANCA ESTELA LINARES LOMELI            ",2,0,1130,1003,"01",74,"CF33202",0,8087,2,null,20151001,20151231,0,0]
[null,"GUANAJUATO","11DPT0001Q",120,"LIRA890608KM8","LIRA890608MGTZZL06  ","ALMA ROSARIO LIZARRAGA RUIZ             ",2,0,1130,1003,"00",28,"S01201",0,2556,2,null,20151001,20151231,0,0]
[null,"GUANAJUATO","11DPT0006L",120,"LOAP6711257L7","LOAP671125HGTPGB09  ","JOSE PABLO LOPEZ AGUIRRE                ",2,0,1130,1003,"01",63,"A03202",0,7687,2,null,20151001,20151231,0,0]
[null,"GUANAJUATO","11DPT0003O",120,"LOCR480518KR8","LOCR480518HDFPRG01  ","ROGELIO LOPEZ CERVANTES                 ",2,0,1130,1003,"00",30,"CF18203",0,9186,2,null,20151001,20151231,0,0]
[null,"GUANAJUATO","11DPT0011X",120,"LOCV8505084R9","LOCV850508MGTPRR07  ","VERONICA LOPEZ CARDOSO                  ",2,0,1130,1003,"02",49,"S01201",0,2557,2,null,20151001,20151231,0,0]
[null,"GUANAJUATO","11DPT0004N",120,"LOGM731124S65","LOGM731124MMNPZN04  ","MONICA IVETT LOPEZ GUZMAN               ",2,0,1130,1003,"01",28,"CF33206",0,13686,2,null,20151001,20151231,0,0]
[null,"GUANAJUATO","11DPT0004N",120,"LOGY890331RG1","LOGY890331MGTPZN04  ","YANNET LOPEZ GUZMAN                     ",2,0,1130,1003,"01",28,"S01201",0,6511,2,null,20151001,20151231,0,0]
[null,"GUANAJUATO","11DPT0009I",120,"LOLA590613UN8","LOLA590613HGTPPN00  ","ANTONIO LOPEZ LOPEZ                     ",2,0,1130,1003,"01",74,"CF33206",0,13500,2,null,20151001,20151231,0,0]
[null,"GUANAJUATO","11DPT0001Q",120,"LOLA870110SJ9","LOLA870110MGTPPL02  ","ALMA ALEJANDRA LOPEZ LOPEZ              ",2,0,1130,1003,"00",28,"CF33204",0,2553,2,null,20151001,20151231,0,0]
[null,"GUANAJUATO","11DPT0012W",120,"LOSG55020446A","LOSG550204HGTPTL09  ","GUILLERMO LOPEZ SOTO                    ",2,0,1130,1003,"04","02","ED01201",0,11525,2,null,20151001,20151231,0,0]
[null,"GUANAJUATO","11APT0001T",100,"LOVL610419CF3","LOVL610419MDFPCR09  ","MARIA DE LOURDES LOPEZ VICTORIA         ",5,0,1130,1003,"05",13,"CF02105",0,14596,5,null,20151001,20151231,0,0]
[null,"GUANAJUATO","11DPT0007K",120,"LOMA701120ND4","LOXM701120HGTPXR04  ","MARTIN EDUARDO LOPEZ                    ",2,0,1130,1003,"02","03","CF33206",0,13319,2,null,20151001,20151231,0,0]
[null,"GUANAJUATO","11DPT0010Y",120,"LOZE620109TAO","LOZE620109MGTPMV07  ","MA.EVERILDA LOPEZ ZAMORA                ",2,0,1130,1003,"02","04","CF04201",0,9214,2,null,20151001,20151231,0,0]
[null,"GUANAJUATO","11APT0001T",100,"LUBJ6301122R7","LUBJ630112HJCNCR04  ","JORGE IGNACIO LUNA BECERRA              ",5,0,1130,1003,"05",13,"CF11100",0,10304,5,null,20151001,20151231,0,0]
[null,"GUANAJUATO","11DPT0003O",120,"LUPG840320SN8","LUPG840320HGTNRD08  ","JOSE GUADALUPE LUNA PEREZ               ",2,0,1130,1003,"00",30,"A03202",0,2614,2,null,20151001,20151231,0,0]
[null,"GUANAJUATO","11DPT0004N",120,"LURR5303156L3","LURR530315HGTNMY04  ","RAYMUNDO LUNA RAMIREZ                   ",2,0,1130,1003,"01",28,"CF33206",0,14055,2,null,20151001,20151231,0,0]
[null,"GUANAJUATO","11DPT0002P",120,"MABH800524BY7","MABH800524HMNRRG02  ","HUGO MARTINEZ BARRERA                   ",2,0,1130,1003,"00",29,"CF33206",0,13247,2,null,20151001,20151231,0,0]
[null,"GUANAJUATO","11APT0001T",100,"MABM8602122N2","MABM860212MGTRRL21  ","MELISSA MARISELA MARTINEZ BARRIOS       ",2,0,1130,1003,"07","05","S01201",0,2647,2,null,20151001,20151231,27683.410000000003,0]
[null,"GUANAJUATO","11DPT0002P",120,"MACP790228577","MACP790228MGTRSL06  ","MARIA DEL PILAR MARTINEZ CASTRO         ",2,0,1130,1003,"00",29,"S01202",0,2604,2,null,20151001,20151231,0,0]
[null,"GUANAJUATO","11DPT0010Y",120,"MADB860405V48","MADB860405MGTLZL02  ","MARIA BLANCA MALAGON DIAZ               ",2,0,1130,1003,"02","04","S01202",0,9221,2,null,20151001,20151231,0,0]
[null,"GUANAJUATO","11DPT0002P",120,"MADJ760413GFA","MADJ760413HGTTZQ01  ","JOAQUIN MATA DIAZ                       ",2,0,1130,1003,"00",29,"S01202",0,2597,2,null,20151001,20151231,0,0]
[null,"GUANAJUATO","11DPT0002P",120,"MADM900319GN9","MADM900319HGTTZN05  ","JOSE MANUEL MATA DIAZ                   ",2,0,1130,1003,"00",29,"S01201",0,2594,2,null,20151001,20151231,0,0]
[null,"GUANAJUATO","11DPT0006L",120,"MAFJ5906036T8","MAFJ590603HGTRRN00  ","JUAN MANUEL MARTINEZ FRIAS              ",2,0,1130,1003,"01",63,"ED01201",0,18886,2,null,20151001,20151231,0,0]
[null,"GUANAJUATO","11DPT0001Q",120,"MAGB8208194P2","MAGB820819MGTLRL08  ","BLANCA ELIA MALDONADO GARCIA            ",2,0,1130,1003,"00",28,"CF33204",0,2524,2,null,20151001,20151231,0,0]
[null,"GUANAJUATO","11DPT0001Q",120,"MAGC661126AJ5","MAGC661126MGTLNR18  ","MA.CARMEN MALDONADO GONZALEZ            ",2,0,1130,1003,"00",28,"CF33206",0,12910,2,null,20151001,20151231,0,0]
[null,"GUANAJUATO","11DPT0014U",120,"MAGE8309219C9","MAGE830921HSPLRD08  ","EDUARDO MALDONADO GARCIA                ",2,0,1130,1003,"03","03","CF33206",0,18862,2,null,20151001,20151231,0,0]
[null,"GUANAJUATO","11DPT0007K",120,"MAGF780719PC1","MAGF780719MGTRNT03  ","FATIMA MARTINEZ GONZALEZ                ",2,0,1130,1003,"02","03","S01201",0,9171,2,null,20151001,20151231,0,0]
[null,"GUANAJUATO","11DPT0013V",120,"MAHM7308144V2","MAHM730814MGTRRR07  ","MARCELA DEL PILA MARTINEZ HERNANDEZ     ",2,0,1130,1003,"03","02","CF33206",0,18852,2,null,20151001,20151231,0,0]
[null,"GUANAJUATO","11DPT0011X",120,"MAJG650413GMA","MAJG650413HGTLRS08  ","GUSTAVO MALAGON JUAREZ                  ",2,0,1130,1003,"02",49,"CF33206",0,13689,2,null,20151001,20151231,98679.549999999974,0]
[null,"GUANAJUATO","11DPT0003O",120,"MALR690904B5A","MALR690904MGTRPS03  ","ROSA EUGENIA MARTINEZ LOPEZ             ",2,0,1130,1003,"00",30,"CF34201",0,2649,2,null,20151001,20151231,0,0]
[null,"GUANAJUATO","11DPT0011X",120,"MAMJ550416EN3","MAMJ550416HMNRNS07  ","JOSE MARROQUIN MENDOZA                  ",2,0,1130,1003,"02",49,"CF33206",0,14319,2,null,20151001,20151231,0,0]
[null,"GUANAJUATO","11DPT0003O",120,"MAMJ620217DW9","MAMJ620217HGTRNN03  ","JUAN ANTONIO MARTINEZ MONCIBAIS         ",2,0,1130,1003,"00",30,"CF33204",0,2638,2,null,20151001,20151231,0,0]
[null,"GUANAJUATO","11DPT0011X",120,"MAMM8504029T1","MAMM850402MGTLLS09  ","MASSIEL MALDONADO MALDONADO             ",2,0,1130,1003,"02",49,"S01201",0,10610,2,null,20151001,20151231,0,0]
[null,"GUANAJUATO","11APT0001T",100,"MANR8209073S1","MANR820907HGTCGT04  ","RITO MACIAS NEGRETE                     ",5,0,1130,1003,"07","05","CF01601",0,11035,5,null,20151001,20151231,89158.079999999987,0]
[null,"GUANAJUATO","11APT0001T",100,"MAOJ7405168FA","MAOJ740516MGTRCN05  ","JUANA MARTINEZ OCHOA                    ",2,0,1130,1003,"05",13,"CF33206",0,14141,2,null,20151001,20151231,0,0]
[null,"GUANAJUATO","11DPT0013V",120,"MAPU730620D62","MAPU730620HGTRRL07  ","ULISES MARQUEZ DE LA PARRA              ",5,0,1130,1003,"03","02","CF02104",0,18848,5,null,20151001,20151231,0,0]
[null,"GUANAJUATO","11DPT0009I",120,"MARM6405079G7","MARM640507HGTGVR02  ","MARTIN MAGAÑA RIVERA                    ",2,0,1130,1003,"01",74,"CF33206",0,14310,2,null,20151001,20151231,0,0]
[null,"GUANAJUATO","11DPT0009I",120,"MATF6010095M3","MATF601009HGTGFR00  ","FRANCISCO MAGAÑA TAFOYA                 ",2,0,1130,1003,"01",74,"CF19201",0,8090,2,null,20151001,20151231,0,0]
[null,"GUANAJUATO","11DPT0009I",120,"MATM660127FH7","MATM660127MGTGFN01  ","MONICA MAGAÑA TAFOYA                    ",2,0,1130,1003,"01",74,"CF33203",0,8091,2,null,20151001,20151231,0,0]
[null,"GUANAJUATO","11DPT0010Y",120,"MAVR700118TS6","MAVR700118HGTRRB08  ","RUBEN MARTINEZ VARELA                   ",2,0,1130,1003,"02","04","CF33206",0,13251,2,null,20151001,20151231,102783.73999999999,0]
[null,"GUANAJUATO","11DPT0009I",120,"MAZC650708TU1","MAZC650708MGTQRR01  ","MARIA CARMEN MAQUEDA ZARATE             ",2,0,1130,1003,"01",74,"A03202",0,8076,2,null,20151001,20151231,0,0]
[null,"GUANAJUATO","11DPT0009I",120,"MAZC781203DS0","MAZC781203HGTQRR06  ","CARLOS MAQUEDA ZARATE                   ",2,0,1130,1003,"01",74,"CF18201",0,8093,2,null,20151001,20151231,0,0]
[null,"GUANAJUATO","11DPT0006L",120,"MAZR720405LB8","MAZR720405HMNRTC01  ","RICARDO MARTINEZ ZETINA                 ",2,0,1130,1003,"01",63,"CF33204",0,7693,2,null,20151001,20151231,56223.21,0]
[null,"GUANAJUATO","11DPT0002P",120,"MEAE910606I30","MEAE910606HGTJGD01  ","EDGAR EMMANUEL MEJIA AGUILA             ",2,0,1130,1003,"00",29,"S01201",0,2574,2,null,20151001,20151231,0,0]
[null,"GUANAJUATO","11APT0001T",100,"MEEA7012162L2","MEEA701216HZSZSR04  ","ARTURO MEZA ESPARZA                     ",5,0,1130,1003,"07","05","CF11102",0,14556,5,null,20151001,20151231,0,0]
[null,"GUANAJUATO","11DPT0013V",120,"MEES880125B67","MEES880125MGTZSN02  ","SANDRA MARGARITA MEZA ESTRADA           ",2,0,1130,1003,"03","02","S01201",0,18860,2,null,20151001,20151231,0,0]
[null,"GUANAJUATO","11DPT0005M",120,"MEGG6410124T0","MEGG641012MGTDRL06  ","GLORIA MEDINA GARCIA                    ",2,0,1130,1003,"00",72,"S01202",0,4415,2,null,20151001,20151231,0,0]
[null,"GUANAJUATO","11DPT0009I",120,"MEGM680209QU7","MEGM680209MGTDZR08  ","MARTHA SUSANA MEDEL GUZMAN              ",2,0,1130,1003,"01",74,"S01201",0,8085,2,null,20151001,20151231,0,0]
[null,"GUANAJUATO","11DPT0004N",120,"MEGR631011V43","MEGR631011MGTNRS04  ","ROSA MENDEZ GARCIA                      ",2,0,1130,1003,"01",28,"S01202",0,6514,2,null,20151001,20151231,0,0]
[null,"GUANAJUATO","11DPT0008J",120,"MELJ7904219Z8","MELJ790421HGTLDN03  ","JUAN MAURICIO MELGOZA LEDESMA           ",2,0,1130,1003,"02",33,"CF19201",0,10190,2,null,20151001,20151231,0,0]
[null,"GUANAJUATO","11DPT0001Q",120,"MELN680719F21","MELN680719MGTLDR00  ","NORMA LETICIA MELGOZA LEDESMA           ",2,0,1130,1003,"00",28,"CF34201",0,2504,2,null,20151001,20151231,0,0]
[null,"GUANAJUATO","11DPT0014U",120,"MEME901101QT3","MEME901101MGTNRL08  ","MARIA ELENA MENDOZA MARTINEZ            ",2,0,1130,1003,"03","03","CF18203",0,18871,2,null,20151001,20151231,0,0]
[null,"GUANAJUATO","11DPT0005M",120,"MEMM670521N64","MEMM670521MDFDJR03  ","MARTHA PATRICIA MEDEL MEJIA             ",2,0,1130,1003,"00",72,"CF33202",0,4420,2,null,20151001,20151231,0,0]
[null,"GUANAJUATO","11DPT0001Q",120,"MEMM740704297","MEMM740704MDFDRR03  ","MIRNA MEDINA MARIN                      ",2,0,1130,1003,"00",28,"S01202",0,2542,2,null,20151001,20151231,0,0]
[null,"GUANAJUATO","11DPT0009I",120,"MERA680725T53","MERA680725MGTJML04  ","ALMA DELIA MEJIA RAMOS                  ",2,0,1130,1003,"01",74,"A03202",0,8078,2,null,20151001,20151231,0,0]
[null,"GUANAJUATO","11DPT0002P",120,"MEVJ760816A58","MEVJ760816HGTJLL19  ","JULIO ENRIQUE MEJIA VILLANUEVA          ",2,0,1130,1003,"00",29,"CF33206",0,13252,2,null,20151001,20151231,0,0]
[null,"GUANAJUATO","11DPT0001Q",120,"MIAO8312189C2","MIAO831218HDFLPM04  ","OMAR MILLAN APUD                        ",2,0,1130,1003,"00",28,"CF33204",0,2519,2,null,20151001,20151231,0,0]
[null,"GUANAJUATO","11DPT0014U",120,"MIHG8606185P2","MIHG860618MDFRRB06  ","GABRIELA MIRAMONTES HERNANDEZ           ",2,0,1130,1003,"03","03","S01201",0,18875,2,null,20151001,20151231,0,0]
[null,"GUANAJUATO","11DPT0002P",120,"MIRA590513QB0","MIRA590513HGTRMR01  ","JOSE ARMANDO MIRANDA RAMOS              ",2,0,1130,1003,"00",29,"CF34201",0,2587,2,null,20151001,20151231,0,0]
[null,"GUANAJUATO","11DPT0008J",120,"MOFD480314HT2","MOFD480314HGTRLL00  ","JOSE DOLORES MORALES FLORES             ",2,0,1130,1003,"02",33,"S01202",0,10194,2,null,20151001,20151231,0,0]
[null,"GUANAJUATO","11DPT0002P",120,"MOFY680125UV7","MOFY680125MGTSLL00  ","YOLANDA MOSQUEDA FLORES                 ",2,0,1130,1003,"00",29,"T08201",0,690,2,null,20151001,20151231,0,0]
[null,"GUANAJUATO","11APT0001T",100,"MOGM581228P96","MOGM581228MGTRNR09  ","MARTHA DEL CARME MORENO GONZALEZ        ",2,0,1130,1003,"05",13,"A01801",0,18843,2,null,20151001,20151231,40626.9,0]
[null,"GUANAJUATO","11DPT0001Q",120,"MOHA6909151AA","MOHA690915MGTRRN03  ","ANDREA MORALES HERNANDEZ                ",2,0,1130,1003,"00",28,"S01202",0,2548,2,null,20151001,20151231,0,0]
[null,"GUANAJUATO","11DPT0014U",120,"MOJC851117J2A","MOJC851117MGTRST08  ","CITLALLI TONANCI MORA JASSO             ",2,0,1130,1003,"03","03","CF33206",0,18863,2,null,20151001,20151231,0,0]
[null,"GUANAJUATO","11DPT0013V",120,"MOLJ6908066K2","MOLJ690806HGTNRN01  ","JUAN ANTONIO MONTALVO LIRA              ",2,0,1130,1003,"03","02","CF33204",0,18855,2,null,20151001,20151231,0,0]
[null,"GUANAJUATO","11DPT0011X",120,"MOMA590424218","MOMA590424HGTNLN04  ","JOSE ANTONIO MONCADA MALDONADO          ",2,0,1130,1003,"02",49,"CF34201",0,10609,2,null,20151001,20151231,0,0]
[null,"GUANAJUATO","11DPT0007K",120,"MORA580316U78","MORA580316HGTJML06  ","ALEJANDRO MOJICA RAMIREZ                ",2,0,1130,1003,"02","03","CF18203",0,2641,2,null,20151001,20151231,0,0]
[null,"GUANAJUATO","11DPT0005M",120,"MORM6501066X7","MORM650106HGTRSL00  ","MELCHOR BENITO MORENO ROSALES           ",2,0,1130,1003,"00",72,"CF33206",0,14320,2,null,20151001,20151231,0,0]
[null,"GUANAJUATO","11DPT0004N",120,"MORM731010QZ9","MORM731010MVZLZR03  ","MIRSA MARICELA MOLGORA RAZO             ",5,0,1130,1003,"01",28,"CF02104",0,12767,5,null,20151001,20151231,0,0]
[null,"GUANAJUATO","11DPT0005M",120,"MORM8011214B7","MORM801121HDFRMN03  ","MANUEL EFRAIN MORENO ROMERO             ",2,0,1130,1003,"00",72,"CF18201",0,4429,2,null,20151001,20151231,0,0]
[null,"GUANAJUATO","11DPT0006L",120,"MOSJ790615LD6","MOSJ790615HGTLNN00  ","JUAN MOLINA SANCHEZ                     ",2,0,1130,1003,"01",63,"A03202",0,7688,2,null,20151001,20151231,0,0]
[null,"GUANAJUATO","11DPT0006L",120,"MOSP780508DF7","MOSP780508HGTLND02  ","PEDRO MOLINA SANCHEZ                    ",2,0,1130,1003,"01",63,"CF18203",0,7713,2,null,20151001,20151231,0,0]
[null,"GUANAJUATO","11DPT0012W",120,"MUHA861028V94","MUHA861028HGTXRD02  ","JOSE ADAN MUÑOZ HERNANDEZ               ",2,0,1130,1003,"04","02","S01201",0,2516,2,null,20151001,20151231,0,0]
[null,"GUANAJUATO","11DPT0007K",120,"MUPT600105IQ9","MUPT600105MGTRRR07  ","MA. TRINIDAD MURILLO PEREZ              ",2,0,1130,1003,"02","03","CF34201",0,9205,2,null,20151001,20151231,0,0]
[null,"GUANAJUATO","11DPT0001Q",120,"MUSF920131CIA","MUSF920131MGTXCR06  ","MARIA FERNANDA MUÑOZ SAUCILLO           ",2,0,1130,1003,"00",28,"S01201",0,2558,2,null,20151001,20151231,0,0]
[null,"GUANAJUATO","11DPT0011X",120,"MUVA591117ID0","MUVA591117HGTRGN01  ","ANTONIO MURILLO VEGA                    ",2,0,1130,1003,"02",49,"CF18201",0,6515,2,null,20151001,20151231,0,0]
[null,"GUANAJUATO","11APT0001T",100,"NAAA9105064C6","NAAA910506MGTCRN09  ","ANDREA BERENICE NACHEZ ARREDONDO        ",2,0,1130,1003,"05",13,"CF33204",0,2660,2,null,20151001,20151231,0,0]
[null,"GUANAJUATO","11DPT0003O",120,"NAME6411037H1","NAME641103MDFVDV03  ","EVA NAVARRO MADRIGAL                    ",2,0,1130,1003,"00",30,"A03202",0,9169,2,null,20151001,20151231,0,0]
[null,"GUANAJUATO","11DPT0014U",120,"NAQI780206S92","NAQI780206HDFVXV07  ","IVAN AGUSTIN NAVARRETE QUIÑONES         ",2,0,1130,1003,"03","03","A03202",0,18868,2,null,20151001,20151231,0,0]
[null,"GUANAJUATO","11DPT0006L",120,"NAVS621206356","NAVS621206MGTVLN00  ","SANDRA JUANA NAVA VELAZQUEZ             ",2,0,1130,1003,"01",63,"CF33204",0,7704,2,null,20151001,20151231,0,0]
[null,"GUANAJUATO","11DPT0009I",120,"NECL411005F85","NECL411005HGTGRS08  ","LUIS NEGRETE CRUZ                       ",2,0,1130,1003,"01",74,"CF18201",0,8093,2,null,20151001,20151231,0,0]
[null,"GUANAJUATO","11DPT0001Q",120,"NIHE721201VC3","NIHE721201HGTTRS04  ","EUSEBIO MIGUEL A NIETO HERNANDEZ        ",2,0,1130,1003,"00",28,"S01202",0,2541,2,null,20151001,20151231,0,0]
[null,"GUANAJUATO","11DPT0005M",120,"NIMA711025LJ1","NIMA711025MGTTRL07  ","ALICIA NIETO MARTINEZ                   ",2,0,1130,1003,"00",72,"A03202",0,4384,2,null,20151001,20151231,0,0]
[null,"GUANAJUATO","11DPT0011X",120,"NIMT691014GT1","NIMT691014MGTTRR05  ","TERESITA NIETO MARTINEZ                 ",2,0,1130,1003,"02",49,"S01201",0,10614,2,null,20151001,20151231,0,0]
[null,"GUANAJUATO","11DPT0003O",120,"NIPD811108TF1","NIPD811108HBCTSN09  ","DANIEL NIETO PASCALIS                   ",5,0,1130,1003,"00",30,"CF02103",0,12664,5,null,20151001,20151231,0,0]
[null,"GUANAJUATO","11DPT0003O",120,"NIRA700123GK9","NIRA700123MGTTVN01  ","ANA LAURA NIETO RIVERA                  ",2,0,1130,1003,"00",30,"CF33206",0,14316,2,null,20151001,20151231,108234.97999999998,0]
[null,"GUANAJUATO","11DPT0007K",120,"NIRG591215T84","NIRG591215MGTTVR06  ","GEORGINA DE LOURD NIETO RIVERA          ",5,0,1130,1003,"02","03","CF02103",0,12576,5,null,20151001,20151231,0,0]
[null,"GUANAJUATO","11DPT0001Q",120,"NUBS660923MR4","NUBS660923MGTXRL07  ","MA.SILVIA NUÑEZ BARRERA                 ",2,0,1130,1003,"00",28,"CF21202",0,2547,2,null,20151001,20151231,0,0]
[null,"GUANAJUATO","11DPT0008J",120,"NUCS580811UI9","NUCS580811MGTXRS04  ","SUSANA NUÑEZ CERRITOS                   ",2,0,1130,1003,"02",33,"A03202",0,5548,2,null,20151001,20151231,0,0]
[null,"GUANAJUATO","11DPT0010Y",120,"OAGS860412RP6","OAGS860412MGTRTR05  ","SARA DEL ROSARIO ORRANTI GUTIERREZ      ",2,0,1130,1003,"02","04","S01201",0,9224,2,null,20151001,20151231,0,0]
[null,"GUANAJUATO","11DPT0001Q",120,"OAMC600520F43","OAMC600520HSLLLR01  ","CARLOS JAVIER OLAVEZ MELESIO            ",2,0,1130,1003,"00",28,"CF19201",0,2543,2,null,20151001,20151231,0,0]
[null,"GUANAJUATO","11DPT0012W",120,"OELW670610C88","OELW670610HGTLDN06  ","WENSESLAO OLVERA LEDESMA                ",2,0,1130,1003,"04","02","CF18203",0,11932,2,null,20151001,20151231,0,0]
[null,"GUANAJUATO","11DPT0012W",120,"OERM770419UD7","OERM770419HGTLSG03  ","MIGUEL ANGEL OLVERA RESENDIZ            ",2,0,1130,1003,"04","02","A03202",0,10293,2,null,20151001,20151231,0,0]
[null,"GUANAJUATO","11DPT0008J",120,"OETL661122IZ6","OETL661122MGTRRZ06  ","LUZ CECILIA ORTEGA TORRES               ",2,0,1130,1003,"02",33,"CF04201",0,2491,2,null,20151001,20151231,0,0]
[null,"GUANAJUATO","11DPT0004N",120,"OEVL650213T59","OEVL650213MGTRLR01  ","LAURA INES ORTEGA VALADEZ               ",2,0,1130,1003,"01",28,"CF33206",0,14314,2,null,20151001,20151231,0,0]
[null,"GUANAJUATO","11DPT0007K",120,"OIHA541221R95","OIHA541221HGTRRL04  ","ALFONSO ORTIZ HERNANDEZ                 ",2,0,1130,1003,"02","03","A03202",0,2609,2,null,20151001,20151231,0,0]
[null,"GUANAJUATO","11DPT0007K",120,"OILP6802156K9","OILP680215MDFVGL09  ","MARIA DEL PILAR OVIEDO LUGO             ",2,0,1130,1003,"02","03","A03202",0,9168,2,null,20151001,20151231,0,0]
[null,"GUANAJUATO","11APT0001T",100,"OING5906128T6","OING590612HGTRCS02  ","GUSTAVO ORTIZ NICASIO                   ",2,0,1130,1003,"05",13,"CF18203",0,7719,2,null,20151001,20151231,0,0]
[null,"GUANAJUATO","11DPT0003O",120,"OIOM621117BE8","OIOM621117HGTLLN02  ","MANUEL MARTIN OLIVA OLIVA               ",2,0,1130,1003,"00",30,"CF18203",0,2648,2,null,20151001,20151231,0,0]
[null,"GUANAJUATO","11DPT0014U",120,"OOCM7903122F9","OOCM790312MGTRRR03  ","MARCELA OROZCO CORNEJO                  ",2,0,1130,1003,"03","03","CF33204",0,18865,2,null,20151001,20151231,61862.14,0]
[null,"GUANAJUATO","11DPT0005M",120,"OUGM7012272G3","OUGM701227MGTRRN03  ","MONICA ORDUNA GARCIA                    ",2,0,1130,1003,"00",72,"S01202",0,4418,2,null,20151001,20151231,0,0]
[null,"GUANAJUATO","11DPT0005M",120,"PACM840215MT1","PACM840215MGTLRR00  ","MAURA ANGELICA PALOMINO CARREÑO         ",2,0,1130,1003,"00",72,"S01201",0,4417,2,null,20151001,20151231,0,0]
[null,"GUANAJUATO","11DPT0008J",120,"PACM941015U40","PACM941015MGTLRR06  ","MARIANA PALOMINO CARREñO                ",2,0,1130,1003,"02",33,"S01201",0,10189,2,null,20151001,20151231,0,0]
[null,"GUANAJUATO","11DPT0001Q",120,"PACS8101228Y0","PACS810122MGTLRR02  ","SARA PALOMINO CARREÑO                   ",2,0,1130,1003,"00",28,"S01202",0,2525,2,null,20151001,20151231,0,0]
[null,"GUANAJUATO","11DPT0013V",120,"PAGA670111I35","PAGA670111HNTLRR03  ","ARMANDO PALOMARES GARCIA                ",2,0,1130,1003,"03","02","CF33206",0,18851,2,null,20151001,20151231,91247.950000000012,0]
[null,"GUANAJUATO","11DPT0005M",120,"PAGM5802105H5","PAGM580210HNTLRT06  ","MATIAS PALOMARES GARCIA                 ",2,0,1130,1003,"00",72,"S01202",0,4408,2,null,20151001,20151231,0,0]
[null,"GUANAJUATO","11DPT0004N",120,"PAGR7307144R1","PAGR730714MGTNMF00  ","MARIA DEL REFUGIO PANTOJA GOMEZ         ",2,0,1130,1003,"01",28,"CF21202",0,6518,2,null,20151001,20151231,0,0]
[null,"GUANAJUATO","11DPT0006L",120,"PAHM630123LJ6","PAHM630123HGTNRN05  ","MANUEL PANTOJA HERRERA                  ",2,0,1130,1003,"01",63,"CF33206",0,13986,2,null,20151001,20151231,0,0]
[null,"GUANAJUATO","11DPT0008J",120,"PAJJ830708SK1","PAJJ830708HQTTMR06  ","JORGE ADALBERTO PATINO JIMENEZ          ",2,0,1130,1003,"02",33,"CF34202",0,12051,2,null,20151001,20151231,0,0]
[null,"GUANAJUATO","11DPT0002P",120,"PALM711130LV9","PALM711130HGTRGG02  ","MIGUEL ANGEL PARAMO LAGUNA              ",2,0,1130,1003,"00",29,"CF34201",0,2596,2,null,20151001,20151231,0,0]
[null,"GUANAJUATO","11DPT0003O",120,"PAPA810618AR6","PAPA810618HGTLLB03  ","ABRAHAM PALACIOS PALACIOS               ",2,0,1130,1003,"00",30,"CF18202",0,11099,2,null,20151001,20151231,26275.730000000003,0]
[null,"GUANAJUATO","11DPT0007K",120,"PAZR620620HP0","PAZR620620MGTCPQ07  ","RAQUEL PACHECO ZAPIEN                   ",2,0,1130,1003,"02","03","CF33204",0,9194,2,null,20151001,20151231,0,0]
[null,"GUANAJUATO","11DPT0012W",120,"PECE671111QE4","PECE671111HDFRSL09  ","ELOY MARTIN PEREZ CASTILLO              ",2,0,1130,1003,"04","02","CF33206",0,14253,2,null,20151001,20151231,0,0]
[null,"GUANAJUATO","11APT0001T",100,"PEGL590326TB4","PEGL590326MGTRMZ05  ","LUZ ELENA PERALES GOMEZ                 ",2,0,1130,1003,"05",13,"CF33203",0,2575,2,null,20151001,20151231,0,0]
[null,"GUANAJUATO","11APT0001T",100,"PELI680925LM6","PELI680925MGTDPV03  ","IVONNE YOLANDA PEDROZA LOPEZ            ",2,0,1130,1003,"05",13,"CF33206",0,10303,2,null,20151001,20151231,108476.39999999998,0]
[null,"GUANAJUATO","11DPT0010Y",120,"PELL790204HW5","PELL790204MNTRRC05  ","LUCIA PEREZ LARA                        ",2,0,1130,1003,"02","04","S01201",0,2513,2,null,20151001,20151231,0,0]
[null,"GUANAJUATO","11APT0001T",100,"PESE6410262W2","PESE641026HTSRNR02  ","ERNESTO PEREZ SANCHEZ                   ",5,0,1130,1003,"07","05","CF01601",0,11098,5,null,20151001,20151231,89158.080000000002,0]
[null,"GUANAJUATO","11DPT0002P",120,"PEVG640422LA3","PEVG640422MGTRRR00  ","GEORGINA SOLEDAD PEREZ VERA             ",2,0,1130,1003,"00",29,"CF33202",0,2592,2,null,20151001,20151231,0,0]
[null,"GUANAJUATO","11DPT0005M",120,"PIAR680730PSA","PIAR680730MGTRGG01  ","MARIA REGINA PRIETO AGUILAR             ",2,0,1130,1003,"00",72,"CF33204",0,2202,2,null,20151001,20151231,0,0]
[null,"GUANAJUATO","11DPT0001Q",120,"PIOP550618BT2","PIOP550618HGTCLB08  ","PABLO PICHARDO OLVERA                   ",2,0,1130,1003,"00",28,"A03202",0,2494,2,null,20151001,20151231,0,0]
[null,"GUANAJUATO","11DPT0012W",120,"POGA790726B24","POGA790726MGTNZL05  ","ALMA DELIA PONCE GUZMAN                 ",2,0,1130,1003,"04","02","CF04201",0,1440,2,null,20151001,20151231,0,0]
[null,"GUANAJUATO","11DPT0007K",120,"POMR6708302N1","POMR670830MGTRNS05  ","ROSA MARIA PORRAS MANRIQUE              ",2,0,1130,1003,"02","03","CF33204",0,2642,2,null,20151001,20151231,0,0]
[null,"GUANAJUATO","11APT0001T",100,"POPG430527TB7","POPG430527HGTRDD09  ","J. GUADALUPE PORRAS PADILLA             ",2,0,1130,1003,"05",13,"S01202",0,2636,2,null,20151001,20151231,35558.33,0]
[null,"GUANAJUATO","11APT0001T",100,"PUAJ821120LU8","PUAJ821120MJCGLN05  ","JUANA PUGA ALDANA                       ",2,0,1130,1003,"05",13,"S01201",0,2502,2,null,20151001,20151231,0,0]
[null,"GUANAJUATO","11DPT0006L",120,"QUDW870430HH4","QUDW870430MGTNMN07  ","WENDY YAZMIN QUINTANA DOMINGUEZ         ",2,0,1130,1003,"01",63,"CF21202",0,7721,2,null,20151001,20151231,0,0]
[null,"GUANAJUATO","11DPT0001Q",120,"QUGE620101NK4","QUGE620101HGTNRF01  ","EFRAIN QUINTANA GARCIA                  ",2,0,1130,1003,"00",28,"S01202",0,2552,2,null,20151001,20151231,0,0]
[null,"GUANAJUATO","11APT0001T",100,"QUZJ6303282J5","QUZJ630328HSRLNN05  ","JUAN QUILES ZUNO                        ",2,0,1130,1003,"05",13,"A01801",0,18844,2,null,20151001,20151231,0,0]
[null,"GUANAJUATO","11DPT0007K",120,"RAAE850827HM7","RAAE850827MGTMNL05  ","ELVIA RAMIREZ ANDRADE                   ",2,0,1130,1003,"02","03","S01201",0,9183,2,null,20151001,20151231,26540.300000000003,0]
[null,"GUANAJUATO","11DPT0001Q",120,"RAAG5908278S6","RAAG590827HMNNBL08  ","GUILLERMO RANGEL ABURTO                 ",2,0,1130,1003,"00",28,"CF18203",0,4397,2,null,20151001,20151231,0,0]
[null,"GUANAJUATO","11DPT0014U",120,"RAAI811229BW5","RAAI811229MMCMNS05  ","MARIA ISABEL RAMIREZ ANDRADE            ",2,0,1130,1003,"03","03","CF33203",0,18876,2,null,20151001,20151231,0,0]
[null,"GUANAJUATO","11APT0001T",100,"RABF730512PD1","RABF730512HGTMLD04  ","JOSE FIDEL RAMIREZ BELMAN               ",5,0,1130,1003,"05",13,"CF01601",0,11095,5,null,20151001,20151231,0,0]
[null,"GUANAJUATO","11DPT0010Y",120,"RABR820601BH9","RABR820601HGTMND08  ","RODOLFO OSVALDO RAMIREZ BUENO           ",2,0,1130,1003,"02","04","CF33206",0,13543,2,null,20151001,20151231,82911.63,0]
[null,"GUANAJUATO","11DPT0008J",120,"RACA8011159T0","RACA801115MGTMRD05  ","ADELA RAMIREZ CERRITOS                  ",2,0,1130,1003,"02",33,"S01202",0,10174,2,null,20151001,20151231,0,0]
[null,"GUANAJUATO","11DPT0011X",120,"RACB5510265G3","RACB551026HGTMSN05  ","BENITO RAMIREZ CASTILLO                 ",2,0,1130,1003,"02",49,"A03202",0,10292,2,null,20151001,20151231,0,0]
[null,"GUANAJUATO","11APT0001T",100,"RAEL8409015U2","RAEL840901MGTMSR07  ","LAURA PATRICIA RAMOS ESTRADA            ",2,0,1130,1003,"05",13,"CF33206",0,10307,2,null,20151001,20151231,0,0]
[null,"GUANAJUATO","11DPT0005M",120,"RAFA620326696","RAFA620326HGTMNN00  ","JOSE ANTONIO RAMIREZ FUENTES            ",2,0,1130,1003,"00",72,"CF33206",0,13772,2,null,20151001,20151231,0,0]
[null,"GUANAJUATO","11DPT0008J",120,"RAFG691106392","RAFG691106HGTMRR04  ","GERARDO RAMIREZ FERNANDEZ               ",5,0,1130,1003,"02",33,"CF02104",0,12749,5,null,20151001,20151231,0,0]
[null,"GUANAJUATO","11DPT0010Y",120,"RAGJ8207054L2","RAGJ820705HGTNMN05  ","JUAN ANTONIO RANGEL GOMEZ               ",2,0,1130,1003,"02","04","CF21202",0,9232,2,null,20151001,20151231,0,0]
[null,"GUANAJUATO","11DPT0012W",120,"RAGT730306AI0","RAGT730306HGTNRR07  ","JOSE TRINIDAD RANGEL GUERRERO           ",2,0,1130,1003,"04","02","A01801",0,18845,2,null,20151001,20151231,0,0]
[null,"GUANAJUATO","11DPT0007K",120,"RAHJ6410105C3","RAHJ641010MGTMRS04  ","MA. DE JESUS RAMIREZ HORTA              ",2,0,1130,1003,"02","03","CF33206",0,13317,2,null,20151001,20151231,0,0]
[null,"GUANAJUATO","11APT0001T",100,"RAMA640606AQ0","RAMA640606HGTNXL06  ","ALBERTO RANGEL MUÑOZ                    ",2,0,1130,1003,"07","05","ED01201",0,2619,2,null,20151001,20151231,39334.709999999992,0]
[null,"GUANAJUATO","11APT0001T",100,"RAMD6103291R4","RAMD610329HGTMNV10  ","DAVID RAMIREZ MONJARAZ                  ",2,0,1130,1003,"07","05","CF21202",0,1687,2,null,20151001,20151231,0,0]
[null,"GUANAJUATO","11DPT0003O",120,"RARE590716V64","RARE590716MJCMMV05  ","EVELIA DEL CARMEN RAMIREZ RAMIREZ       ",2,0,1130,1003,"00",30,"CF33203",0,9197,2,null,20151001,20151231,0,0]
[null,"GUANAJUATO","11DPT0007K",120,"RARP630605NP2","RARP630605HJCMMD06  ","PEDRO RAMIREZ RAMIREZ                   ",2,0,1130,1003,"02","03","S01202",0,2621,2,null,20151001,20151231,0,0]
[null,"GUANAJUATO","11DPT0003O",120,"RARR701207IA9","RARR701207MDFMMT08  ","RITA RAMIREZ RAMIREZ                    ",2,0,1130,1003,"00",30,"CF04201",0,9170,2,null,20151001,20151231,0,0]
[null,"GUANAJUATO","11DPT0010Y",120,"RARR710422AB6","RARR710422HGTMDM09  ","RAMON RAMIREZ RODRIGUEZ                 ",2,0,1130,1003,"02","04","CF33204",0,10192,2,null,20151001,20151231,0,0]
[null,"GUANAJUATO","11DPT0008J",120,"RASE540830U28","RASE540830HGTYLL02  ","ELEAZAR RAYAS SILVA                     ",2,0,1130,1003,"02",33,"CF18203",0,10187,2,null,20151001,20151231,0,0]
[null,"GUANAJUATO","11APT0001T",100,"RALU580110A37","RAXL580110HGTMXS01  ","LUIS FERNANDO RAMOS                     ",5,0,1130,1003,"07","05","CF02105",0,14601,5,null,20151001,20151231,0,0]
[null,"GUANAJUATO","11DPT0009I",120,"RELR6206286CA","RELR620628HGTYPG09  ","ROGELIO REYES LOPEZ                     ",2,0,1130,1003,"01",74,"CF18203",0,8094,2,null,20151001,20151231,0,0]
[null,"GUANAJUATO","11DPT0013V",120,"RELS650704P63","RELS650704MGTXZL00  ","MA. SOLEDAD REA LOZANO                  ",2,0,1130,1003,"03","02","A01801",0,18877,2,null,20151001,20151231,0,0]
[null,"GUANAJUATO","11DPT0001Q",120,"RERE8505068T2","RERE850506HMNYMD04  ","EDUARDO REYES RAMIREZ                   ",2,0,1130,1003,"00",28,"S01202",0,2508,2,null,20151001,20151231,0,0]
[null,"GUANAJUATO","11DPT0014U",120,"RESO730809AI4","RESO730809MGTYNF03  ","OFELIA REYES SANDOVAL                   ",2,0,1130,1003,"03","03","CF21202",0,18874,2,null,20151001,20151231,0,0]
[null,"GUANAJUATO","11DPT0001Q",120,"RIAA790529868","RIAA790529MMNSGN11  ","ANA KATHERINE RIOS AGUILAR              ",5,0,1130,1003,"00",28,"CF02105",0,14595,5,null,20151001,20151231,0,0]
[null,"GUANAJUATO","11DPT0010Y",120,"RIAC7102242N8","RIAC710224HMNSGR00  ","JOSE CARLOS RIOS AGUILAR                ",2,0,1130,1003,"02","04","CF33206",0,13683,2,null,20151001,20151231,0,0]
[null,"GUANAJUATO","11DPT0011X",120,"RIGA780625KX0","RIGA780625HGTVMG07  ","JOSE AUGUSTO RIVERA GOMEZ               ",2,0,1130,1003,"02",49,"S01202",0,10597,2,null,20151001,20151231,0,0]
[null,"GUANAJUATO","11DPT0007K",120,"RIGJ550502E94","RIGJ550502HCLVRN04  ","JOSE JUAN RIVERA GARCIA                 ",2,0,1130,1003,"02","03","CF33206",0,13316,2,null,20151001,20151231,0,0]
[null,"GUANAJUATO","11DPT0014U",120,"RIHR880331D30","RIHR880331HGTSRC09  ","RICARDO RIOS HERNANDEZ                  ",2,0,1130,1003,"03","03","CF33204",0,18867,2,null,20151001,20151231,0,0]
[null,"GUANAJUATO","11DPT0007K",120,"RIOS5803272M4","RIOS580327MZSVLC03  ","MA. DEL SOCORRO RIVERA OLVERA           ",2,0,1130,1003,"02","03","CF33204",0,9199,2,null,20151001,20151231,0,0]
[null,"GUANAJUATO","11DPT0002P",120,"ROBB6412029G0","ROBB641202MGTBRL04  ","BLANCA ESTELA ROBLES BRAVO              ",2,0,1130,1003,"00",29,"CF21202",0,2588,2,null,20151001,20151231,0,0]
[null,"GUANAJUATO","11DPT0001Q",120,"ROBY7612249Q3","ROBY761224MMCDCN00  ","YUNUEN RODRIGUEZ BECERRA                ",2,0,1130,1003,"00",28,"CF34202",0,2537,2,null,20151001,20151231,0,0]
[null,"GUANAJUATO","11DPT0008J",120,"ROCS8704055G4","ROCS870405MMCDSL06  ","MARIA DEL SOL RODRIGUEZ CASTRO          ",2,0,1130,1003,"02",33,"CF33204",0,10188,2,null,20151001,20151231,0,0]
[null,"GUANAJUATO","11DPT0002P",120,"RODY660703MQ8","RODY660703MGTXLL07  ","YOLANDA ROA DELGADO                     ",2,0,1130,1003,"00",29,"CF33204",0,2598,2,null,20151001,20151231,0,0]
[null,"GUANAJUATO","11DPT0001Q",120,"ROEJ700824751","ROEJ700824HVZMSL05  ","JULIO CESAR ROMERO ESCOBAR              ",2,0,1130,1003,"00",28,"S01201",0,2506,2,null,20151001,20151231,0,0]
[null,"GUANAJUATO","11DPT0011X",120,"ROGA640613DQ5","ROGA640613MDFJTN05  ","ANTONIA ESTELA ROJAS GUTIERREZ          ",2,0,1130,1003,"02",49,"CF33206",0,14318,2,null,20151001,20151231,0,0]
[null,"GUANAJUATO","11DPT0002P",120,"ROGC891121D58","ROGC891121MGTJRR05  ","MARIA DEL CARMEN ROJAS GRANADOS         ",2,0,1130,1003,"00",29,"S01201",0,11909,2,null,20151001,20151231,0,0]
[null,"GUANAJUATO","11DPT0003O",120,"ROGJ631018GD6","ROGJ631018HGTMRN04  ","JUAN JOSE ROMERO GARCIA                 ",2,0,1130,1003,"00",30,"CF19201",0,2620,2,null,20151001,20151231,0,0]
[null,"GUANAJUATO","11DPT0007K",120,"ROGJ720412CD2","ROGJ720412HGTCNL01  ","JULIO BERNARDO ROCHA GONZALEZ           ",2,0,1130,1003,"02","03","CF33202",0,2652,2,null,20151001,20151231,0,0]
[null,"GUANAJUATO","11DPT0008J",120,"ROGJ7905253Y5","ROGJ790525HPLJDN05  ","JOSE JUAN ROJAS GODOY                   ",2,0,1130,1003,"02",33,"CF33206",0,13502,2,null,20151001,20151231,0,0]
[null,"GUANAJUATO","11DPT0007K",120,"ROGL591003DS4","ROGL591003MGTMNN05  ","MA.LINA TERESA ROMERO GONZALEZ          ",2,0,1130,1003,"02","03","CF34202",0,4402,2,null,20151001,20151231,0,0]
[null,"GUANAJUATO","11DPT0008J",120,"ROHH851230UU9","ROHH851230HGTJRR04  ","HERNAN ROJAS HERNANDEZ                  ",2,0,1130,1003,"02",33,"S01201",0,2532,2,null,20151001,20151231,0,0]
[null,"GUANAJUATO","11DPT0001Q",120,"ROHR681221N53","ROHR681221MGTJRB00  ","RUBISELA ROJAS HUARACHA                 ",2,0,1130,1003,"00",28,"CF33204",0,10599,2,null,20151001,20151231,0,0]
[null,"GUANAJUATO","11DPT0007K",120,"ROMI501119KW9","ROMI501119HGTCZS06  ","J. ISABEL ROCHA MEZA                    ",2,0,1130,1003,"02","03","S01201",0,9202,2,null,20151001,20151231,0,0]
[null,"GUANAJUATO","11DPT0001Q",120,"ROMR681004UF2","ROMR681004HGTDRM02  ","RAMIRO RODRIGUEZ MARTINEZ               ",2,0,1130,1003,"00",28,"CF18203",0,2507,2,null,20151001,20151231,0,0]
[null,"GUANAJUATO","11DPT0013V",120,"ROMR861218274","ROMR861218HGTDGC00  ","RICARDO RODRIGUEZ MAGDALENO             ",2,0,1130,1003,"03","02","CF33206",0,18849,2,null,20151001,20151231,73109.76999999999,0]
[null,"GUANAJUATO","11DPT0007K",120,"ROMV410405227","ROMV410306HGTCZC05  ","VICENTE ROCHA MEZA                      ",2,0,1130,1003,"02","03","S01201",0,9203,2,null,20151001,20151231,0,0]
[null,"GUANAJUATO","11APT0001T",100,"ROPA921225ML5","ROPA921225MGTMRB01  ","ABRIL ANDREA ROMERO PEREZ               ",2,0,1130,1003,"05",13,"S01201",0,4414,2,null,20151001,20151231,0,0]
[null,"GUANAJUATO","11DPT0009I",120,"ROPJ630922717","ROPJ630922MGTDRS08  ","JOSEFINA RODRIGUEZ PEREZ                ",2,0,1130,1003,"01",74,"A03202",0,8080,2,null,20151001,20151231,0,0]
[null,"GUANAJUATO","11DPT0001Q",120,"ROPR4911033YA","ROPR491103HGTDTF04  ","RAFAEL RODRIGUEZ PATINO                 ",2,0,1130,1003,"00",28,"S01202",0,2539,2,null,20151001,20151231,0,0]
[null,"GUANAJUATO","11DPT0011X",120,"ROPR8607125H9","ROPR860712MGTDNS08  ","ROSA AIDE RODRIGUEZ PANIAGUA            ",2,0,1130,1003,"02",49,"CF33206",0,12915,2,null,20151001,20151231,0,0]
[null,"GUANAJUATO","11DPT0013V",120,"RORC850223K78","RORC850223HGTDMR02  ","CARLOS ALBERTO RODRIGUEZ RAMIREZ        ",2,0,1130,1003,"03","02","CF18203",0,18879,2,null,20151001,20151231,0,0]
[null,"GUANAJUATO","11DPT0005M",120,"RORF650224FV1","RORF650224HDFDDR03  ","FERNANDO RODRIGUEZ RODRIGUEZ            ",2,0,1130,1003,"00",72,"S01202",0,4395,2,null,20151001,20151231,0,0]
[null,"GUANAJUATO","11DPT0003O",120,"RORJ800328CB1","RORJ800328HGTDMN01  ","JUAN PABLO RODRIGUEZ RAMIREZ            ",2,0,1130,1003,"00",30,"S01202",0,2633,2,null,20151001,20151231,0,0]
[null,"GUANAJUATO","11DPT0002P",120,"ROSA621019UW4","ROSA621019HGTDNG01  ","AGAPITO RODRIGUEZ SANCHEZ               ",2,0,1130,1003,"00",29,"CF19201",0,2583,2,null,20151001,20151231,0,0]
[null,"GUANAJUATO","11DPT0013V",120,"ROSJ840320PL5","ROSJ840320MMCMGL06  ","JULIA OYUKI ROMERO SEGURA               ",2,0,1130,1003,"03","02","A03202",0,18880,2,null,20151001,20151231,0,0]
[null,"GUANAJUATO","11DPT0010Y",120,"ROTF640526L74","ROTF640526HGTDVL07  ","FELIPE RODRIGUEZ TOVAR                  ",2,0,1130,1003,"02","04","CF34202",0,12050,2,null,20151001,20151231,0,0]
[null,"GUANAJUATO","11DPT0008J",120,"ROVA500401GUA","ROVA500401HGTJLR05  ","ARTURO ROJAS VALENCIA                   ",2,0,1130,1003,"02",33,"S01202",0,8084,2,null,20151001,20151231,0,0]
[null,"GUANAJUATO","11DPT0010Y",120,"ROVL470314635","ROVL470314HGTXGS09  ","LUIS RUBEN ROA VEGA                     ",2,0,1130,1003,"02","04","CF34202",0,2655,2,null,20151001,20151231,0,0]
[null,"GUANAJUATO","11DPT0012W",120,"ROVR751027UW3","ROVR751027MGTBRS09  ","MARIA DEL ROSARI ROBLES VARGAS          ",2,0,1130,1003,"04","02","S01201",0,2662,2,null,20151001,20151231,0,0]
[null,"GUANAJUATO","11DPT0003O",120,"ROVS5612313Z0","ROVS561231HGTBNL05  ","J. SILVESTRE ROBLEDO VENEGAS            ",2,0,1130,1003,"00",30,"ED01201",0,2656,2,null,20151001,20151231,0,0]
[null,"GUANAJUATO","11DPT0007K",120,"ROMA570516SW1","ROXM570516HGTJXR04  ","MARIO ROJAS                             ",2,0,1130,1003,"02","03","CF33204",0,9201,2,null,20151001,20151231,0,0]
[null,"GUANAJUATO","11DPT0008J",120,"ROZA560516SE3","ROZA560516HGTJPB08  ","ABEL ROJAS ZAPATERO                     ",2,0,1130,1003,"02",33,"CF33203",0,10178,2,null,20151001,20151231,0,0]
[null,"GUANAJUATO","11DPT0013V",120,"RUER840817TJ2","RUER840817HGTZSN07  ","RENE RUIZ ESPINOZA                      ",2,0,1130,1003,"03","02","A01801",0,18856,2,null,20151001,20151231,0,0]
[null,"GUANAJUATO","11DPT0001Q",120,"RURO710818A13","RURO710818MGTZFL04  ","OLGA AMALIA RUIZ RUFINO                 ",2,0,1130,1003,"00",28,"CF33202",0,2517,2,null,20151001,20151231,0,0]
[null,"GUANAJUATO","11DPT0002P",120,"ROBA710226BG0","RXBA710226MGTBRL07  ","ALMA ROBLES BRAVO                       ",2,0,1130,1003,"00",29,"CF34202",0,2600,2,null,20151001,20151231,0,0]
[null,"GUANAJUATO","11DPT0009I",120,"SAAA790117M77","SAAA790117HGTNRL19  ","JOSE ALFREDO SANCHEZ ARREDONDO          ",2,0,1130,1003,"01",74,"CF33206",0,13499,2,null,20151001,20151231,0,0]
[null,"GUANAJUATO","11APT0001T",100,"SAAK880407FL7","SAAK880407MJCNNR03  ","KARLA ANGELINA SANDOVAL DE ANDA         ",5,0,1130,1003,"05",13,"CF02105",0,12830,5,null,20151001,20151231,0,0]
[null,"GUANAJUATO","11DPT0003O",120,"SAAL680317PF6","SAAL680317MGTLRR00  ","LAURA PATRICIA SALDAÑA ARELLANO         ",2,0,1130,1003,"00",30,"CF33206",0,13685,2,null,20151001,20151231,0,0]
[null,"GUANAJUATO","11DPT0008J",120,"SABA620417HF9","SABA620417HVZNTN05  ","ANICETO SANTIAGO BAUTISTA               ",2,0,1130,1003,"02",33,"CF33206",0,13504,2,null,20151001,20151231,0,0]
[null,"GUANAJUATO","11DPT0005M",120,"SABM631225F45","SABM631225HGTVRR06  ","MARTIN SALVADOR SAAVEDRA BRAVO          ",2,0,1130,1003,"00",72,"S01201",0,4389,2,null,20151001,20151231,0,0]
[null,"GUANAJUATO","11APT0001T",100,"SACA791207U75","SACA791207MGTLSL02  ","MARIA ALEJANDRA SALAZAR CASTANEDA       ",2,0,1130,1003,"05",13,"CF33206",0,14322,2,null,20151001,20151231,0,0]
[null,"GUANAJUATO","11DPT0002P",120,"SACM851223UV7","SACM851223MDFNSN01  ","MONSERRAT SANCHEZ CISNEROS              ",2,0,1130,1003,"00",29,"S01201",0,2601,2,null,20151001,20151231,0,0]
[null,"GUANAJUATO","11DPT0007K",120,"SAGG7304218VA","SAGG730421MGTNLL02  ","GLORIA SANCHEZ GALVAN                   ",2,0,1130,1003,"02","03","CF19201",0,9188,2,null,20151001,20151231,0,0]
[null,"GUANAJUATO","11DPT0001Q",120,"SAGM730131V93","SAGM730131MDFNRR07  ","MARCELA SANCHEZ GARCIA                  ",2,0,1130,1003,"00",28,"CF33206",0,12914,2,null,20151001,20151231,0,0]
[null,"GUANAJUATO","11DPT0004N",120,"SAGN550328R1A","SAGN550328HGTNMC00  ","NICOLAS SANTOYO GOMEZ                   ",2,0,1130,1003,"01",28,"S01202",0,6509,2,null,20151001,20151231,0,0]
[null,"GUANAJUATO","11DPT0002P",120,"SAGS78112652A","SAGS781126HGTLTS16  ","SASHA EMMANUEL SALINAS GUTIERREZ        ",2,0,1130,1003,"00",29,"S01201",0,11702,2,null,20151001,20151231,0,0]
[null,"GUANAJUATO","11DPT0012W",120,"SAHA7408317B1","SAHA740831MDFNRR01  ","AURELIA SANDOVAL HERNANDEZ              ",2,0,1130,1003,"04","02","S01201",0,11167,2,null,20151001,20151231,0,0]
[null,"GUANAJUATO","11APT0001T",100,"SAHE741012DCA","SAHE741012MGTNRS04  ","MA. ESTHER SANCHEZ HERNANDEZ            ",5,0,1130,1003,"05",13,"CF01601",0,11097,5,null,20151001,20151231,0,0]
[null,"GUANAJUATO","11DPT0002P",120,"SAHI670121KQ3","SAHI670121MGTNRN07  ","MA. INES SANDOVAL HERNANDEZ             ",2,0,1130,1003,"00",29,"ED01201",0,2602,2,null,20151001,20151231,0,0]
[null,"GUANAJUATO","11DPT0002P",120,"SAHL6309234X5","SAHL630923HGTNRS00  ","LUIS MIGUEL SANCHEZ HERNANDEZ           ",2,0,1130,1003,"00",29,"CF33204",0,2603,2,null,20151001,20151231,0,0]
[null,"GUANAJUATO","11DPT0004N",120,"SAHO620602LB0","SAHO620602HSRLRS06  ","OSMAN SALAZAR HERNANDEZ                 ",2,0,1130,1003,"01",28,"S01201",0,6507,2,null,20151001,20151231,0,0]
[null,"GUANAJUATO","11DPT0002P",120,"SALM811102IP0","SALG811102MGTNGD00  ","MA. GUADALUPE SANCHEZ LAGUNA            ",2,0,1130,1003,"00",29,"CF33204",0,2599,2,null,20151001,20151231,0,0]
[null,"GUANAJUATO","11DPT0008J",120,"SALS651213I40","SALS651213MGTNNN03  ","SANJUANA SANCHEZ LUNA                   ",2,0,1130,1003,"02",33,"CF04201",0,10172,2,null,20151001,20151231,0,0]
[null,"GUANAJUATO","11DPT0006L",120,"SAMG651113CLA","SAMG651113MGTVDD08  ","MARIA GUADALUPE SAAVEDRA MEDRANO        ",2,0,1130,1003,"01",63,"CF34201",0,7700,2,null,20151001,20151231,0,0]
[null,"GUANAJUATO","11APT0001T",100,"SAML830406CC2","SAML830406HDFNNS01  ","LUIS ENRIQUE SANCHEZ MENDOZA            ",2,0,1130,1003,"05",13,"CF33204",0,3181,2,null,20151001,20151231,0,0]
[null,"GUANAJUATO","11APT0001T",100,"SAMN650727TS7","SAMN650727MGTNJT03  ","MA. NATALIA SANCHEZ MOJICA              ",2,0,1130,1003,"05",13,"S01201",0,9230,2,null,20151001,20151231,0,0]
[null,"GUANAJUATO","11DPT0010Y",120,"SAOC521104BAA","SAOC521104HGTNLR02  ","CARLOS SANCHEZ OLIVA                    ",2,0,1130,1003,"02","04","S01202",0,9227,2,null,20151001,20151231,0,0]
[null,"GUANAJUATO","11DPT0002P",120,"SARA881017KA5","SARA881017HGTNXL07  ","ALBERTO ALEXANDR SANTILLAN REA          ",2,0,1130,1003,"00",29,"S01201",0,2590,2,null,20151001,20151231,0,0]
[null,"GUANAJUATO","11DPT0011X",120,"SARF810815QJ5","SARF810815MDFNCB12  ","MARIA FABIOLA SANCHEZ RICO              ",2,0,1130,1003,"02",49,"S01201",0,10589,2,null,20151001,20151231,0,0]
[null,"GUANAJUATO","11DPT0009I",120,"SARO9410041H4","SARO941004HGTNXL07  ","OLDAIR FERNANDO SANTILLAN REA           ",2,0,1130,1003,"01",74,"CF18201",0,8098,2,null,20151001,20151231,0,0]
[null,"GUANAJUATO","11DPT0001Q",120,"SARR700714SU4","SARR700714MGTCMS06  ","MARIA DEL ROSARI SAUCILLO RAMIREZ       ",2,0,1130,1003,"00",28,"CF33204",0,2540,2,null,20151001,20151231,0,0]
[null,"GUANAJUATO","11DPT0002P",120,"SASJ650121CF2","SAST650121HGTNMR00  ","J. TRINIDAD SANCHEZ SAMANO              ",2,0,1130,1003,"00",29,"CF33204",0,9176,2,null,20151001,20151231,0,0]
[null,"GUANAJUATO","11DPT0005M",120,"SATR640529JN3","SATR640529HGTLRB08  ","RUBEN SALAZAR TORRES                    ",2,0,1130,1003,"00",72,"CF19201",0,4426,2,null,20151001,20151231,0,0]
[null,"GUANAJUATO","11DPT0011X",120,"SEES881205VA7","SEES881205MGTRSR08  ","SARA SERRANO ESTRADA                    ",2,0,1130,1003,"02",49,"CF33203",0,10611,2,null,20151001,20151231,0,0]
[null,"GUANAJUATO","11DPT0005M",120,"SIFB790507EM8","SIFB790507HGTRRR00  ","BRAULIO ISAAC SIERRA FERREYRA           ",2,0,1130,1003,"00",72,"CF33206",0,13771,2,null,20151001,20151231,0,0]
[null,"GUANAJUATO","11DPT0014U",120,"SIRI830722KG2","SIRI830722HGTXCG04  ","IGNACIO MANUEL SIXTOS RICO              ",2,0,1130,1003,"03","03","CF33204",0,18866,2,null,20151001,20151231,0,0]
[null,"GUANAJUATO","11DPT0006L",120,"SIRO600318LE2","SIRO600318HGTRDC04  ","JOSE OCTAVIO SIERRA RODRIGUEZ           ",2,0,1130,1003,"01",63,"CF33204",0,7708,2,null,20151001,20151231,0,0]
[null,"GUANAJUATO","11APT0001T",100,"SIRO740717FV0","SIRO740717HGTRCS06  ","OSWALDO SIERRA ROCHA                    ",2,0,1130,1003,"05",13,"CF33204",0,4390,2,null,20151001,20151231,0,0]
[null,"GUANAJUATO","11DPT0014U",120,"SOMC8307243E3","SOMC830724HGTTNH06  ","CHRISTIAN SOTO MENDOZA                  ",2,0,1130,1003,"03","03","CF33206",0,18861,2,null,20151001,20151231,0,0]
[null,"GUANAJUATO","11DPT0009I",120,"SOMJ580901N40","SOMJ580901HMNLRS02  ","JESUS SOLIS MARIN                       ",2,0,1130,1003,"01",74,"S01202",0,8097,2,null,20151001,20151231,0,0]
[null,"GUANAJUATO","11DPT0004N",120,"SOPA800206QN0","SOPA800206HMCRRB02  ","ABNER ISAI SORIA PEREZ                  ",2,0,1130,1003,"01",28,"CF33204",0,10615,2,null,20151001,20151231,0,0]
[null,"GUANAJUATO","11DPT0012W",120,"SOPL831024T56","SOPL831024MGTTRR09  ","LAURA ANGELICA SOTO PEREZ               ",2,0,1130,1003,"04","02","CF33204",0,363,2,null,20151001,20151231,0,0]
[null,"GUANAJUATO","11DPT0012W",120,"SUFR660516C81","SUFR660516MDFRLQ08  ","RAQUEL SUAREZ FALCON                    ",2,0,1130,1003,"04","02","CF33204",0,10959,2,null,20151001,20151231,0,0]
[null,"GUANAJUATO","11DPT0004N",120,"TAAS6205308FA","TAAS620530MJCPLR01  ","SARA TAPIA ALCANTARA                    ",2,0,1130,1003,"01",28,"CF34201",0,6522,2,null,20151001,20151231,0,0]
[null,"GUANAJUATO","11DPT0003O",120,"TAPM7310026U1","TAPM731002HDFRSG06  ","MIGUEL ANGEL TAURINO PASTEN             ",2,0,1130,1003,"00",30,"S01202",0,2637,2,null,20151001,20151231,0,0]
[null,"GUANAJUATO","11DPT0001Q",120,"TEHM7408294G1","TEHM740829HGTLRR02  ","MARCO ANTONIO TELLEZ HERRERA            ",2,0,1130,1003,"00",28,"S01201",0,2501,2,null,20151001,20151231,0,0]
[null,"GUANAJUATO","11APT0001T",100,"TERY911028QH5","TERY911028MGTNMS08  ","YASMIN DEL CARME TENA RAMIREZ           ",2,0,1130,1003,"05",13,"CF33204",0,2660,2,null,20151001,20151231,0,0]
[null,"GUANAJUATO","11DPT0005M",120,"TOCB650526KH4","TOCB650526MGTRVR00  ","BERTHA TORRES COBARRUBIAS               ",5,0,1130,1003,"00",72,"CF02103",0,12617,5,null,20151001,20151231,0,0]
[null,"GUANAJUATO","11DPT0001Q",120,"TOCF910415931","TOCF910415MGTRRT00  ","FATIMA DEL ROSAR TORRES CERVANTES       ",2,0,1130,1003,"00",28,"CF18201",0,2535,2,null,20151001,20151231,0,0]
[null,"GUANAJUATO","11DPT0006L",120,"TOMP701231IUA","TOMP701231MGTRJT08  ","PATRICIA TORRES MEJIA                   ",2,0,1130,1003,"01",63,"CF33203",0,7702,2,null,20151001,20151231,0,0]
[null,"GUANAJUATO","11DPT0014U",120,"TORM8008155Q9","TORM800815HGTRVR02  ","MARIO TORRES RIVERA                     ",2,0,1130,1003,"03","03","A03202",0,18869,2,null,20151001,20151231,0,0]
[null,"GUANAJUATO","11DPT0001Q",120,"TOSS530312KL6","TOSS530312HDFRMM05  ","SAMUEL TORRES SUMOZA                    ",2,0,1130,1003,"00",28,"S01202",0,2555,2,null,20151001,20151231,0,0]
[null,"GUANAJUATO","11DPT0001Q",120,"VAAM631105TU4","VAAM631105HGTLYR06  ","MARTIN VALENTE AYALA                    ",2,0,1130,1003,"00",28,"A03202",0,2497,2,null,20151001,20151231,0,0]
[null,"GUANAJUATO","11DPT0009I",120,"VACM560124H46","VACM560124HGTZRR03  ","MAURILIO VAZQUEZ CERVANTES              ",2,0,1130,1003,"01",74,"S01202",0,8092,2,null,20151001,20151231,0,0]
[null,"GUANAJUATO","11DPT0005M",120,"VACY6607278R7","VACY660727MGTRSL08  ","YOLANDA VARGAS CASTILLO                 ",2,0,1130,1003,"00",72,"CF33204",0,4428,2,null,20151001,20151231,0,0]
[null,"GUANAJUATO","11DPT0002P",120,"VAEA7904041V2","VAEA790404HGTLLL05  ","ALEJANDRO VALADEZ ELIAS                 ",2,0,1130,1003,"00",29,"S01201",0,2585,2,null,20151001,20151231,0,0]
[null,"GUANAJUATO","11DPT0005M",120,"VAGC6606185V3","VAGC660618MGTRRN09  ","CANDELARIA VARGAS GARCIA                ",2,0,1130,1003,"00",72,"S01201",0,4413,2,null,20151001,20151231,0,0]
[null,"GUANAJUATO","11DPT0005M",120,"VALN7508285U9","VALN750828MGTZMR00  ","NORMA ADRIANA VAZQUEZ LOMELI            ",2,0,1130,1003,"00",72,"ED01201",0,4403,2,null,20151001,20151231,0,0]
[null,"GUANAJUATO","11DPT0012W",120,"VAMF590309CY5","VAMF590309HGTLNR07  ","FERNANDO VALDES MONTES                  ",2,0,1130,1003,"04","02","CF33206",0,13687,2,null,20151001,20151231,0,0]
[null,"GUANAJUATO","11APT0001T",100,"VARG660927MXA","VARG660927MDFLSL01  ","GLORIA GUADALUPE VALENZUELA RIOS        ",5,0,1130,1003,"07","05","CF01601",0,11090,5,null,20151001,20151231,89158.079999999987,0]
[null,"GUANAJUATO","11DPT0004N",120,"VASO730804UX2","VASO730804HGTRTC00  ","OCTAVIO VARGAS SOTO                     ",2,0,1130,1003,"01",28,"CF33206",0,13688,2,null,20151001,20151231,0,0]
[null,"GUANAJUATO","11DPT0012W",120,"VASS860602N16","VASS860602MQTLNN00  ","SANDRA YANET VALTIERRA SANCHEZ          ",2,0,1130,1003,"04","02","CF33206",0,14067,2,null,20151001,20151231,0,0]
[null,"GUANAJUATO","11DPT0002P",120,"VEGG461124SB3","VEGG461124HGTLLD01  ","J. GUADALUPE VELAZQUEZ GALLARDO         ",2,0,1130,1003,"00",29,"A03202",0,2564,2,null,20151001,20151231,0,0]
[null,"GUANAJUATO","11DPT0001Q",120,"VEGR631014AK5","VEGR631014HGTLRB01  ","RUBEN VELAZQUEZ GARCIA                  ",2,0,1130,1003,"00",28,"S01202",0,2527,2,null,20151001,20151231,0,0]
[null,"GUANAJUATO","11DPT0001Q",120,"VEHP610906SJ2","VEHP610906HGTRRT04  ","PETRONILO VERA HERNANDEZ                ",2,0,1130,1003,"00",28,"CF19201",0,2496,2,null,20151001,20151231,0,0]
[null,"GUANAJUATO","11DPT0001Q",120,"VEMM86100222D","VEMM861022MGTRNR00  ","MIRIAM SOLEDAD VERA MENDIETA            ",2,0,1130,1003,"00",28,"CF18201",0,2515,2,null,20151001,20151231,0,0]
[null,"GUANAJUATO","11DPT0010Y",120,"VEMR6104101A1","VEMR610410HGTLRM02  ","JOSE RAMON VELEZ MORENO                 ",2,0,1130,1003,"02","04","CF33206",0,13542,2,null,20151001,20151231,0,0]
[null,"GUANAJUATO","11DPT0012W",120,"VIRS630902SUA","VIRS630902HMNLYL09  ","SALVADOR VILLANUEVA REYNOSO             ",2,0,1130,1003,"04","02","CF33206",0,14252,2,null,20151001,20151231,0,0]
[null,"GUANAJUATO","11DPT0008J",120,"VIVM841025NR4","VIVM841025MGTLRL07  ","MELINA VILLARREAL VARGAS                ",2,0,1130,1003,"02",33,"CF33206",0,13505,2,null,20151001,20151231,0,0]
[null,"GUANAJUATO","11DPT0006L",120,"YEGL891123ML2","YEGL891123MGTPRR08  ","LAURA VERONICA YEPEZ GARCIA             ",2,0,1130,1003,"01",63,"S01201",0,7712,2,null,20151001,20151231,0,0]
[null,"GUANAJUATO","11APT0001T",100,"ZAAF7902055E9","ZAAF790205HGTMLR09  ","FERNANDO ZAMARRIPA ALDAPE               ",2,0,1130,1003,"05",13,"CF33206",0,13250,2,null,20151001,20151231,0,0]
[null,"GUANAJUATO","11DPT0012W",120,"ZABS740117LZ8","ZABS740117MGRMLS00  ","SUSY ROCIO ZAMUDIO BALVUENA             ",2,0,1130,1003,"04","02","CF33204",0,2531,2,null,20151001,20151231,0,0]
[null,"GUANAJUATO","11DPT0012W",120,"ZABS850402N68","ZABS850402HGTMLR06  ","SERGIO LUIS ZAMUDIO BELTRAN             ",2,0,1130,1003,"04","02","CF04201",0,11168,2,null,20151001,20151231,0,0]
[null,"GUANAJUATO","11APT0001T",100,"ZAHE711130S69","ZAHE711130MDFMRR03  ","ERIKA DE LOS ANGE ZAMORA HERNANDEZ      ",2,0,1130,1003,"07","05","CF33206",0,13498,2,null,20151001,20151231,0,0]
[null,"GUANAJUATO","11DPT0001Q",120,"ZALC5604237Q2","ZALC560423HGTVPR01  ","CARLOS ZAVALA LOPEZ                     ",2,0,1130,1003,"00",28,"S01202",0,2534,2,null,20151001,20151231,0,0]
[null,"GUANAJUATO","11APT0001T",100,"ZALE620903MK9","ZALE620903HGTVND01  ","EDUARDO ZAVALA LEON                     ",2,0,1130,1003,"07","05","CF33204",0,11089,2,null,20151001,20151231,0,0]
[null,"GUANAJUATO","11DPT0013V",120,"ZERV770303SS4","ZERV770303MGTNCN07  ","MARIA  VANESSA ZENDEJAS ROCHA           ",2,0,1130,1003,"03","02","A01801",0,18878,2,null,20151001,20151231,0,0]
[null,"GUANAJUATO","11APT0001T",100,"ZERY820116NN8","ZERY820116MGTNCD08  ","YADIRA BERENICE ZENDEJAS ROCHA          ",2,0,1130,1003,"07","05","A01801",0,18846,2,null,20151001,20151231,0,0]
[null,"GUANAJUATO","11DPT0009I",120,"ZUGJ5210227C5","ZUGJ521022HGTXRV02  ","JAVIER ZUÑIGA GARCIA                    ",5,0,1130,1003,"01",74,"CF02103",0,12663,5,null,20151001,20151231,0,0]
[null,"GUANAJUATO","11DPT0003O",120,"AAVB660401UL2","AAVB660401MDFLVL01","BLANCA IVETTE ALVAREZ DEL CASTILLO VENTRE",3,15,1130,3102,"00",30,"PC",20,280002,3,null,20151001,20151231,0,0]
[null,"GUANAJUATO","11DPT0014U",100,"AOOC650822A32","AOOC650822MGTRJR02","MA CRISTINA ARROYO OJEDA",3,20,1130,3102,"03","03","PB",20,280005,3,null,20151001,20151231,0,0]
[null,"GUANAJUATO","11DPT0002P",100,"AOOS720925113","AOOS720925MGTBRN08","SANDRA ABOYTES OROZCO",3,10,1130,3102,"00",29,"PB",24,28001,3,null,20151001,20151231,0,0]
[null,"GUANAJUATO","11DPT0010Y",120,"BOSC820326R12","BOSC820326HGTLRR09","CARLOS MARTIN BOLAÑOS SERVIN",3,30,1130,3102,"02","04","PA",20,280008,3,null,20151001,20151231,0,0]
[null,"GUANAJUATO","11DPT0010Y",100,"CAAL690628AM6","CAAL690628MGTRLT08","MARIA LETICIA CARDENAS ALMANZA",3,12,1130,3102,"02","04","PA",20,280009,3,null,20151001,20151231,0,0]
[null,"GUANAJUATO","11DPT0003O",120,"CABD840721MI3","CABD840721HGTSNN09","DANIEL CASIQUE BUENAVISTA",3,17,1130,3102,"00",30,"PB",15,28059,3,null,20151001,20151231,0,0]
[null,"GUANAJUATO","11DPT0002P",120,"CAEL691012SG8","CAEL691012MDFRST01","LETICIA CARMONA  ESPINOSA ",3,14,1130,3102,"00",29,"PA",20,28096,3,null,20151001,20151231,0,0]
[null,"GUANAJUATO","11DPT0010Y",100,"CALF930503GQ7","CALF930503HGTMPR00","FRANCISCO JAVIER CAMACHO LOPEZ",3,12,1130,3102,"02","04","TA",17,280189,3,null,20151001,20151231,0,0]
[null,"GUANAJUATO","11DPT0011X",100,"CAOL581027513","CAOL581027HGTMLS01","JOSE LUIS CAMPOS OLALDE",3,8,1130,3102,"02",49,"PB",25,280179,3,null,20151001,20151231,0,0]
[null,"GUANAJUATO","11DPT0012W",120,"CAPJ680119DJ7","CAPJ680119HGTZTN01","J. ANDRES CAZARES PATIÑO",3,12,1130,3102,"04","02","TA",17,280011,3,null,20151001,20151231,0,0]
[null,"GUANAJUATO","11DPT0008J",120,"CARJ7608215KA","CARJ760821HTLRDN05","JOSE JUAN CARRILLO RODRIGUEZ",3,20,1130,3102,"02",33,"PA",15,280160,3,null,20151001,20151231,0,0]
[null,"GUANAJUATO","11DPT0005M",120,"CARL560630141","CARL560630HGTSVS09","JOSE LUIS CASTRO RIVAS",3,20,1130,3102,"00",72,"PB",20,280010,3,null,20151001,20151231,0,0]
[null,"GUANAJUATO","11DPT0005M",120,"CAVA820322S74","CAVA820322HDFHRB06","ABRAHAM CHAVEZ VARELA",3,24,1130,3102,"00",72,"PB",17,280013,3,null,20151001,20151231,0,0]
[null,"GUANAJUATO","11DPT0005M",120,"CEGE7106304G8","CEGE710630MGTBML09","MA ELIZABETH CEBALLOS GOMEZ",3,24,1130,3102,"00",72,"PB",20,280012,3,null,20151001,20151231,0,0]
[null,"GUANAJUATO","11DPT0010Y",120,"CIGM510313HX4","CIGM510313HVZSRG08","MIGUEL ANGEL CISNEROS GARCIA",3,20,1130,3102,"02","04","PA",23,280014,3,null,20151001,20151231,0,0]
[null,"GUANAJUATO","11DPT0003O",120,"COMM610831NKA","COMM610831HDFRRG06","MIGUEL CORTES MORALES",3,17,1130,3102,"00",30,"PB",23,280014,3,null,20151001,20151231,0,0]
[null,"GUANAJUATO","11DPT0003O",120,"COVE740314GR2","COVE740314HGTRZN07","ENRIQUE CORTEZ VAZQUEZ",3,25,1130,3102,"00",30,"PC",16,280132,3,null,20151001,20151231,0,0]
[null,"GUANAJUATO","11DPT0005M",120,"DEPT800907TBA","DEPT800907MGTRDR04","MARIA TERESA DERRAMADERO PADILLA",3,23,1130,3102,"00",72,"PC",20,280017,3,null,20151001,20151231,0,0]
[null,"GUANAJUATO","11DPT0011X",100,"EICS7010205K2","EICS701020MMNNRR06","SERAFINA ENRIQUEZ CORDOVA",3,8,1130,3102,"02",49,"PB",20,280019,3,null,20151001,20151231,0,0]
[null,"GUANAJUATO","11DPT0003O",120,"FEHE800724TQ5","FEHE800724HGTRRD06","EDUARDO FERNANDEZ HERNANDEZ",3,21,1130,3102,"00",30,"PC",12,280180,3,null,20151001,20151231,0,0]
[null,"GUANAJUATO","11DPT0003O",120,"GODA691116ALA","GODA691116HDFMZL07","ALEJANDRO GOMEZ DIAZ",3,18,1130,3102,"00",30,"PA",20,280029,3,null,20151001,20151231,0,0]
[null,"GUANAJUATO","11DPT0003O",120,"GOGJ710330Q32","GOGJ710330HDFMMN08","JUAN MANUEL GOMEZ GOMEZ",3,25,1130,3102,"00",30,"PB",25,280190,3,null,20151001,20151231,0,0]
[null,"GUANAJUATO","11DPT0006L",100,"GOLG8308137R7","GOLG830813HSPNPB08","GABRIEL HUMBERTO GONZALEZ LOPEZ",3,16,1130,3102,"01",63,"PC",23,280031,3,null,20151001,20151231,0,0]
[null,"GUANAJUATO","11DPT0005M",120,"GOPE721215MA1","GOPE721215HGTNSD00","EDISON OSWALDO GONZALEZ PESCADOR",3,25,1130,3102,"00",72,"PB",20,280032,3,null,20151001,20151231,0,0]
[null,"GUANAJUATO","11DPT0003O",120,"GUCA621009A88","GUCA621009MGTTHR00","ARACELI GUTIERREZ CHACON",3,21,1130,3102,"00",30,"PA",20,280037,3,null,20151001,20151231,0,0]
[null,"GUANAJUATO","11DPT0002P",100,"GUCM630109EJ1","GUCM630109MGTTSR00","MARIA MARTINA MARGARITA GUTIERREZ CASTRO",3,24,1130,3102,"00",29,"PC",25,280036,3,null,20151001,20151231,0,0]
[null,"GUANAJUATO","11DPT0007K",120,"GUJE600723CI3","GUJE600723HGTZMR03","ERNESTO GUZMAN JIMENEZ",3,16,1130,3102,"02","03","PB",25,280038,3,null,20151001,20151231,0,0]
[null,"GUANAJUATO","11DPT0008J",120,"GULA760327G74","GULA760327MCSLPN05","ANA CELIA GUILLEN LOPEZ",3,18,1130,3102,"02",33,"PB",21,280035,3,null,20151001,20151231,0,0]
[null,"GUANAJUATO","11DPT0007K",120,"HEAM501110PP1","HEAM501110MDFRRN05","MINERVA HERNANDEZ ARMENDARIZ",3,14,1130,3102,"02","03","PC",18,280027,3,null,20151001,20151231,0,0]
[null,"GUANAJUATO","11DPT0003O",120,"JIEC831030A73","JIEC831030MGTMSR07","MARIA CRISTHIAN JIMENEZ ESQUEDA",3,15,1130,3102,"00",30,"PB",16,280156,3,null,20151001,20151231,0,0]
[null,"GUANAJUATO","11DPT0003O",120,"JISS660630UT8","JISS660630HGTMNR01","SERGIO JIMENEZ SANCHEZ",3,20,1130,3102,"00",30,"PB",21,280042,3,null,20151001,20151231,0,0]
[null,"GUANAJUATO","11DPT0010Y",100,"LOBA7910123P2","LOBA791012HJCPRL00","ALEJANDRO LOPEZ BRIONES",3,15,1710,3102,"02","04","PB",15,280045,3,null,20151001,20151231,0,0]
[null,"GUANAJUATO","11DPT0003O",120,"LOGJ711211E25","LOGJ711211HGTMVN07","JUAN LOMAS GUEVARA",3,20,1130,3102,"00",30,"PB",15,280098,3,null,20151001,20151231,0,0]
[null,"GUANAJUATO","11DPT0003O",120,"LOJR7312299QW","LOJR731229HGTPRC05","RICARDO LOPEZ JUAREZ",3,20,1130,3102,"00",30,"TA",25,280140,3,null,20151001,20151231,0,0]
[null,"GUANAJUATO","11DPT0010Y",120,"MACM811125AAA","MACM811125MGTSRR00","MARLENE SELENE MASCOTTE CRUZ",3,20,1130,3102,"02","04","PA",12,280115,3,null,20151001,20151231,0,0]
[null,"GUANAJUATO","11DPT0012W",120,"MAMA711017CPA","MAMA711017HGTRNR02","ARTURO MARTINEZ MONCADA",3,20,1130,3102,"04","02","PA",24,280051,3,null,20151001,20151231,0,0]
[null,"GUANAJUATO","11DPT0007K",120,"MAMA770820UT0","MAMA770820MGTRRN06","ANA LILIA MARTINEZ MARTINEZ",3,15,1130,3102,"02","03","PA",20,280050,3,null,20151001,20151231,0,0]
[null,"GUANAJUATO","11DPT0006L",100,"MASJ651012DZ4","MASJ651012HVZRNN09","JUAN CARLOS MARTINEZ SANTOS",3,15,1130,3102,"01",63,"PB",20,280053,3,null,20151001,20151231,0,0]
[null,"GUANAJUATO","11DPT0005M",120,"MEHE811224IH7","MEHE811224HGTNRM08","EMMANUEL MENDOZA HERNANDEZ",3,24,1130,3102,"01",72,"PB",15,280148,3,null,20151001,20151231,0,0]
[null,"GUANAJUATO","11DPT0003O",120,"MEMC880817J34","MEMC880817MDFDRL00","CLAUDIA CONCEPCION MEDINA MARIN",3,20,1130,3102,"01",30,"PA",16,280142,3,null,20151001,20151231,0,0]
[null,"GUANAJUATO","11DPT0010Y",100,"MEOS540912EG6","MEOS540912HDFDCL09","SALVADOR MEDINA OCAÑA",3,15,1130,3102,"01","04","PA",15,280176,3,null,20151001,20151231,0,0]
[null,"GUANAJUATO","11DPT0009I",100,"MOHD5903208E0","MOHD590320HMCCRL05","JOSE DOLORES GUADALUPE MOCTEZUMA HERNANDEZ",3,18,1130,3102,"01",74,"TA",25,280054,3,null,20151001,20151231,0,0]
[null,"GUANAJUATO","11DPT0012W",120,"MOPL8106219G5","MOPL810621MGTRLD07","LIDIA MORENO PALOALTO",3,12,1130,3102,"01","02","TA",24,280055,3,null,20151001,20151231,0,0]
[null,"GUANAJUATO","11DPT0003O",120,"NUHG820619JC1","NUHG820619MGTXRR08","GRACIELA GUADALUPE NUÑEZ HERNANDEZ",3,8,1130,3102,"01",30,"PB",25,280146,3,null,20151001,20151231,0,0]
[null,"GUANAJUATO","11DPT0007K",120,"OIBM740215HY9","OIBM740215MGTRRR07","MIRIAM ORTIZ BARROSO",3,20,1130,3102,"01","03","PA",20,280059,3,null,20151001,20151231,0,0]
[null,"GUANAJUATO","11DPT0009I",100,"PAGJ820614HB3","PAGJ820614MGTLRN07","JUANA ADRIANA PALOALTO GARCIA",3,15,1130,3102,"01",74,"PB",20,280061,3,null,20151001,20151231,0,0]
[null,"GUANAJUATO","11DPT0003O",120,"PEGR811217KS9","PEGR811217HGTRRC00","RICARDO PEREZ GARCIA",3,30,1130,3102,"01",30,"PB",18,280062,3,null,20151001,20151231,0,0]
[null,"GUANAJUATO","11DPT0007K",120,"PIZM740723DV9","PIZM740723MGTZMR06","MIRYAM PIZANO ZAMORA",3,21,1130,3102,"01","03","PC",15,280147,3,null,20151001,20151231,0,0]
[null,"GUANAJUATO","11DPT0007K",120,"RAGL820420UF7","RAGL820420MGTMMR03","LOURDES MIRELLA RAMOS GOMEZ",3,14,1130,3102,"01","03","PC",20,280067,3,null,20151001,20151231,0,0]
[null,"GUANAJUATO","11DPT0007K",120,"RAGM860115N6A","RAGM860115HGTMRR00","MAURO RAMIREZ GARCIA",3,16,1130,3102,"01","03","PC",20,280063,3,null,20151001,20151231,0,0]
[null,"GUANAJUATO","11DPT0012W",120,"RALG600418P69","RALG600418MGTMPD09","MARIA GUADALUPE RAMOS LOPEZ",3,19,1130,3102,"01","02","TA",20,280068,3,null,20151001,20151231,0,0]
[null,"GUANAJUATO","11DPT0007K",120,"RECT770406EE9","RECT770406MMNNHR04","TERESITA DEL NIÑO JESUS RENTERIA CHAVEZ",3,24,1130,3102,"01","03","PC",20,280069,3,null,20151001,20151231,0,0]
[null,"GUANAJUATO","11DPT0003O",120,"RICM661008713","RICM661008MGTSSR09","MARIBEL RIOS CASTRO",3,25,1130,3102,"01",30,"TA",25,280070,3,null,20151001,20151231,0,0]
[null,"GUANAJUATO","11DPT0007K",120,"ROBI8212203L0","ROBI821220MDFDCT00","ITZEL RODRIGUEZ BECERRA",3,29,1130,3102,"01","03","PC",20,280134,3,null,20151001,20151231,0,0]
[null,"GUANAJUATO","11DPT0002P",120,"ROCJ841011870","ROCJ841011MDFDSS04","MARIA DE JESUS RODRIGUEZ CASTRO",3,11,1130,3102,"01",29,"TA",15,280162,3,null,20151001,20151231,0,0]
[null,"GUANAJUATO","11DPT0007K",120,"RONB7703042K6","RONB770304MGTDTT07","BEATRIZ RODRIGUEZ NIETO",3,21,1130,3102,"01","03","PC",10,280072,3,null,20151001,20151231,0,0]
[null,"GUANAJUATO","11DPT0002P",100,"ROSC730321AY9","ROSC730321HGTSLR07","JOSE CRUZ ROSALES SOLARZANO",3,19,1130,3102,"01",29,"PB",20,280076,3,null,20151001,20151231,0,0]
[null,"GUANAJUATO","11DPT0006L",100,"ROVD750821HSA","ROVD750821MMNCLM06","DAMARY BERENICE ROCHA VILLAGOMEZ",3,15,1130,3102,"01",63,"PA",19,280111,3,null,20151001,20151231,0,0]
[null,"GUANAJUATO","11DPT0007K",120,"SACJ630711ERA","SACJ630711MGTNRN08","JUANA PATRICIA SANCHEZ CORNEJO",3,12,1130,3102,"01","03","PC",25,280077,3,null,20151001,20151231,0,0]
[null,"GUANAJUATO","11DPT0004N",100,"SAGB671230SK2","SAGB671230MGTNLR00","BLANCA ELBA SANCHEZ GARCIA",3,15,1130,3102,"01",28,"PB",20,280078,3,null,20151001,20151231,0,0]
[null,"GUANAJUATO","11DPT0008J",120,"SAGM870320FE0","SAGM870320MGTNNR07","MIRIAM LETICIA SANCHEZ GONZALEZ",3,16,1130,3102,"01",33,"PC",14,280079,3,null,20151001,20151231,0,0]
[null,"GUANAJUATO","11DPT0012W",120,"SAJR580415PN8","SAJR580415HGTNMY05","RAYMUNDO SANTOYO JIMENEZ",3,15,1130,3102,"01","02","TA",21,280081,3,null,20151001,20151231,0,0]
[null,"GUANAJUATO","11DPT0008J",120,"SOAC781204EF3","SOAC781204HGTLLR00","CARLOS SOLIS ALCALA",3,25,1130,3102,"01",33,"PA",9,280083,3,null,20151001,20151231,0,0]
[null,"GUANAJUATO","11DPT0010Y",100,"TAFE821210JV8","TAFE821210MMNPLL03","ELIDA TAPIA FLORES",3,22,1710,3102,"01","04","PB",25,280135,3,null,20151001,20151231,0,0]
[null,"GUANAJUATO","11DPT0007K",120,"TOOL570825A45","TOOL570825HOCRRS04","LUIS FIDEL TORRES ORDAZ",3,16,1130,3102,"01","03","PC",24,280084,3,null,20151001,20151231,0,0]
[null,"GUANAJUATO","11DPT0003O",120,"TUMJ870625262","TUMJ870625HGTLLF00","JAFET GASSEN TULA MALDONADO",3,9,1130,3102,"01",30,"PB",22,280136,3,null,20151001,20151231,0,0]
[null,"GUANAJUATO","11DPT0006L",100,"VEGC620316675","VEGC620316MJCLTR03","CRISTINA VELAZCO GUTIERREZ",3,20,1130,3102,"01",63,"PB",25,280086,3,null,20151001,20151231,0,0]
[null,"GUANAJUATO","11DPT0006L",100,"VIRE830228NR9","VIRE830228HGTLDD01","EDUARDO VILLAFAÑA RODRIGUEZ",3,20,1130,3102,"01",63,"PA",20,280088,3,null,20151001,20151231,0,0]
[null,"GUANAJUATO","11DPT0010Y",120,"ZAVJ481005MS5","ZAVJ481005HGTVLS09","JOSE DE JESUS ZAVALA VILLAGOMEZ",3,12,1130,3102,"01","04","TA",20,280166,3,null,20151001,20151231,0,0]
[null,"GUANAJUATO","11DPT0003O",120,"AAGC731126M29","AAGC731126HDFLNN07","CONRRADO ARTURO ALVAREZ GONZALEZ",3,20,1130,3102,"01",30,"TA",10,290005,3,null,20151001,20151231,0,0]
[null,"GUANAJUATO","11DPT0003O",120,"AUCL821209DC6","AUCL821209MVZRRT05","LETICIA CAROLINA ARGUELLES CRUZ",3,20,1130,3102,"01",30,"PB",14,290094,3,null,20151001,20151231,0,0]
[null,"GUANAJUATO","11DPT0003O",120,"CAEL721019IZ9","CAEL721019MGTSLL08","LILIA ISELA CASTILLO ELIZARRARAZ",3,25,1130,3102,"01",30,"PB",25,290009,3,null,20151001,20151231,0,0]
[null,"GUANAJUATO","11DPT0007K",120,"CAHJ750812FB7","CAHJ750812HGTHRR09","JORGE ALEJANDRO CHAGOYA HERNANDEZ",3,17,1130,3102,"01","03","PB",10,290012,3,null,20151001,20151231,0,0]
[null,"GUANAJUATO","11DPT0007K",120,"CAMH790325MK6","CAMH790325HGTSSC09","HECTOR CASTRO MOSQUEDA",3,15,1130,3102,"01","03","PC",12,290010,3,null,20151001,20151231,0,0]
[null,"GUANAJUATO","11DPT0004N",100,"CILG720124JZ9","CILG720124MGTSPD05","MA GUADALUPE CISNEROS LOPEZ",3,15,1130,3102,"01",28,"PB",25,290015,3,null,20151001,20151231,0,0]
[null,"GUANAJUATO","11DPT0003O",120,"COAA820127CJ8","COAA820127MGTRYN00","ANA ERICKA CORRALES AYALA",3,18,1130,3102,"01",30,"PB",15,290016,3,null,20151001,20151231,0,0]
[null,"GUANAJUATO","11DPT0003O",120,"COCF790524RG5","COCJ790524HGTNRR07","FRANCISCO JAVIER CONTRERAS CERVANTES",3,20,1130,3102,"01",30,"PC",16,290073,3,null,20151001,20151231,0,0]
[null,"GUANAJUATO","11DPT0004N",120,"COCJ790301RG5","COCJ790301HGTRRN06","JOSE JUAN CORRALES CORONA",3,15,1130,3102,"01",28,"PB",16,290017,3,null,20151001,20151231,0,0]
[null,"GUANAJUATO","11DPT0006L",100,"COMS721010P5A","COMS721010MGTRSL09","SILVIA CORDOBA  MOSQUEDA",3,14,1130,3102,"01",63,"PC",20,290074,3,null,20151001,20151231,0,0]
[null,"GUANAJUATO","11DPT0004N",100,"CUTP650130E94","CUTP650130HGTRRB03","PABLO CRUZ TORRES",3,8,1130,3102,"01",28,"PB",15,290019,3,null,20151001,20151231,0,0]
[null,"GUANAJUATO","11DPT0007K",120,"DARE870421E95","DARE870421MGTMDD0","EDUARDINA ESAIG DAMIAN  RODRIGUEZ",3,24,1130,3102,"01","03","PC",24,290119,3,null,20151001,20151231,0,0]
[null,"GUANAJUATO","11DPT0003O",120,"DEBY851217D4A","DEBJ851217MGTLLS09","JUSELY GUADALUPE DELGADO BELTRAN",3,25,1130,3102,"01",30,"TA",20,290139,3,null,20151001,20151231,0,0]
[null,"GUANAJUATO","11DPT0008J",120,"DICI670401TA1","DICI670401MGTZMR00","IRENE DIAZ CAMPOS",3,17,1130,3102,"01",33,"PA",20,290021,3,null,20151001,20151231,0,0]
[null,"GUANAJUATO","11DPT0011X",100,"DIJT521003PE9","DIJT521003MVZZCR03","MARIA TERESITA DIAZ JACOME",3,6,1130,3102,"01",49,"PC",24,290023,3,null,20151001,20151231,0,0]
[null,"GUANAJUATO","11DPT0006L",100,"DOMN670802UR9","DOMN670802MGTMNT03","NATALIA DE LOS ANGELES DOMINGUEZ MANZANO",3,20,1130,3102,"01",63,"PB",28,290024,3,null,20151001,20151231,0,0]
[null,"GUANAJUATO","11DPT0011X",100,"EIVG610404DLA","EIVG610404HDFLLR08","JORGE ALBERTO ELIZARRARAS VILLALPANDO",3,15,1130,3102,"01",49,"PA",19,290025,3,null,20151001,20151231,0,0]
[null,"GUANAJUATO","11DPT0001Q",100,"EIVJ6412112B7","EIVJ641211HGTLLN00","JUAN CARLOS ELIZARRARAZ VILLALPANDO",3,12,1130,3102,"01",28,"PB",17,290026,3,null,20151001,20151231,0,0]
[null,"GUANAJUATO","11DPT0006L",100,"EUGC810902JNA","EUGC810902HGTSZS09","CESAR JAVIER ESQUIVEL GUZMAN",3,15,1130,3102,"01",63,"PA",20,290027,3,null,20151001,20151231,0,0]
[null,"GUANAJUATO","11DPT0002P",120,"EUQJ600614JNA","EUQJ600614HDFSRN05","JUAN MIGUEL ESQUIVEL QUIROZ",3,25,1130,3102,"01",29,"PB",15,290028,3,null,20151001,20151231,0,0]
[null,"GUANAJUATO","11DPT0011X",100,"EURT6610036LA","EURT661003MMNSYR05","TERESA ESQUIVEL REYES",3,12,1130,3102,"01",49,"PB",21,290178,3,null,20151001,20151231,0,0]
[null,"GUANAJUATO","11DPT0007K",120,"FAAJ620222E7A","FAAJ620222HGTRRS08","JOSE FRANCO ARREDONDO",3,21,1130,3102,"01","03","PC",25,290031,3,null,20151001,20151231,0,0]
[null,"GUANAJUATO","11DPT0004N",100,"GAMM750120RB8","GANN750120MGTRSR08","MARTHA ELBA GARCIA MOSQUEDA",3,15,1130,3102,"01",28,"PB",25,290032,3,null,20151001,20151231,0,0]
[null,"GUANAJUATO","11DPT0007K",120,"GAVJ660521UR1","GAVJ660521HGTRGN08","JUAN CARLOS GARCIA VEGA",3,23,1130,3102,"01","03","PC",16,29015,3,null,20151001,20151231,0,0]
[null,"GUANAJUATO","11DPT0007K",120,"GULG780404F75","GULG780404HGTRGR06","JORGE GUADALUPE GUERRERO LAGUNA",3,16,1130,3102,"01","03","PC",12,290035,3,null,20151001,20151231,0,0]
[null,"GUANAJUATO","11DPT0003O",120,"GUPG670506661","GUPG670506HGTTLS06","GUSTAVO GUTIERREZ PELAGIO",3,21,1130,3102,"01",30,"PA",20,290037,3,null,20151001,20151231,0,0]
[null,"GUANAJUATO","11DPT0006L",100,"HERA4412086H0","HERA441208HGTRSL07","ALFREDO HERRERA ROSALES",3,15,1130,3102,"01",63,"PA",8,290042,3,null,20151001,20151231,0,0]
[null,"GUANAJUATO","11DPT0011X",100,"HERG630310IB0","HERG630310MGTRMB03","MARIA GABRIELA SUSANA HERRERA ZUBIETA ROMERO",3,15,1130,3102,"01",49,"PA",30,290043,3,null,20151001,20151231,0,0]
[null,"GUANAJUATO","11DPT0007K",120,"MAPP7311016D0","MAPP731101MJCRRR02","PERLA ANDREA MARTINEZ PEREZ",3,20,1130,3102,"01","03","PB",15,290050,3,null,20151001,20151231,0,0]
[null,"GUANAJUATO","11DPT0004N",100,"MASS590809U18","MASS590809HGTRTL08","SALVADOR MARTINEZ SOTO",3,15,1130,3102,"01",28,"PA",20,290052,3,null,20151001,20151231,0,0]
[null,"GUANAJUATO","11DPT0003O",120,"MATM690314EG4","MATM690314MGTRRT12","MATILDE MARTINEZ TORRES",3,28,1130,3102,"01",30,"TA",19,290053,3,null,20151001,20151231,0,0]
[null,"GUANAJUATO","11DPT0007K",120,"OASF640805DW4","OASF640805HGTCTR00","FRANCISCO JAVIER OCAMPO SOTO",3,20,1130,3102,"01","03","PA",10,290057,3,null,20151001,20151231,0,0]
[null,"GUANAJUATO","11DPT0007K",120,"OIGE810723LS4","OIGE810723MVZRRD02","EDITH ORTIZ GARCIA",3,10,1130,3102,"01","03","PC",20,290089,3,null,20151001,20151231,0,0]
[null,"GUANAJUATO","11DPT0003O",120,"OIZG5306099RR","OIZG530609HGTRFL01","GUILLERMO ORTIZ ZAFRA",3,20,1130,3102,"01",30,"PA",28,290093,3,null,20151001,20151231,0,0]
[null,"GUANAJUATO","11DPT0010Y",100,"RISM640319LE9","RISM640319HGTCRR02","JOSE MARTIN RICO SERRITEÑO",3,30,1710,3102,"01","04","PC",15,290061,3,null,20151001,20151231,0,0]
[null,"GUANAJUATO","11DPT0006L",100,"SAGM820626E90","SAGR820626MGTNNS28","MA DEL ROSARIO SANCHEZ GONZALEZ",3,15,1130,3102,"01",63,"PB",20,290125,3,null,20151001,20151231,0,0]
[null,"GUANAJUATO","11DPT0007K",120,"SALP780917IZ3","SALP780917HGTNRD04","PEDRO JESUS SANTIAGO LARA",3,8,1130,3102,"01","03","PC",25,290156,3,null,20151001,20151231,0,0]
[null,"GUANAJUATO","11DPT0003O",120,"VAGN761014IF8","VAGN761014MGTLVD09","NADIA VALLEJO GUEVARA",3,11,1130,3102,"01",30,"PB",20,290069,3,null,20151001,20151231,0,0]
[null,"GUANAJUATO","11DPT0003O",120,"AABJ690919DQ5","AABJ690919MQTYRN07","JUANA ALMA DELIA AYALA BARRERA",3,22,1130,3102,"01",30,"PC",24,28,3,null,20151001,20151231,0,0]
[null,"GUANAJUATO","11DPT0007K",120,"AABR750608IB4","AABR750608MGTYRS01","ROSA MARGARITA AYALA BARRERA",3,25,1130,3102,"01","03","PB",15,28,3,null,20151001,20151231,0,0]
[null,"GUANAJUATO","11DPT0010Y",100,"AEGD640414KLA","AAPJ880904HGTRTN01","JUAN MIGUEL ARANDA PATLAN",3,8,1710,3102,"01","04","PC",25,28,3,null,20151001,20151231,0,0]
[null,"GUANAJUATO","11DPT0002P",120,"AORS650107KK2","AORS650107MGTRML00","MA SOLEDAD ARROYO RAMIREZ",3,10,1130,3102,"01",29,"PC",17,28,3,null,20151001,20151231,0,0]
[null,"GUANAJUATO","11DPT0007K",120,"BAFL750321MR1","BAFL730321HGTRLS09","LUIS EDUARDO BARRERA FLORES",3,14,1130,3102,"01","03","PC",20,28,3,null,20151001,20151231,0,0]
[null,"GUANAJUATO","11DPT0007K",120,"BEMG7505027F8","BEMG750502HGTTNR02","GERMAN BETANCOURT MENDEZ",3,24,1130,3102,"01","03","PB",17,28,3,null,20151001,20151231,0,0]
[null,"GUANAJUATO","11DPT0004N",100,"BORA580910H59","BORA580910MGTNVN06","MA. DE LOS ANGELES BONILLA RIVERA",3,15,1130,3102,"01",28,"PB",25,28,3,null,20151001,20151231,0,0]
[null,"GUANAJUATO","11DPT0005M",120,"CAMA720409D58","CAMA720409HGTMRN04","JOSE ANTONIO CAMPOS MORENO",3,24,1130,3102,"01",72,"PA",20,28,3,null,20151001,20151231,0,0]
[null,"GUANAJUATO","11DPT0011X",100,"CARI751102000","CARI751102HGTSDV01","IVAN ALEJANDRO CASTAÑEDA RODRIGUEZ",3,14,1130,3102,"01",49,"PC",20,28,3,null,20151001,20151231,0,0]
[null,"GUANAJUATO","11DPT0006L",100,"CAVM6302079D4","CAVM630207MDFLLR04","MARIANA FEDERICA CALDERON VILLALOBOS",3,29,1130,3102,"01",63,"PB",21,28,3,null,20151001,20151231,0,0]
[null,"GUANAJUATO","11DPT0003O",120,"COHV730429DPA","COHV730429MGTRDR01","VIRGINIA FABIOLA CORNEJO HIDALGO",3,10,1130,3102,"01",30,"PB",25,28,3,null,20151001,20151231,0,0]
[null,"GUANAJUATO","11DPT0003O",120,"CURP6903018I5","CURP690301MGTRYT08","PATRICIA DE LA CRUZ REYES",3,26,1130,3102,"01",30,"PC",11,28,3,null,20151001,20151231,0,0]
[null,"GUANAJUATO","11DPT0006L",100,"DAZM801018IR0","DAZM801018MGTVMR04","MIRIAM TERESA DÁVALOS ZAMORA",3,21,1130,3102,"01",63,"PA",21,28,3,null,20151001,20151231,0,0]
[null,"GUANAJUATO","11DPT0004N",100,"FABV830514ES9","FABV830514HGTRLC04","VICTOR ESTEBAN FRAUSTO BOLIO",3,13,1130,3102,"01",28,"PB",20,28,3,null,20151001,20151231,0,0]
[null,"GUANAJUATO","11DPT0009I",100,"FUBM760807455","FUBM760807MGTNRN06","MONICA GUADALUPE FUENTES BARRON",3,19,1130,3102,"01",74,"TA",25,28,3,null,20151001,20151231,0,0]
[null,"GUANAJUATO","11DPT0012W",120,"GAGE660725EF1","GAGE660725MGTYNG09","MA. EUGENIA GAYTAN GONZALEZ",3,20,1130,3102,"01","02","PA",15,28,3,null,20151001,20151231,0,0]
[null,"GUANAJUATO","11DPT0011X",100,"GALR880422QE7","GALR880422HGTRPG08","ROGELIO GARCIA LOPEZ",3,15,1130,3102,"01",49,"PB",20,28,3,null,20151001,20151231,0,0]
[null,"GUANAJUATO","11DPT0012W",100,"GIPE8705187T7","GIPE870718MGTRDR06","ERIKA ELIZABETH GRIMALDO PADILLA",3,30,1130,3102,"01","02","PC",20,28,3,null,20151001,20151231,0,0]
[null,"GUANAJUATO","11DPT0010Y",100,"GONS740424640","GONS740424MGTNXS08","SUSANA MAGNOLIA GONZALEZ NU?Z",3,15,1130,3102,"01","04","PC",30,28,3,null,20151001,20151231,0,0]
[null,"GUANAJUATO","11DPT0003O",120,"HEAA581022HVA","HEAA581022HMCRTL07","JOSE ALBERTO HERRERA ATILANO",3,21,1130,3102,"01",30,"PC",26,28,3,null,20151001,20151231,0,0]
[null,"GUANAJUATO","11DPT0010Y",120,"IUMM800617VC2","IUMM800617MGTSRY06","MYRNA DENISSE ISUSQUIZA MARTÍNEZ",3,18,1130,3102,"01","04","PA",25,28,3,null,20151001,20151231,0,0]
[null,"GUANAJUATO","11DPT0006L",100,"LAGG811206L76","LAGG811206MGTRND04","MARIA GUADALUPE LARA GONZALEZ",3,20,1130,3102,"01",63,"PB",25,28,3,null,20151001,20151231,0,0]
[null,"GUANAJUATO","11DPT0011X",120,"LOGG700109MF1","LOGG700109MGTPRD02","MA. GUADALUPE LOPEZ GARCIA",3,20,1130,3102,"01",49,"PA",30,28,3,null,20151001,20151231,0,0]
[null,"GUANAJUATO","11DPT0003O",120,"LOSM721211630","LOSM721211MGTPRR02","MARCELA LOPEZ SORIA",3,15,120,3102,"01",30,"PA",25,28,3,null,20151001,20151231,0,0]
[null,"GUANAJUATO","11DPT0006L",120,"MAAJ840617R99","MAAJ840617HGTRLN05","JUAN GUILLERMO MARTIN DEL CAMPO ALMENDARIZ",3,18,1130,3102,"01",63,"PA",25,28,3,null,20151001,20151231,0,0]
[null,"GUANAJUATO","11DPT0010Y",100,"MESF820630A32","MESF820630HGTNLR02","FRANCISCO JAVIER MENDOZA SOLORZANO",3,12,1130,3102,"01","04","PA",28,28,3,null,20151001,20151231,0,0]
[null,"GUANAJUATO","11DPT0007K",120,"MOQR840307NN2","MOQR840307HGTRRC01","RICARDO MORALES QUIROZ",3,23,1130,3102,"01","03","PB",20,28,3,null,20151001,20151231,0,0]
[null,"GUANAJUATO","11DPT0014U",100,"MUCM5811195T2","MUCM580119HGTXMR09","JOSE MARIO MUÑOZ CAMPUSANO",3,18,1130,3102,"01","03","PB",10,28,3,null,20151001,20151231,0,0]
[null,"GUANAJUATO","11DPT0003O",120,"MUMJ581102LE9","MUMJ581102HGTXRM09","JAIME MUÑOZ MARTINEZ",3,17,1130,3102,"01",30,"PA",22,28,3,null,20151001,20151231,0,0]
[null,"GUANAJUATO","11DPT0009I",100,"NAJE70071623A","NAJE700716HGTVMN08","ENRIQUE NAVARRETE JIMENEZ",3,6,1130,3102,"01",74,"PB",20,28,3,null,20151001,20151231,0,0]
[null,"GUANAJUATO","11DPT0011X",100,"PAHF740428HK9","PAHF740428HGTDRR00","FRANCISCO JAVIER PADILLA HERNÁNDEZ",3,12,1130,3102,"01",49,"PB",20,28,3,null,20151001,20151231,0,0]
[null,"GUANAJUATO","11DPT0009I",100,"PARH580204E82","PARH580204HDFDYC09","HECTOR PADILLA REYES",3,15,1130,3102,"01",74,"PA",10,28,3,null,20151001,20151231,0,0]
[null,"GUANAJUATO","11DPT0003O",120,"PEJE510902DF6","PEJE510902HOCRRS08","ESTEBAN PEREZ JUAREZ",3,21,1130,3102,"01",30,"PC",20,28,3,null,20151001,20151231,0,0]
[null,"GUANAJUATO","11DPT0007K",120,"PUGH6104307WA","PUGH610430HMNRMC01","HECTOR GERARDO PURECO GOMEZ",3,16,1130,3102,"01","03","PC",29,28,3,null,20151001,20151231,0,0]
[null,"GUANAJUATO","11DPT0010Y",120,"RAGM730719C38","RAGM730719MGTNMG06","MIGUEL ANGEL RANGEL GAMIÑO",3,20,1130,3102,"01","04","PB",15,28,3,null,20151001,20151231,0,0]
[null,"GUANAJUATO","11DPT0007K",120,"RAPA580921FZ2","RAPA580921HGTMDR04","AURELIO RAMIREZ PADRON",3,19,1130,3102,"01","03","PA",20,28,3,null,20151001,20151231,0,0]
[null,"GUANAJUATO","11DPT0003O",120,"RIMM880823M49","RIMM880823HGTVDR03","MARCO ANTONIO RIVERA MEDINA",3,28,1130,3102,"01",30,"PB",20,28,3,null,20151001,20151231,0,0]
[null,"GUANAJUATO","11DPT0006L",100,"ROCU811126UY1","ROCU811126HGTMNR08","URIEL ROMO CONTRERAS",3,15,1130,3102,"01",63,"PA",26,28,3,null,20151001,20151231,0,0]
[null,"GUANAJUATO","11DPT0009I",100,"SAGJ781103MJ3","SAGJ781103HGTLRR06","JORGE ARMANDO SALAS GUARDADO",3,20,1130,3102,"01",74,"PA",20,28,3,null,20151001,20151231,0,0]
[null,"GUANAJUATO","11DPT0007K",120,"SAHL880928KE7","SAHL880928HGTNRS02","LUIS DAVID SANCHEZ HERNANDEZ",3,10,1130,3102,"01","03","PC",20,28,3,null,20151001,20151231,0,0]
[null,"GUANAJUATO","11DPT0007K",120,"VAPL6101037B8","VAPL610103HGTZRL05","SALVADOR EUGENIO VAZQUEZ PRECIADO",3,16,1130,3102,"01","03","PC",15,28,3,null,20151001,20151231,0,0]
[null,"GUANAJUATO","11DPT0004N",100,"VASR930322QX5","VASR930322HGTLGL04","RAUL VALDIVIA SEGOVIANO",3,17,1130,3102,"01",28,"PB",16,28,3,null,20151001,20151231,0,0]
[null,"GUANAJUATO","11DPT0011X",100,"VEHR8310237SA","VEHR831023HGTGRB01","ROBERTO VEGA HERNANDEZ",3,20,1130,3102,"01",49,"PB",17,28,3,null,20151001,20151231,0,0]
[null,"GUANAJUATO","11DPT0003O",120,"VEMJ891002000","VEMJ891002HGTLÑN02","JUAN MANUEL VELAZQUEZ MUÑOZ",3,20,1130,3102,"01",30,"PB",20,28,3,null,20151001,20151231,0,0]
[null,"GUANAJUATO","11DPT0003O",120,"VESE620331G87","VESE620331HGTRLF03","EFREN VERA SALGADO",3,20,1130,3102,"01",30,"PA",11,28,3,null,20151001,20151231,0,0]
[null,"GUANAJUATO","11DPT0006L",100,"AERA900121CW4","AERA900121MGTBDD04","ADNARA YESSICA ABREGO RODRIGUEZ",3,16,1130,3102,"01",63,"PB",25,128069,3,null,20151001,20151231,0,0]
[null,"GUANAJUATO","11DPT0006L",100,"AILE800526EB7","AILE800526MDFVPL03","MARIA ELENA AVILA LOPEZ",3,15,1130,3102,"01",63,"PA",10,128094,3,null,20151001,20151231,0,0]
[null,"GUANAJUATO","11DPT0011X",100,"CIOR7805171L4","CIOR780517HGTNRB00","ROBERTO CINTORA JR.",3,10,1130,3102,"01",49,"PC",10,128007,3,null,20151001,20151231,0,0]
[null,"GUANAJUATO","11DPT0011X",100,"CUGE880521IJ6","CUGE880521HGTSRR02","ERIK ALBERTO CUSTODIO GARCIA",3,15,1130,3102,"01",49,"PA",15,128061,3,null,20151001,20151231,0,0]
[null,"GUANAJUATO","11DPT0014U",100,"CUSJ550902DF1","CUSJ550902MGTRTN09","MARIA JANET CRUZ SOTO",3,28,1130,3102,"01","03","TA",12,128009,3,null,20151001,20151231,0,0]
[null,"GUANAJUATO","11DPT0004N",100,"DIEM790506MK2","DIEM790506MGTZSR04","MARTHA SOFIA DIAZ ESCUTIA",3,7,1130,3102,"01",28,"PB",15,128010,3,null,20151001,20151231,0,0]
[null,"GUANAJUATO","11DPT0014U",100,"EAMM710507IBA","EAMM710507MASSGR04","MARTHA PATRICIA ESTRADA MAGALLON",3,12,1130,3102,"01","03","PB",15,128012,3,null,20151001,20151231,0,0]
[null,"GUANAJUATO","11DPT0006L",100,"GAVJ851126FM4","GAVJ851126HGTRYV07","JAVIER GARCIA VIEYRA",3,10,1130,3102,"01",63,"PB",15,128015,3,null,20151001,20151231,0,0]
[null,"GUANAJUATO","11DPT0002P",100,"GUGG720101IA2","GUGG730101HGTTZN01","GONZALO GUTIERREZ GUZMAN",3,15,1130,3102,"01",29,"TA",15,128016,3,null,20151001,20151231,0,0]
[null,"GUANAJUATO","11DPT0010Y",120,"HEDA800812DP2","HEDA800812HGTTZD09","ADRIAN HERNANDEZ DIAZ",3,15,1130,3102,"01","04","PB",15,128017,3,null,20151001,20151231,0,0]
[null,"GUANAJUATO","11DPT0004N",100,"IAGM7302032F2","IAGM730203HGTBRB08","JAIME IBARRA GUERRERO",3,13,1130,3102,"01",28,"PB",20,128018,3,null,20151001,20151231,0,0]
[null,"GUANAJUATO","11DPT0012W",120,"IAQA850418A89","IAQA850418MGTBND07","ADRIANA IBARRA QUINTINO",3,26,1130,3102,"01","02","PC",8,128085,3,null,20151001,20151231,0,0]
[null,"GUANAJUATO","11DPT0010Y",100,"LOBL610801UA2","LOBL610801HGTPDS05","LUIS LOPEZ BEDOLLA",3,15,1130,3102,"01","04","PA",12,128019,3,null,20151001,20151231,0,0]
[null,"GUANAJUATO","11DPT0007K",120,"LOLB790114RE0","HERN811104MMNRJB02","NUBIA VANNESA HERNANDEZ ROJAS",3,23,1130,3102,"01","03","PC",25,128042,3,null,20151001,20151231,0,0]
[null,"GUANAJUATO","11DPT0004N",100,"LOOE660716UY7","LOOE660716HGTPJD01","EDUARDO LOPEZ OJEDA",3,16,1130,3102,"01",28,"PC",9,128021,3,null,20151001,20151231,0,0]
[null,"GUANAJUATO","11DPT0009I",100,"MAHS851214LA6","MAHS851214MGTRRN01","SANDRA MARTINEZ HERNANDEZ",3,15,1130,3102,"01",74,"PA",20,128050,3,null,20151001,20151231,0,0]
[null,"GUANAJUATO","11DPT0005M",120,"MATJ861103RG1","MATJ861103MGTRPZ09","JAZMIN MONSERRAT MARTINEZ TAPIA",3,20,1130,3102,"01",72,"PA",8,128073,3,null,20151001,20151231,0,0]
[null,"GUANAJUATO","11DPT0008J",120,"MELM880414RR6","MELM880414MGTNPR03","MARISOL MENDEZ LOPEZ",3,21,1130,3102,"01",33,"PC",15,128044,3,null,20151001,20151231,0,0]
[null,"GUANAJUATO","11DPT0003O",120,"MOZR701212DS9","MOZR701212HGTRVG09","RIGOBERTO MORENO ZAVALA",3,17,1130,3102,"01",30,"PA",15,128023,3,null,20151001,20151231,0,0]
[null,"GUANAJUATO","11DPT0010Y",120,"OOOC810927BA9","OOOC810927MGTRRL05","CLAUDIA KARINA OROZCO OROZCO",3,11,1130,3102,"01","04","PC",15,128024,3,null,20151001,20151231,0,0]
[null,"GUANAJUATO","11DPT0003O",120,"PEAA590708RJ5","PEAA590708HDFRLD08","JOSE ADRIAN ARTURO PEREZ ALVAREZ",3,11,1130,3102,"01",30,"PB",12,128026,3,null,20151001,20151231,0,0]
[null,"GUANAJUATO","11DPT0006L",100,"PEEJ780324IC1","PEEJ780324HMNRSN01","JUAN FERNANDO PEREZ ESPINO",3,15,1130,3102,"01",63,"PA",15,128027,3,null,20151001,20151231,0,0]
[null,"GUANAJUATO","11DPT0004N",100,"ROZS831101KUA","ROZS831101MMNSVN07","SANDRA ROSAS ZAVALA",3,15,1130,3102,"01",28,"PA",16,128081,3,null,20151001,20151231,0,0]
[null,"GUANAJUATO","11DPT0004N",100,"RUDJ780213NV6","RUDJ780213HGTZZN04","JUAN CARLOS RUIZ DIAZ",3,15,1130,3102,"01",28,"PB",17,128029,3,null,20151001,20151231,0,0]
[null,"GUANAJUATO","11DPT0005M",120,"SADF620323P95","SADF620323HDGNVD00","FIDEL SANCHEZ DAVILA",3,24,1130,3102,"01",72,"PB",12,128031,3,null,20151001,20151231,0,0]
[null,"GUANAJUATO","11DPT0004N",100,"SAVE451129SN8","SAVE451129HGTLRL03","ELIGIO SALGADO VARGAS",3,10,1130,3102,"01",28,"PB",7,128030,3,null,20151001,20151231,0,0]
[null,"GUANAJUATO","11DPT0013V",120,"SOGE770916E73","SOGE770916MDFLNL08","MARIA ELENA SOLIS GONZALEZ",3,21,1130,3102,"01","02","PA",16,128054,3,null,20151001,20151231,0,0]
[null,"GUANAJUATO","11DPT0003O",120,"SOGY851206464","SOGY851206MMNSZN01","YANETH SOSA GUZMÁN",3,20,1210,3102,"01",30,"PB",25,128046,3,null,20151001,20151231,0,0]
[null,"GUANAJUATO","11DPT0009I",100,"TITC671201BBA","TITC671201HMNNNR07","CRESCENCIANO TINOCO TINOCO",3,25,1130,3102,"01",74,"PB",17,128058,3,null,20151001,20151231,0,0]
[null,"GUANAJUATO","11DPT0010Y",120,"VIRD850905EA2","VIRD850905MGTLDY04","DEYSI VILLANUEVA RODRIGUEZ",3,22,1710,3102,"01","04","PB",15,128035,3,null,20151001,20151231,0,0]
[null,"GUANAJUATO","11DPT0009I",100,"ZAHR840210PN9","ZAHR840210HGTVRD05","RODOLFO ANTONIO ZAVALA HERNANDEZ",3,20,1130,3102,"01",74,"PA",10,128039,3,null,20151001,20151231,0,0]
[null,"GUANAJUATO","11DPT0004N",100,"ZAPJ830703848","ZAPJ830703HGTMRN07","JUAN MARCIAL ZAMUDIO PEREZ",3,13,1710,3102,"01",28,"PA",10,128037,3,null,20151001,20151231,0,0]
[null,"GUANAJUATO","11DPT0011X",100,"ZARC711228I59","ZARC711228HGTMMN02","JOSE CONCEPCION ZAMORA RAMIREZ",3,12,1130,3102,"01",49,"TA",13,128095,3,null,20151001,20151231,0,0]
[null,"GUANAJUATO","11DPT0011X",120,"AICF790308Q83","AICF790308HGTMLR01","FERNANDO AMBRIZ COLIN",3,25,1130,3102,"01",49,"PA",15,1130,3,null,20151001,20151231,0,0]
[null,"GUANAJUATO","11DPT0013V",120,"AOMR770309JR5","AOMR770309MGTCRS03","ROSAURA ACOSTA MORENO",3,17,1130,3102,"01","02","PB",34,1130,3,null,20151001,20151231,0,0]
[null,"GUANAJUATO","11DPT0003O",120,"AULG650807MX2","AULG650807MCLGPD08","MARIA GUADALUPE AGUILAR LOPEZ",3,20,1210,3102,"01",30,"PC",20,1130,3,null,20151001,20151231,0,0]
[null,"GUANAJUATO","11DPT0003O",120,"AUPC781109","AUPC781109HGTGNR07","CARLOS ALBERTO AGUILAR PANIAGUA",3,12,1130,3102,"01",30,"PA",28,1130,3,null,20151001,20151231,0,0]
[null,"GUANAJUATO","11DPT0007K",120,"AUPL770322NG0","AUPL770322MJCGNR05","LAURA ITZAMARAY AGUIRRE PUENTE",3,28,1710,3102,"01","03","PA",25,1130,3,null,20151001,20151231,0,0]
[null,"GUANAJUATO","11DPT0010Y",120,"BACL660127PY3","BACL660127HGTRNS02","JOSE LUIS BRAVO CANO",3,21,1710,3102,"01","04","PC",35,1130,3,null,20151001,20151231,0,0]
[null,"GUANAJUATO","11DPT0003O",120,"BAGG740408RC0","BAGG740408MGTZRB07","GABRIELA BAEZA GARCIA",3,10,1210,3102,"01",30,"PB",25,1130,3,null,20151001,20151231,0,0]
[null,"GUANAJUATO","11DPT0009I",100,"BAPA800509JH2","BAPA800509HDFRRL06","ALAN BAROJAS PEREZ",3,20,1130,3102,"01",74,"PB",30,1130,3,null,20151001,20151231,0,0]
[null,"GUANAJUATO","11DPT0007K",120,"CABA581007J13","CABA581007MMNRZN16","MARIA DE LOS ANGELES CARDENAS BAEZA",3,28,1710,3102,"01","03","PB",25,1130,3,null,20151001,20151231,0,0]
[null,"GUANAJUATO","11DPT0012W",120,"CABD570205P26","CABD570205MMNRZL00","MARIA DE LOS DOLORES CARDENAS BAEZA",3,20,1130,3102,"01","02","TA",20,1130,3,null,20151001,20151231,0,0]
[null,"GUANAJUATO","11DPT0003O",120,"CACR540413CR4","CACR540413HBCSSL00","RAUL CASTAÑEDA CASTRO",3,25,1210,3102,"01",30,"PA",24,1130,3,null,20151001,20151231,0,0]
[null,"GUANAJUATO","11DPT0010Y",100,"CAGG711124NT7","CAGG711124MGTRTD19","MARIA GUADALUPE CARDENAS GUTIERREZ",3,20,1710,3102,"01","04","PB",24,1130,3,null,20151001,20151231,0,0]
[null,"GUANAJUATO","11DPT0007K",120,"CUGV730427G51","CUGV730427HGTLMC00","VICTOR MANUEL CUELLAR GOMEZ",3,15,1710,3102,"01","03","PC",25,1130,3,null,20151001,20151231,0,0]
[null,"GUANAJUATO","11DPT0004N",120,"DABG810704HX9","DABG810704HGTMRR08","GERSON FALCAO DAMIAN BRAVO",3,25,1710,3102,"01",28,"PB",29,1130,3,null,20151001,20151231,0,0]
[null,"GUANAJUATO","11DPT0006L",100,"DIGJ5805018S3","DIGJ580501HGTZTR09","JORGE DIAZ GUTIERREZ",3,12,1710,3102,"01",63,"PA",15,1130,3,null,20151001,20151231,0,0]
[null,"GUANAJUATO","11DPT0008J",120,"EANE770730ID6","EANE770730HMNSXD06","EDGAR CUAUHTEMOC ESTRADA NUÑEZ",3,23,1130,3102,"01",33,"TA",25,1130,3,null,20151001,20151231,0,0]
[null,"GUANAJUATO","11DPT0006L",120,"EIDR500307HY1","EIDR500307HGTNLN02","JOSE RENE ENRIQUEZ DELGADO",3,12,1710,3102,"01",63,"PB",15,1130,3,null,20151001,20151231,0,0]
[null,"GUANAJUATO","11DPT0007K",120,"FAPR6706038JA","FAPR670603HGTRRB03","ROBERTO FRANCIA PEREZ",3,20,1710,3102,"01","03","PC",16,1130,3,null,20151001,20151231,0,0]
[null,"GUANAJUATO","11DPT0011X",100,"FARR900712DJ6","FARR900712MGTRMC09","ROCIO IVONNE FRANCO ROMERO",3,20,1130,3102,"01",49,"PB",9,1130,3,null,20151001,20151231,0,0]
[null,"GUANAJUATO","11DPT0004N",100,"GABM720316FV9","GABM720316MGTLRR09","MARTHA PATRICIA GARCIA BELTRAN",3,10,1710,3102,"01",28,"PB",30,1130,3,null,20151001,20151231,0,0]
[null,"GUANAJUATO","11DPT0005M",120,"GABM731224PP4","GABM731224HGTRLG09","MIGUEL ANGEL GARCIA BELTRAN",3,15,1130,3102,"01",72,"PB",15,1130,3,null,20151001,20151231,0,0]
[null,"GUANAJUATO","11DPT0007K",120,"GASR730617EQ9","GASR730619MGTRLS03","ROSA MARIA GARCIA  SILVA",3,15,1710,3102,"01","03","PA",24,1130,3,null,20151001,20151231,0,0]
[null,"GUANAJUATO","11DPT0001Q",100,"GOHM880217IT0","GOHM880217HGTNRR05","MARCOS ELIAS GONZALEZ HERNANDEZ",3,20,1130,3102,"01",28,"PB",15,1130,3,null,20151001,20151231,0,0]
[null,"GUANAJUATO","11DPT0001Q",100,"GONJ690921H46","GONJ690921HGTMTS00","JOSE JESUS GOMEZ NIETO",3,24,1130,3102,"01",28,"PB",15,1130,3,null,20151001,20151231,0,0]
[null,"GUANAJUATO","11DPT0009I",100,"LEGR710831DD0","LEGR710831HGTSNL02","RAUL LESSO GONZALEZ ",3,12,1130,3102,"01",74,"TA",14,1130,3,null,20151001,20151231,0,0]
[null,"GUANAJUATO","11DPT0002P",100,"MASJ860305HY5","MASJ860305HGTRRN08","JUAN CARLOS MARTINEZ SARDINA",3,20,1130,3102,"01",29,"PB",10,1130,3,null,20151001,20151231,0,0]
[null,"GUANAJUATO","11DPT0007K",120,"PAAM820226JB0","PAAM820226HGTRGR02","MARTIN PRADO AGUILAR",3,21,1710,3102,"01","03","PA",24,1130,3,null,20151001,20151231,0,0]
[null,"GUANAJUATO","11DPT0012W",120,"QUGL880501733","QUGL880501MGTRRR02","LORENA QUIROZ GARCÍA",3,18,1130,3102,"01","02","PB",19,1130,3,null,20151001,20151231,0,0]
[null,"GUANAJUATO","11DPT0005M",120,"RAAL791208PR9","RAAL791208MGTZNL07","LILIA CONCEPCION RAZO ANGELES",3,25,1130,3102,"01",72,"PC",25,1130,3,null,20151001,20151231,0,0]
[null,"GUANAJUATO","11DPT0010Y",100,"RAPW7805122P3","RAPW780512MGTMRN01","WENDY RAMIREZ PARRA",3,19,1710,3102,"01","04","PB",38,1130,3,null,20151001,20151231,0,0]
[null,"GUANAJUATO","11DPT0006L",100,"RIAM860508FPA","RIAM860508MGTVRR09","MARISA RIVERA ARREDONDO",3,11,1710,3102,"01",63,"PA",8,1130,3,null,20151001,20151231,0,0]
[null,"GUANAJUATO","11DPT0011X",100,"RONI871027MR5","RONI871027HGTDGG00","JOSE IGNACIO RODRIGUEZ NEGRETE",3,18,1130,3102,"01",49,"PC",32,1130,3,null,20151001,20151231,0,0]
[null,"GUANAJUATO","11DPT0003O",120,"SAMR641029MF0","SAMR641029HGTMNB09","ROBERTO SANTOYO MENDOZA",3,20,1210,3102,"01",30,"PB",20,1130,3,null,20151001,20151231,0,0]
[null,"GUANAJUATO","11DPT0005M",120,"TOVJ770823IY6","TOVJ770823HGTRRM05","JUAN MANUEL TORRES  VERA",3,20,1130,3102,"01",72,"PB",20,1130,3,null,20151001,20151231,0,0]
[null,"GUANAJUATO","11DPT0007K",120,"VIZM6610296H8","VIZM661029MMNLRN03","MONICA VILLAGOMEZ  ZARATE",3,11,1710,3102,"01","03","PA",24,1130,3,null,20151001,20151231,0,0]
[null,"GUANAJUATO","11DPT0005M",120,"ZARM650407FT5","ZARM650407MGTVCT02","MARIA MATILDE ZAVALA RICO",3,12,1130,3102,"01",72,"PB",10,1130,3,null,20151001,20151231,0,0]
[null,"GUANAJUATO","11DPT0014U",100,"BEMG751210DE6","BEMG751210MDFLRD00","GUADALUPE KARINA BELTRAN MARTINEZ",3,24,1130,3102,"01","03","PB",10,163005,3,null,20151001,20151231,0,0]
[null,"GUANAJUATO","11DPT0003O",120,"CAGG841115NK6","CAGG841115MGTLNL08","GIULIANA CALDERON GONZALEZ",3,16,1130,3102,"01",30,"PB",12,163009,3,null,20151001,20151231,0,0]
[null,"GUANAJUATO","11DPT0007K",120,"COPG691022N6A","COPG691022MGTNRD16","MA GUADALUPE CONTRERAS PEREZ",3,19,1710,3102,"01","03","PC",16,163011,3,null,20151001,20151231,0,0]
[null,"GUANAJUATO","11DPT0006L",100,"COTR740102LT0","COTR740102MMCRRC00","ROCIO CORONA TIRADO",3,6,1130,3102,"01",63,"PC",30,163012,3,null,20151001,20151231,0,0]
[null,"GUANAJUATO","11DPT0001Q",100,"EILO590921526","EILO590921MGTSNF06","OFELIA ESPINOSA LUNA",3,20,1130,3102,"01",28,"PB",15,163015,3,null,20151001,20151231,0,0]
[null,"GUANAJUATO","11DPT0008J",120,"GASM760821854","GASS760821MGTRTC10","MA. DEL SOCORRO GARCIA SOTELO",3,23,1130,3102,"01",33,"PB",18,163017,3,null,20151001,20151231,0,0]
[null,"GUANAJUATO","11DPT0001Q",100,"GUSG880306VD5","GUSG880306HGTLNR09","GERARDO GUILLEN SANCHEZ",3,20,1130,3102,"01",28,"PB",15,163093,3,null,20151001,20151231,0,0]
[null,"GUANAJUATO","11DPT0001Q",100,"GUSS851005CT6","GUSS851005MGTLNN08","SANDRA GUILLEN SANCHEZ",3,20,1130,3102,"01",28,"PB",15,163080,3,null,20151001,20151231,0,0]
[null,"GUANAJUATO","11DPT0001Q",120,"JAMJ8502091S3","JAMJ850209HDFSRL04","JULIO CESAR JASSO MARTINEZ",3,10,1130,3102,"01",28,"TA",20,163021,3,null,20151001,20151231,0,0]
[null,"GUANAJUATO","11DPT0011X",100,"JAPM610407F53","JAPM610407HGTSRR00","MARCELINO JASSO PEREZ",3,15,1130,3102,"01",49,"PC",20,163022,3,null,20151001,20151231,0,0]
[null,"GUANAJUATO","11DPT0009I",100,"LOHE8811064TA","LOHE881106MJCPRD00","EDITH LOPEZ HERNANDEZ",3,16,1130,3102,"01",74,"PB",16,163067,3,null,20151001,20151231,0,0]
[null,"GUANAJUATO","11DPT0005M",120,"LUWR540208FX7","LUWR540208MDFNRB04","REBECA LUNA WIARCO",3,28,1130,3102,"01",72,"PB",20,163024,3,null,20151001,20151231,0,0]
[null,"GUANAJUATO","11DPT0012W",120,"MASE831216GZ4","MASE831216MGTNTL05","ELIA MANDUJANO SOTO",3,30,1130,3102,"01","02","PB",15,163068,3,null,20151001,20151231,0,0]
[null,"GUANAJUATO","11DPT0010Y",120,"MOSR800811KH0","MOSR800811HGTLNC05","RICARDO MOLINA SANCHEZ",3,18,1710,3102,"01","04","PB",15,163030,3,null,20151001,20151231,0,0]
[null,"GUANAJUATO","11DPT0001Q",100,"OISA541015SQ0","OISA541015HGTRLL00","ALEJANDRO ORTIZ SILVA",3,20,1130,3102,"01",28,"PB",15,163031,3,null,20151001,20151231,0,0]
[null,"GUANAJUATO","11DPT0002P",100,"PEBJ680711PC1","PEBJ680711MGTRRN00","JUANA PEREZ BERNAL",3,19,1130,3102,"01",29,"PB",15,163034,3,null,20151001,20151231,0,0]
[null,"GUANAJUATO","11DPT0008J",120,"PIVC670724KD8","PIVC670724MMNLCR01","CRISTINA PLIEGO VICTORIA",3,9,1130,3102,"01",33,"TA",10,163035,3,null,20151001,20151231,0,0]
[null,"GUANAJUATO","11DPT0010Y",120,"RAAG811213NX5","RAAG811213MGTMGD09","MARIA GUADALUPE RAMIREZ AGUIRRE",3,30,1710,3102,"01","04","PB",20,163036,3,null,20151001,20151231,0,0]
[null,"GUANAJUATO","11DPT0006L",100,"RABS681021GFA","RABS681021MGTMRL03","MA SOLEDAD RAMIREZ BERMUDEZ",3,12,1710,3102,"01",63,"PB",23,163037,3,null,20151001,20151231,0,0]
[null,"GUANAJUATO","11DPT0007K",120,"RAMO6702175A0","RAMO670217MMNNJL07","OLGA OFELIA RANGEL MEJIA",3,24,1710,3102,"01","03","TA",18,163098,3,null,20151001,20151231,0,0]
[null,"GUANAJUATO","11DPT0011X",100,"RORM6503108B9","RORM650310MGTSDL03","MILAGROS ROSAS RODRIGUEZ",3,19,1130,3102,"01",49,"TA",20,163040,3,null,20151001,20151231,0,0]
[null,"GUANAJUATO","11DPT0002P",120,"SAGI850902B58","SAGI850902MJCNNS03","ISAURA SANCHEZ GONZALEZ",3,10,1130,3102,"01",29,"PC",18,163044,3,null,20151001,20151231,0,0]
[null,"GUANAJUATO","11DPT0010Y",120,"SAMC7308072M6","SAMC730807MGTNRR25","MA. DEL CARMEN SANCHEZ MORENO",3,23,1710,3102,"01","04","PC",16,163045,3,null,20151001,20151231,0,0]
[null,"GUANAJUATO","11DPT0003O",120,"SAMM791219U15","SAMM791219MGTVDG08","MARIA MAGDALENA SAAVEDRA MEDRANO",3,15,1210,3102,"01",30,"PA",16,163041,3,null,20151001,20151231,0,0]
[null,"GUANAJUATO","11DPT0013V",120,"SARP720603511","SARP720603HGTNMD03","PEDRO SANCHEZ RAMIREZ",3,16,1130,3102,"01","02","PC",20,163046,3,null,20151001,20151231,0,0]
[null,"GUANAJUATO","11DPT0003O",120,"SOAE851129KH7","SOAE851129MGTTCS09","ESPERANZA SOTO ACEVEDO",3,15,1130,3102,"01",30,"PA",13,163047,3,null,20151001,20151231,0,0]
[null,"GUANAJUATO","11DPT0003O",120,"VAAJ751004U60","VAAJ751004MGTLRN04","JUANA YANET VALDEZ ARGUELLO",3,15,1130,3102,"01",30,"PA",8,163048,3,null,20151001,20151231,0,0]
[null,"GUANAJUATO","11DPT0001Q",100,"VAHI781011P33","VAHI781011MQTZRV06","IVETT CLARA VAZQUEZ HERNANDEZ",3,17,1130,3102,"01",28,"PB",10,163052,3,null,20151001,20151231,0,0]
[null,"GUANAJUATO","11DPT0003O",120,"VAMM770825UBA","VAMM770825HGTLLG05","JOSE MIGUEL VALDEZ MALDONADO",3,27,1210,3102,"01",30,"TA",20,163050,3,null,20151001,20151231,0,0]
[null,"GUANAJUATO","11DPT0001Q",100,"VEGJ690320CV6","VEGJ690320HGTGNN02","JUAN ANTONIO VEGA GONZALEZ",3,20,1130,3102,"01",28,"PB",18,163054,3,null,20151001,20151231,0,0]
[null,"GUANAJUATO","11DPT0002P",120,"VESJ58011884A","VESJ580118HGTGNN01","JUAN CARLOS VEGA SANCHEZ",3,15,1130,3102,"01",29,"PA",20,163055,3,null,20151001,20151231,0,0]
[null,"GUANAJUATO","11DPT0007K",120,"ZAGG741211FF0","ZAGG741211MMNCND04","MARIA GUADALUPE ZACARIAS GONZALEZ",3,21,1710,3102,"01","03","PC",18,163056,3,null,20151001,20151231,0,0]
[null,"GUANAJUATO","11DPT0006L",100,"ZASJ710817C96","ZASJ710817MGTVLL06","JULIA XIOMARA ZAVALA SALAS",3,16,1710,3102,"01",63,"PA",20,163058,3,null,20151001,20151231,0,0]
[null,"GUANAJUATO","11DPT0009I",100,"AAGE740808PN4","AAGE740808HGTLRM03","EMMANUEL FRANCISCO ALCARAZ GARCIA",3,30,1130,3102,"01",74,"PA",20,203004,3,null,20151001,20151231,0,0]
[null,"GUANAJUATO","11DPT0001Q",100,"AAGL5509065W0","AAGL550906HGTRZS02","JOSE LUIS ARAIZA GUZMAN",3,17,1130,3102,"01",28,"PB",9,203251,3,null,20151001,20151231,0,0]
[null,"GUANAJUATO","11DPT0007K",100,"AEBM7404088T6","AEBM740408HGTRCG06","MIGUEL ANGEL ARELLANO BECERRA",3,12,1710,3102,"01","03","PB",20,203007,3,null,20151001,20151231,0,0]
[null,"GUANAJUATO","11DPT0002P",120,"AEIS580223D43","AEXI580223HGTDXS09","ISMAEL  AEDO",3,19,1130,3102,"01",29,"TA",26,203001,3,null,20151001,20151231,0,0]
[null,"GUANAJUATO","11DPT0003O",120,"AEME830910KL9","AEME830910MGTDRS08","ESPERANZA AEDO DE MARIA Y CAMPOS",3,15,1210,3102,"01",30,"PA",15,203002,3,null,20151001,20151231,0,0]
[null,"GUANAJUATO","11DPT0004N",100,"AIVG860513KD0","AUVG860513MGTNZD03","MARIA GUADALUPE ANGUIANO VAZQUEZ",3,25,1710,3102,"01",28,"PA",22,203127,3,null,20151001,20151231,0,0]
[null,"GUANAJUATO","11DPT0007K",120,"AONL720204923","AONL720204MGTLXT01"," MA. LETICIA ALONSO NUÑEZ",3,9,1710,3102,"01","03","PA",25,203005,3,null,20151001,20151231,0,0]
[null,"GUANAJUATO","11DPT0003O",120,"AULY531226UY7","AULY531226MDFGDL03","YOLANDA ERENDIRA AGUILAR LEDESMA",3,10,1210,3102,"01",30,"PA",21,203003,3,null,20151001,20151231,0,0]
[null,"GUANAJUATO","11DPT0001Q",100,"BEJE700403E37","BEXJ700403HGTLXS00","JESUS GERARDO  BELMONTE",3,20,1130,3102,"01",28,"PB",17,203100,3,null,20151001,20151231,0,0]
[null,"GUANAJUATO","11DPT0008J",120,"CAGS660709C18","CAGS660709MGTHRS01","SUSANA CHAVEZ GUERRA",3,20,1130,3102,"01",33,"PB",19,203180,3,null,20151001,20151231,0,0]
[null,"GUANAJUATO","11DPT0001Q",100,"CARS840701PT4","CARS840701MGTHMR06","SARAH GABRIELA CHAVEZ RAMIREZ",3,23,1130,3102,"01",28,"PB",25,203018,3,null,20151001,20151231,0,0]
[null,"GUANAJUATO","11DPT0002P",100,"CIOV5211227Z3","CIOV521122HDFSRC01"," VICTOR SAMUEL CISNEROS ORTEGA",3,25,1130,3102,"01",29,"PB",15,203019,3,null,20151001,20151231,0,0]
[null,"GUANAJUATO","11DPT0002P",100,"DIVA711128CB2","DIVA711128MMCZGL03","ALEJANDRA DIAZ VEGA",3,25,1130,3102,"01",29,"PB",20,203132,3,null,20151001,20151231,0,0]
[null,"GUANAJUATO","11DPT0011X",100,"EOTJ551129MU2","EOTS551129HGTSPT10"," J. SATURNINO ESCOTO TAPIA",3,20,1130,3102,"01",49,"PC",14,203026,3,null,20151001,20151231,0,0]
[null,"GUANAJUATO","11DPT0004N",100,"GACM6402137QA","GACM640213MGTRNR05","MARICELA GARCIA CHAVEZ",3,10,1710,3102,"01",28,"PC",15,203031,3,null,20151001,20151231,0,0]
[null,"GUANAJUATO","11DPT0007K",120,"GAGA6703123EA","GAGA670312HGTSNL02","JOSE ALFREDO GASCA GONZALEZ",3,15,1710,3102,"01","03","PC",20,203039,3,null,20151001,20151231,0,0]
[null,"GUANAJUATO","11DPT0002P",100,"GAML640822","GAML640822MDFRNT04","MARIA LETICIA GARCIA MENDEZ",3,15,1130,3102,"01",29,"PB",31,203237,3,null,20151001,20151231,0,0]
[null,"GUANAJUATO","11DPT0002P",120,"GAML700607LKJ","GAML700607HGTLXS02","LUIS ROBERTO GALLEGOS MUÑOZ",3,16,1130,3102,"01",29,"PC",12,203243,3,null,20151001,20151231,0,0]
[null,"GUANAJUATO","11DPT0002P",120,"GARG881113FV7","GARG881113HGTRDL05","GUILLERMO GARCIA RODRIGUEZ",3,16,1130,3102,"01",29,"PB",15,203227,3,null,20151001,20151231,0,0]
[null,"GUANAJUATO","11DPT0007K",120,"GOBA841110","GOBA841110MGTNNL06","ALMA CECILIA GONZALEZ BUENDIA",3,20,1710,3102,"01","03","PA",23,203232,3,null,20151001,20151231,0,0]
[null,"GUANAJUATO","11DPT0007K",120,"GOBD860212U8A","GOBD860212MGTNNL08","DELIA MELIZA GONZALEZ BUENDIA",3,16,1710,3102,"01","03","PC",10,203278,3,null,20151001,20151231,0,0]
[null,"GUANAJUATO","11DPT0009I",100,"GOME811008E64","GOME811008MGTMNL03","ELIZABETH GOMEZ MENDOZA",3,18,1130,3102,"01",74,"TA",20,203039,3,null,20151001,20151231,0,0]
[null,"GUANAJUATO","11DPT0004N",100,"GOOC7007237B8","GOOC700123MGTMRR07","MA. DEL CARMEN GOMEZ OROPEZA",3,12,1710,3102,"01",28,"PB",25,203040,3,null,20151001,20151231,0,0]
[null,"GUANAJUATO","11DPT0013V",120,"GOOE760928BN1","GOOE760928HGTMRN01","ENRIQUE ALEJANDRO GOMEZ OROPEZA",3,24,1130,3102,"01","02","PC",14,203160,3,null,20151001,20151231,0,0]
[null,"GUANAJUATO","11DPT0001Q",100,"GOPS6802087F1","GOPS680208HGTNDN00","SANTIAGO GONZALEZ PADILLA",3,23,1130,3102,"01",28,"PB",16,203034,3,null,20151001,20151231,0,0]
[null,"GUANAJUATO","11DPT0004N",120,"GUHG690324J87","GUHG690324HGTTRB00","GABRIEL GUTIERREZ HERNANDEZ",3,16,1710,3102,"01",28,"PA",15,203036,3,null,20151001,20151231,0,0]
[null,"GUANAJUATO","11DPT0006L",100,"GUHM640516HF8","GUHM640516MGTTRR04","MARTHA GUTIERREZ HERNANDEZ",3,20,1710,3102,"01",63,"PA",24,203037,3,null,20151001,20151231,0,0]
[null,"GUANAJUATO","11DPT0001Q",100,"GUHR661007QW0","GUHR661007MGTTRC18","ROCIO DEL ROSARIO GUTIERREZ HERNANDEZ",3,16,1130,3102,"01",28,"TA",29,203038,3,null,20151001,20151231,0,0]
[null,"GUANAJUATO","11DPT0012W",120,"GULM751128QC4","GULM751128HGTRNR07","MARIO DE JESUS GUERRERO LUNA",3,28,1130,3102,"01","02","PA",22,203035,3,null,20151001,20151231,0,0]
[null,"GUANAJUATO","11DPT0004N",120,"GUMR8110123U3","GUMR811012HCHZNM08","RAMIRO GUZMAN MONTES",3,15,1710,3102,"01",28,"PA",10,203153,3,null,20151001,20151231,0,0]
[null,"GUANAJUATO","11DPT0008J",120,"GUVC900306TRT","GUVC900306HGTTNH09","CHRISTIAN JUAN DE DIOS GUTIERREZ VENEGAS",3,24,1130,3102,"01",33,"PA",12,203250,3,null,20151001,20151231,0,0]
[null,"GUANAJUATO","11DPT0003O",120,"HEAM5406144E9","HEAM540614MDFRRR09","MARISELA HERRERA ARVIZU",3,12,1210,3102,"01",30,"PC",12,203172,3,null,20151001,20151231,0,0]
[null,"GUANAJUATO","11DPT0004N",100,"HUQL680518G68","HUQL680518HGTRNS08","LUIS GERARDO HURTADO QUINTANA",3,12,1710,3102,"01",28,"PC",9,203244,3,null,20151001,20151231,0,0]
[null,"GUANAJUATO","11DPT0002P",120,"LAMV790816C4A","LAMV790816MGTRNN04","VANESSA GEOVANNA LARIOS MINJARES",3,15,1130,3102,"01",29,"PA",17,203137,3,null,20151001,20151231,0,0]
[null,"GUANAJUATO","11DPT0005M",120,"LELJ740926PK3","LELJ740926HJCNPN01","JUAN ANTONIO LEON LOPEZ",3,29,1130,3102,"01",72,"PB",15,203046,3,null,20151001,20151231,0,0]
[null,"GUANAJUATO","11DPT0002P",100,"MAHE740312EP4","MAHE740312MJCLRR09","ERIKA GUADALUPE MALDONADO HERNANDEZ",3,24,1130,3102,"01",29,"PB",21,203051,3,null,20151001,20151231,0,0]
[null,"GUANAJUATO","11DPT0008J",120,"MAMD780104125","MAMD780104MGTTRL05","MARIA DOLORES MATA MARTINEZ",3,25,1130,3102,"01",33,"PC",20,203054,3,null,20151001,20151231,0,0]
[null,"GUANAJUATO","11DPT0004N",100,"MAMX651202NJ5","MXME651202MGTTEV07","EVA MATA MARTINEZ",3,15,1710,3102,"01",28,"PB",20,203188,3,null,20151001,20151231,0,0]
[null,"GUANAJUATO","11DPT0005M",120,"MEGL640103827","MEGL640103MGTLTT08","MA. LETICIA MELENDEZ GUTIERREZ",3,15,1130,3102,"01",72,"PB",20,203056,3,null,20151001,20151231,0,0]
[null,"GUANAJUATO","11DPT0010Y",120,"MESM670501FH5","MESM670501HDFNGR03","MARCO ALFREDO MENDOZA SEGURA",3,24,1130,3102,"01","04","PA",20,203057,3,null,20151001,20151231,0,0]
[null,"GUANAJUATO","11DPT0013V",120,"MEZJ750302AC9","MEZJ750302HGTNPR00","JORGE MENDOZA ZAPATA",3,15,1130,3102,"01","02","PA",10,203152,3,null,20151001,20151231,0,0]
[null,"GUANAJUATO","11DPT0002P",100,"MORB790906FV5","MORB790906MGTNSR05","BERTHA ALICIA MONJARAZ RIOS",3,28,1130,3102,"01",29,"PB",15,203182,3,null,20151001,20151231,0,0]
[null,"GUANAJUATO","11DPT0013V",120,"MOVJ75111289A","MOVJ751112HJCRRR01","JORGE ARMANDO MORALES VARGAS",3,21,1130,3102,"01","02","PC",11,203060,3,null,20151001,20151231,0,0]
[null,"GUANAJUATO","11DPT0014U",100,"MOVM841118881","MOVM841118MGTNRR09","MARIELA MONTIEL  VERA",3,30,1130,3102,"01","03","TA",11,203143,3,null,20151001,20151231,0,0]
[null,"GUANAJUATO","11DPT0014U",100,"NAGM7308014C0","NAGM730801MGTJZR05"," MARCELA NAJERA GUZMAN ",3,32,1130,3102,"01","03","PA",24,203064,3,null,20151001,20151231,0,0]
[null,"GUANAJUATO","11DPT0004N",100,"NAMK750429IB1","NAMK750429MGTTNR02","KARINA NATERA MONZON ",3,15,1710,3102,"01",28,"PA",23,203063,3,null,20151001,20151231,0,0]
[null,"GUANAJUATO","11DPT0005M",120,"OEGR7911068I7","OEGR791106MGTRMS01"," ROSA MARIA ORNELAS  GOMEZ",3,25,1130,3102,"01",72,"PC",10,203157,3,null,20151001,20151231,0,0]
[null,"GUANAJUATO","11DPT0005M",120,"OELL840306742","OELL840306MGTRNR06","LAURA DEL ROCIO ORNELAS LUNA",3,15,1130,3102,"01",72,"PB",13,203199,3,null,20151001,20151231,0,0]
[null,"GUANAJUATO","11DPT0008J",120,"OIAE780131HL9","OIAE780131HGTNLD06","EDGAR JIONEL ONTIVEROS ALCALA",3,20,1130,3102,"01",33,"PB",14,203156,3,null,20151001,20151231,0,0]
[null,"GUANAJUATO","11DPT0012W",100,"OIMD8504181Z5","OIMD850418MGTLRN00","DIANA OLIVA MORENO",3,10,1130,3102,"01","02","PB",25,203065,3,null,20151001,20151231,0,0]
[null,"GUANAJUATO","11DPT0006L",100,"RALS8203241F7","RALS820324MGTMZL03","SILVIA AYDEE RAMIREZ LOZANO",3,15,1710,3102,"01",63,"PC",23,203176,3,null,20151001,20151231,0,0]
[null,"GUANAJUATO","11DPT0006L",100,"RAMM8704167H6","RAMM870416MCMNRR00","MARGARITA ZARAHY RANGEL MARTINEZ",3,18,1710,3102,"01",63,"PC",12,203246,3,null,20151001,20151231,0,0]
[null,"GUANAJUATO","11DPT0002P",100,"RAVM831112KP8","RAVM831112MGTMLN01","MONICA DE LA LUZ RAMIREZ VILLANUEVA",3,15,1130,3102,"01",29,"PB",25,203195,3,null,20151001,20151231,0,0]
[null,"GUANAJUATO","11DPT0003O",120,"RELL7409136N7","RELL740913HGTYRS09","JOSE LUIS REYES LARA",3,13,1210,3102,"01",30,"PB",13,203220,3,null,20151001,20151231,0,0]
[null,"GUANAJUATO","11DPT0002P",120,"RICE740107C14","RICE740107MGTVSR06","  ERIKA ADRIANA RIVERA CISNEROS   ",3,25,1130,3102,"01",29,"PC",23,203072,3,null,20151001,20151231,0,0]
[null,"GUANAJUATO","11DPT0011X",100,"RICM7009187Q5","RICM700918HGTVSG07","MIGUEL ANGEL RIVERA CISNEROS",3,20,1130,3102,"01",49,"PB",15,203215,3,null,20151001,20151231,0,0]
[null,"GUANAJUATO","11DPT0001Q",100,"ROHO780227K98","ROXH780227MGTCXN02","HONORINA PAOLA * ROCHA",3,12,1130,3102,"01",28,"PB",16,203126,3,null,20151001,20151231,0,0]
[null,"GUANAJUATO","11DPT0009I",100,"ROML710901QS2","ROML710901MGTDRT00","LETICIA RODRIGUEZ MORALES",3,20,1130,3102,"01",74,"PB",18,203128,3,null,20151001,20151231,0,0]
[null,"GUANAJUATO","11DPT0007K",120,"ROOF850730521","ROOF850730HGTMLR06","FRANCISCO ROMERO OLMOS",3,12,1710,3102,"01","03","PB",13,203245,3,null,20151001,20151231,0,0]
[null,"GUANAJUATO","11DPT0004N",100,"ROOO570222BT6","ROOO570222HDFJRM05","OMAR   ROJAS OROZCO",3,13,1710,3102,"01",28,"PA",25,203075,3,null,20151001,20151231,0,0]
[null,"GUANAJUATO","11DPT0003O",120,"RORL860709G29","RORL860709MGTDML06","LILIA BERENICE RODRIGUEZ RAMIREZ",3,24,1130,3102,"01",30,"TA",19,203191,3,null,20151001,20151231,0,0]
[null,"GUANAJUATO","11DPT0011X",120,"ROZA8409121VA","ROZA840912MGTDXL02","ALMA ROSARIO RODRIGUEZ ZUÑIGA",3,20,1130,3102,"01",49,"PA",10,203202,3,null,20151001,20151231,0,0]
[null,"GUANAJUATO","11DPT0005M",120,"RUBS800124TR0","RUBS800124HGTZRL06","SAUL RUIZ BERBENA",3,15,1130,3102,"01",72,"PC",16,203189,3,null,20151001,20151231,0,0]
[null,"GUANAJUATO","11DPT0011X",120,"SAAM830517LU0","SAAM830517HDFNRG07","MIGUEL ANGEL SANCHEZ ARANDA",3,24,1130,3102,"01",49,"TA",10,203170,3,null,20151001,20151231,0,0]
[null,"GUANAJUATO","11DPT0007K",120,"SOMJ5508087H2","SOMJ550808MGTTRN02","JUANA SOTO MORAN",3,15,1710,3102,"01","03","PC",30,203081,3,null,20151001,20151231,0,0]
[null,"GUANAJUATO","11DPT0001Q",100,"TIEA7005021TA","TIEA700502MDFHSN02"," ANGELICA THIRION ESCUDER  ",3,21,1130,3102,"01",28,"PA",26,203085,3,null,20151001,20151231,0,0]
[null,"GUANAJUATO","11DPT0011X",100,"UIRA650703JZ5","UIRA650703MDFRML07"," MARIA ALEJANDRA URIBE RAMIREZ  ",3,25,1130,3102,"01",49,"PC",20,203086,3,null,20151001,20151231,0,0]
[null,"GUANAJUATO","11DPT0008J",120,"VAFE7901264H5","VAXF790126HNELXD12","FEDERICO DEL VAL ",3,24,1130,3102,"01",33,"PC",10,203223,3,null,20151001,20151231,0,0]
[null,"GUANAJUATO","11DPT0007K",120,"VIBM7702283A2","VIBM770228HDFLRR01","MAURICIO VILCHIS BARCENAS ",3,20,1710,3102,"01","03","PC",15,203093,3,null,20151001,20151231,0,0]
[null,"GUANAJUATO","11DPT0003O",120,"(en blanco)","GAML640822MDFRNT04","MARIA LETICIA GARCIA MENDEZ",3,15,1210,3102,"01",30,"PC",31,203237,3,null,20151001,20151231,0,0]
[null,"GUANAJUATO","11DPT0004N",120,"AETA681104M99","AETA681104MGTRPL00","ALEJANDRA ARREGUIN TAPIA",3,18,1710,3102,"01",28,"PB",24,523363,3,null,20151001,20151231,0,0]
[null,"GUANAJUATO","11DPT0005M",120,"AUME740716A41","AUME740716HPLGDN13","ENRIQUE AGUILAR MEDRANO",3,15,1130,3102,"01",72,"PC",20,523363,3,null,20151001,20151231,0,0]
[null,"GUANAJUATO","11DPT0011X",100,"BIEF750826Q65","BIEF750826HGTRSL05","FILIBERTO BRISEÑO ESPITIA",3,15,1130,3102,"01",49,"PB",23,523305,3,null,20151001,20151231,0,0]
[null,"GUANAJUATO","11DPT0011X",100,"GACP660324G26","GACP660324HGTLPD03","PEDRO GALVEZ CAPORAL",3,18,1130,3102,"01",49,"PC",25,523316,3,null,20151001,20151231,0,0]
[null,"GUANAJUATO","11DPT0011X",100,"GAFR660603435","GAFR660603MGTRRS00","ROSAICELA CRISTINA GARCIA FRIAS",3,21,1130,3102,"01",49,"PC",24,523315,3,null,20151001,20151231,0,0]
[null,"GUANAJUATO","11DPT0007K",100,"GOHM731017127","GOHM731017HGTMRG05","MIGUEL ANGEL GOMEZ HERNANDEZ",3,12,1710,3102,"01","03","PC",13,523318,3,null,20151001,20151231,0,0]
[null,"GUANAJUATO","11DPT0007K",120,"GOPA710319IB0","GOPA710319HGTNRD02","ADAN ALEJANDRO GONZALEZ PRESA",3,13,1710,3102,"01","03","PB",17,523320,3,null,20151001,20151231,0,0]
[null,"GUANAJUATO","11DPT0002P",100,"GOPR781214HT1","GOPR781214HGTNRD05","RODOLFO GONZALEZ PRESA",3,25,1130,3102,"01",29,"PB",19,523321,3,null,20151001,20151231,0,0]
[null,"GUANAJUATO","11DPT0009I",100,"GOVA7403201E8","GOVA740320HGTMLR06","JOSE ARMANDO GOMEZ VALENCIA",3,18,1130,3102,"01",74,"TA",28,523366,3,null,20151001,20151231,0,0]
[null,"GUANAJUATO","11DPT0008J",120,"HEEF6801012R8","HEEF680101HHGRSL09","FELIPE HERNANDEZ ESTRADA",3,21,1130,3102,"01",33,"PA",25,523323,3,null,20151001,20151231,0,0]
[null,"GUANAJUATO","11DPT0003O",120,"HEFJ700120711","HEFG700120HGTRSD12","J. GUADALUPE HERNANDEZ FISCAL",3,20,1130,3102,"01",30,"PB",25,523324,3,null,20151001,20151231,0,0]
[null,"GUANAJUATO","11DPT0011X",120,"HEMB820716LV7","HEMB820716MGTRDR06","BRENDA HERNANDEZ MEDINA",3,26,1130,3102,"01",49,"PB",29,523365,3,null,20151001,20151231,0,0]
[null,"GUANAJUATO","11DPT0002P",120,"JULA7109296W5","JULA710929HGTRNL01","ALEJANDRO JUAREZ LEON",3,16,1130,3102,"01",29,"TA",20,523326,3,null,20151001,20151231,0,0]
[null,"GUANAJUATO","11DPT0004N",100,"JULB700329347","JULB700329HGTRNN09","BENITO JUAREZ LEON",3,15,1130,3102,"01",28,"PB",20,523327,3,null,20151001,20151231,0,0]
[null,"GUANAJUATO","11DPT0003O",120,"LOGS791206JH1","LOGS791206HGTPPR07","SERGIO LOPEZ GUAPO",3,20,1210,3102,"01",30,"PC",20,523331,3,null,20151001,20151231,0,0]
[null,"GUANAJUATO","11DPT0004N",120,"LOVT730719N69","LOVT730719MGTPLR04","MARIA TERESITA LOPEZ VILLAGOMEZ",3,10,1710,3102,"01",28,"PC",30,523333,3,null,20151001,20151231,0,0]
[null,"GUANAJUATO","11DPT0003O",120,"LOVV821208K16","LOVV821208HGTPZC03","VICTOR HUGO LOPEZ VAZQUEZ",3,24,1130,3102,"01",30,"TA",18,523332,3,null,20151001,20151231,0,0]
[null,"GUANAJUATO","11DPT0012W",120,"MACD620420JFA","MACD620420HGTRRV07","DAVID MARTINEZ CURTIDOR",3,24,1130,3102,"01","02","TA",25,523334,3,null,20151001,20151231,0,0]
[null,"GUANAJUATO","11DPT0008J",120,"MAMG691216UYA","MAMG691216HGTRRD04","JOSE GUADALUPE RAUL MARTINEZ MORENO",3,10,1130,3102,"01",33,"PB",20,523335,3,null,20151001,20151231,0,0]
[null,"GUANAJUATO","11DPT0010Y",120,"MOYS790226DL6","MOYS790226MGTNXC08","MARIA DEL SOCORRO MONTALVO YAÑEZ",3,15,1710,3102,"01","04","PB",30,523338,3,null,20151001,20151231,0,0]
[null,"GUANAJUATO","11DPT0001Q",100,"PAAJ6210093M0","PAAE621009HGTTCN04","J.ENCARNACION MOISES PATIÑO ACOSTA",3,23,1130,3102,"01",28,"TA",21,523340,3,null,20151001,20151231,0,0]
[null,"GUANAJUATO","11DPT0005M",120,"QUMN8108073JA","QUMN810807MGTNRR05","NEIRA JENNIFER QUINTERO MORENO",3,15,1130,3102,"01",72,"PB",30,523341,3,null,20151001,20151231,0,0]
[null,"GUANAJUATO","11DPT0008J",120,"RAFB620409PS9","RAFB620409MNLMNL08","BLANCA ESTHELA RAMOS FUENTES",3,25,1130,3102,"01",33,"PC",21,523342,3,null,20151001,20151231,0,0]
[null,"GUANAJUATO","11DPT0001Q",100,"RIRJ8606049A1","RIRJ860604HGTSJN07","JUAN MANUEL RIOS ROJAS",3,20,1130,3102,"01",28,"PB",15,523343,3,null,20151001,20151231,0,0]
[null,"GUANAJUATO","11DPT0008J",120,"ROGD8306177Y6","ROGD830617HGTDLG05","JOSE DIEGO RODRIGUEZ GALLEGOS",3,23,1130,3102,"01",33,"PA",12,523345,3,null,20151001,20151231,0,0]
[null,"GUANAJUATO","11DPT0011X",100,"RONE740321QJ6","RONE740321MGTJTS01","MARIA ESTHER ROJAS NIETO",3,9,1130,3102,"01",49,"PB",25,523348,3,null,20151001,20151231,0,0]
[null,"GUANAJUATO","11DPT0001Q",100,"TOLJ711229Q89","TOLJ711229HGTRPV00","JAVIER TORRES LOPEZ",3,20,1130,3102,"01",28,"PB",21,523350,3,null,20151001,20151231,0,0]
[null,"GUANAJUATO","11DPT0001Q",100,"VALS820325LX7","VALS820325MGTLNL09","SILVIA NANCY VALADEZ LEON",3,25,1130,3102,"01",28,"PC",26,523355,3,null,20151001,20151231,0,0]
[null,"GUANAJUATO","11DPT0011X",100,"VAME680312QT2","VAME680312MGTZLR00","ELISA VAZQUEZ MARTINEZ",3,22,11249,3102,"01",49,"PC",26,523352,3,null,20151001,20151231,0,0]
[null,"GUANAJUATO","11DPT0004N",100,"VEGR7209154U4","VEGR720915MDFNLC00","MARIA DEL ROCIO VENTURA GALLEGOS",3,15,1130,3102,"01",28,"PA",29,523353,3,null,20151001,20151231,0,0]
[null,"GUANAJUATO","11DPT0007K",120,"AACN800319VC6","AACN800319MGTYRY15","NAYELI DE JESUS AYALA CARRERA",3,15,1710,3102,"01","03","PC",25,740004,3,null,20151001,20151231,0,0]
[null,"GUANAJUATO","11DPT0001Q",100,"AAVL730510P19","AAVL730510MGTYLR00","LAURA ELENA AYALA VALTIERRA",3,25,1130,3102,"01",28,"PC",20,740024,3,null,20151001,20151231,0,0]
[null,"GUANAJUATO","11DPT0007K",120,"AOZL870509M00","AOZL870509MGTLRC04","LUCIA ALONSO ZARAGOZA",3,10,1130,3102,"01","03","PB",12,740047,3,null,20151001,20151231,0,0]
[null,"GUANAJUATO","11DPT0006L",120,"CACC741121MK3","CACC741121HGTSRR01","CARLOS ALBERTO CASTILLO CRUZ",3,15,1710,3102,"01",63,"TA",16,740008,3,null,20151001,20151231,0,0]
[null,"GUANAJUATO","11DPT0007K",120,"CASM6003305D3","CASM600330HGTMTL02","MELCHOR CAMPOS SOTO",3,8,1710,3102,"01","03","PA",30,740007,3,null,20151001,20151231,0,0]
[null,"GUANAJUATO","11DPT0002P",120,"COGB581101LL6","COGB581101HGTRMN07","BENJAMIN CORONA GOMEZ",3,15,1130,3102,"01",29,"PA",18,740009,3,null,20151001,20151231,0,0]
[null,"GUANAJUATO","11DPT0003O",120,"FEPD780323M00","FEPD780323MGTLRL01","DELIA FELIPE  PEREZ ",3,26,1130,3102,"01",30,"PC",20,740011,3,null,20151001,20151231,0,0]
[null,"GUANAJUATO","11DPT0003O",120,"GOMO860112AC6","GOMO860112HDFNRM01","OMAR FRANCISCO GONZALEZ MARTINEZ",3,24,1130,3102,"01",30,"TA",12,740015,3,null,20151001,20151231,0,0]
[null,"GUANAJUATO","11DPT0014U",120,"IACC631023AI2","IACC631023HGTBNH06","CUAUHTEMOC IBARRA CANO",3,15,1130,3102,"01","03","PA",15,740016,3,null,20151001,20151231,0,0]
[null,"GUANAJUATO","11DPT0011X",100,"LEHM650906984","LEHM650906HGTNRG07","MIGUEL ANGEL DE LEON HURTADO",3,21,1130,3102,"01",49,"PC",12,740010,3,null,20151001,20151231,0,0]
[null,"GUANAJUATO","11DPT0010Y",120,"MALS720215M37","MALS720215MGTRPR06","SARA MARTINEZ LOPEZ",3,9,1710,3102,"01","04","PB",26,740020,3,null,20151001,20151231,0,0]
[null,"GUANAJUATO","11DPT0002P",100,"MATG681016SW7","MATG681016HGTGFR08","GERARDO MAGAÑA TAFOYA",3,15,1130,3102,"01",29,"PB",20,740019,3,null,20151001,20151231,0,0]
[null,"GUANAJUATO","11DPT0011X",100,"MEGM731204L93","MEGM731204MGTNZR02","MARISA MENDEZ GUZMAN",3,16,1130,3102,"01",49,"PB",10,740022,3,null,20151001,20151231,0,0]
[null,"GUANAJUATO","11DPT0011X",100,"MOCM7012151Q9","MOCM701215MGTRNN01","MANUELA MORALES CENDEJAS",3,19,1130,3102,"01",49,"PA",10,740025,3,null,20151001,20151231,0,0]
[null,"GUANAJUATO","11DPT0001Q",100,"PABG6901266Q2","PABG690126HGTZNR06","GERARDO PAZ BONILLA",3,21,1130,3102,"01",28,"PB",15,740026,3,null,20151001,20151231,0,0]
[null,"GUANAJUATO","11DPT0002P",120,"PEFD7301136V8","PEFD730113HGTRLV06","DAVID PEREZ FELIPE",3,8,1130,3102,"01",29,"PA",19,740027,3,null,20151001,20151231,0,0]
[null,"GUANAJUATO","11DPT0002P",100,"PESA790927U25","PESA790927MGTRTN06","ANDREA MAGDALENA PEREZ SOTO",3,11,1130,3102,"01",29,"PB",25,740028,3,null,20151001,20151231,0,0]
[null,"GUANAJUATO","11DPT0013V",120,"RARM770914S13","RARM770914HGTNYR07","MAURICIO RANGEL REYES",3,21,1130,3102,"01","02","PA",15,740029,3,null,20151001,20151231,0,0]
[null,"GUANAJUATO","11DPT0002P",120,"RIRG760502K16","RIRG760502MGTVDW04","GWENDOLYNE ERENDIRA RIVAS RODRIGUEZ",3,25,1130,3102,"01",29,"PC",10,740030,3,null,20151001,20151231,0,0]
[null,"GUANAJUATO","11DPT0010Y",100,"ROVA6201238U9","ROVA620123HGTDGL01","ALFONSO RODRIGUEZ VEGA",3,28,1710,3102,"01","04","PB",25,740033,3,null,20151001,20151231,0,0]
[null,"GUANAJUATO","11DPT0009I",100,"SAPR691204HS9","SAPR691204MGTNRS09","ROSA ELIA SANDOVAL PRADO",3,15,1130,3102,"01",74,"PB",20,740035,3,null,20151001,20151231,0,0]
[null,"GUANAJUATO","11DPT0014U",120,"SATJ701026RC3","SATJ701026HGTNFS09","JOSE SANCHEZ TAFOYA",3,27,11330,3102,"01","03","PA",15,740034,3,null,20151001,20151231,0,0]
[null,"GUANAJUATO","11DPT0006L",100,"SOSP630208MC6","SOSP630208HGTTCD07","PEDRO SOTO SAUCEDO",3,16,1710,3102,"01",63,"PB",12,740036,3,null,20151001,20151231,0,0]
[null,"GUANAJUATO","11DPT0002P",120,"TEAC711130CQ2","TEAC711130MGTJDL00","CLAUDIA ELENA TEJEDA ADAME",3,18,1130,3102,"01",29,"PA",11,740037,3,null,20151001,20151231,0,0]
[null,"GUANAJUATO","11DPT0001Q",100,"TEAR801024C6A","TEAR801024MGTJDS18","ROSA BEATRIZ TEJEDA ADAME",3,21,1130,3102,"01",28,"PA",15,740028,3,null,20151001,20151231,0,0]
[null,"GUANAJUATO","11DPT0008J",120,"TOAA8408254S3","TOAA840825MGRRYD03","ADRIANA TORRES AYALA",3,22,1130,3102,"01",33,"PA",15,740039,3,null,20151001,20151231,0,0]
[null,"GUANAJUATO","11DPT0009I",100,"TOAB770225NZ9","TOAB770225MGTRRR00","BERENICE TORRES ARROYO",3,12,1130,3102,"01",74,"TA",20,740040,3,null,20151001,20151231,0,0]
[null,"GUANAJUATO","11DPT0011X",120,"VAEM800823M00","VAEM800823MGTZLR07","MARIA MARISELA VAZQUEZ  ELIZARRARAS ",3,27,1130,3102,"01",49,"PB",10,740043,3,null,20151001,20151231,0,0]
[null,"GUANAJUATO","11DPT0001Q",100,"VAMB781025M00","VAMB781025MGTZRT08","BEATRIZ VAZQUEZ  MARTINEZ ",3,15,1130,3102,"01",28,"PB",11,740048,3,null,20151001,20151231,0,0]
[null,"GUANAJUATO","11DPT0011X",100,"AAFO86011729A","AAFO860117MGTRRL08","OLGA ELIZABETH ARAUJO FERNANDEZ",3,8,1130,3102,"01",49,"PB",22,204092,3,null,20151001,20151231,0,0]
[null,"GUANAJUATO","11DPT0007K",120,"AOOV770724DZ8","AOOV770724MGTRRR09","VERONICA ARZOLA ORTEGA",3,17,1710,3102,"01","03","PB",26,204008,3,null,20151001,20151231,0,0]
[null,"GUANAJUATO","11DPT0001Q",100,"AUCR760401U5A","AUCR760401HGTGRC06","RICARDO AGUILAR CORONA",3,15,1130,3102,"01",28,"PB",12,204001,3,null,20151001,20151231,0,0]
[null,"GUANAJUATO","11DPT0007K",120,"AURJ751104NX7","AURJ751104HGTGDN09","JUAN CARLOS  AGUIRRE RODRÌGUEZ",3,19,1710,3102,"01","03","PA",16,204002,3,null,20151001,20151231,0,0]
[null,"GUANAJUATO","11DPT0008J",120,"BAVB810501LRA","BAVB810501MGTRLL01","BLANCA ELIZABETH BARAJAS VALLEJO",3,20,1130,3102,"01",33,"PA",20,204009,3,null,20151001,20151231,0,0]
[null,"GUANAJUATO","11DPT0006L",100,"CACX831109CP9","CXCA831109MGTMHM07","AMERICA CAMPOS CHAGOYA",3,16,1130,3102,"01",63,"TA",18,204011,3,null,20151001,20151231,0,0]
[null,"GUANAJUATO","11DPT0010Y",120,"CAGG7503244Z4","CAGG750324MGTBTB00","GABRIELA DEL CARMEN CABRERA GUTIÉRREZ",3,15,1710,3102,"01","04","TA",30,204010,3,null,20151001,20151231,0,0]
[null,"GUANAJUATO","11DPT0001Q",120,"CALA6404086Z8","CALA640408HGTDXL04","ALBERTO CAUDILLO LIÑÁN",3,25,1130,3102,"01",28,"PB",23,204014,3,null,20151001,20151231,0,0]
[null,"GUANAJUATO","11DPT0010Y",100,"DIRS7905261S6","DIRS790526MJCZVR00","SAIRA  ESTHER DIAZ RIVERA",3,20,1710,3102,"01","04","PC",23,204009,3,null,20151001,20151231,0,0]
[null,"GUANAJUATO","11DPT0013V",120,"EIDJ571003UH1","EIDC571003HGTSMS06","JOSÉ COSME ESPINOZA DOMÍNGUEZ",3,25,1130,3102,"01","02","PB",10,204016,3,null,20151001,20151231,0,0]
[null,"GUANAJUATO","11DPT0013V",120,"FIOM790619I13","FIOM790619HDFLRH07","MAHY ROLANDO FILOMENO ORTIZ",3,15,1130,3102,"01","02","PA",15,204017,3,null,20151001,20151231,0,0]
[null,"GUANAJUATO","11DPT0010Y",120,"GAGA790221226","GAGA790221HGTSRR01","ARMANDO GASCA GUERRA",3,24,1710,3102,"01","04","PB",15,204010,3,null,20151001,20151231,0,0]
[null,"GUANAJUATO","11DPT0008J",120,"GAME651110B38","GAME651110HDFRRD00","EDUARDO GARCÍA MORALES",3,30,1130,3102,"01",33,"PB",20,204020,3,null,20151001,20151231,0,0]
[null,"GUANAJUATO","11DPT0011X",120,"GOAA670428AHA","GOAA670428MGTNLR05","ARACELI GONZÁLEZ ÁLVAREZ",3,13,1130,3102,"01",49,"PA",15,204021,3,null,20151001,20151231,0,0]
[null,"GUANAJUATO","11DPT0003O",120,"GOHV780329HP0","GOHV780329MGTNRR00","VERÓNICA GONZÁLEZ HERNÁNDEZ",3,20,1210,3102,"01",30,"PA",12,204022,3,null,20151001,20151231,0,0]
[null,"GUANAJUATO","11DPT0005M",120,"HEDT700419HG2","HEDT700419HGTRRR01","JOSÉ TERESO HERNÁNDEZ DURÁN",3,15,1130,3102,"01",72,"PB",9,204024,3,null,20151001,20151231,0,0]
[null,"GUANAJUATO","11DPT0008J",120,"HERE800329V17","HERE800329HGTRDD03","EDGAR IVÁN HERNÁNDEZ RODRÍGUEZ",3,30,1130,3102,"01",33,"PC",22,204024,3,null,20151001,20151231,0,0]
[null,"GUANAJUATO","11DPT0003O",120,"HIBA631027337","HIBA631027HGTNLN08","ANTONIO HINOJOSA BALANDRÁN",3,18,1210,3102,"01",30,"PB",24,204026,3,null,20151001,20151231,0,0]
[null,"GUANAJUATO","11DPT0006L",100,"LORC760609NB1","LORC760609MDFPVL08","CLAUDETTE LÓPEZ DE LA RIVA",3,16,1710,3102,"01",63,"PB",20,204030,3,null,20151001,20151231,0,0]
[null,"GUANAJUATO","11DPT0009I",100,"LOVJ660127MI1","LOVJ660127HGTPLN03","JUAN LÓPEZ VALENCIA",3,26,1130,3102,"01",74,"PB",24,204032,3,null,20151001,20151231,0,0]
[null,"GUANAJUATO","11DPT0001Q",100,"MAVR720809AXA","MAVR720809MGTNZS05","ROSA BEATRIZ MANJARREZ VAZQUEZ",3,24,1130,3102,"01",28,"PB",25,204033,3,null,20151001,20151231,0,0]
[null,"GUANAJUATO","11DPT0008J",120,"MAZA690627N73","MAZA690627MGTTMN03","ANA ROSA MATA ZAMORA",3,20,1130,3102,"01",33,"PA",21,204094,3,null,20151001,20151231,0,0]
[null,"GUANAJUATO","11DPT0011X",100,"MEMV791203112","MEVM791203HGTDZR15","MARIO MEDINA VÁZQUEZ",3,13,1130,3102,"01",49,"TA",15,204038,3,null,20151001,20151231,0,0]
[null,"GUANAJUATO","11DPT0002P",120,"MORA600920UJ0","MORA600920MGTSVN08","MARÍA DE LOS ÁNGELES MOSQUEDA RUVALCABA",3,15,1130,3102,"01",29,"PB",30,204041,3,null,20151001,20151231,0,0]
[null,"GUANAJUATO","11DPT0005M",120,"MORR630513CT2","MORR630513HGTSVD06","RODOLFO MOSQUEDA RUVALCABA",3,30,1130,3102,"01",72,"PA",15,204042,3,null,20151001,20151231,0,0]
[null,"GUANAJUATO","11DPT0007K",120,"NIGC7311229F4","NIGC731122HGTLSC01","CECILIO NILA GASCA",3,15,1710,3102,"01","03","PB",8,204046,3,null,20151001,20151231,0,0]
[null,"GUANAJUATO","11DPT0013V",120,"PATD7212262V2","PATD721226MGTCRL02","DULCE CONCEPCIÓN PACHECO TORRES",3,15,1130,3102,"01","02","PB",28,204048,3,null,20151001,20151231,0,0]
[null,"GUANAJUATO","11DPT0001Q",100,"PEGO840715TW6","PEGO840715MGTRRL04","OLGA CRISTINA  PEREZ GUERRERO",3,23,1130,3102,"01",28,"PB",26,204049,3,null,20151001,20151231,0,0]
[null,"GUANAJUATO","11DPT0001Q",100,"PESJ720529I40","PESJ720529HGTRNN06","JUAN JOSÉ PÉREZ SANTIAGO",3,19,1130,3102,"01",28,"PB",15,204052,3,null,20151001,20151231,0,0]
[null,"GUANAJUATO","11DPT0002P",100,"QUOG780110GB9","QUOG780110HGTNRN00","GONZALO  QUINTANA  ORTEGA ",3,20,1130,3102,"01",29,"TA",18,204055,3,null,20151001,20151231,0,0]
[null,"GUANAJUATO","11DPT0002P",100,"RACM561219L8A","RACM561219HGTMNR07","MARIO RAMÍREZ CONTRERAS",3,19,1130,3102,"01",29,"PB",10,204056,3,null,20151001,20151231,0,0]
[null,"GUANAJUATO","11DPT0009I",100,"RAPB721103D6A","RAPB721103MMNMZT09","BEATRIZ EUGENIA RAMOS PAZ",3,20,1130,3102,"01",74,"PA",15,204059,3,null,20151001,20151231,0,0]
[null,"GUANAJUATO","11DPT0004N",120,"REBJ861120CG2","REBJ861120HGTYNN00","JUAN CARLOS REYNOSO BANDERAS",3,8,1710,3102,"01",28,"PA",31,204106,3,null,20151001,20151231,0,0]
[null,"GUANAJUATO","11DPT0011X",120,"RICA770621C14","RICA770621HDFCRL02","ALEJANDRO RICO CARMONA",3,15,1130,3102,"01",49,"PA",15,204060,3,null,20151001,20151231,0,0]
[null,"GUANAJUATO","11DPT0010Y",120,"ROBJ680311LG6","ROBJ680311HGTCDR06","JORGE VICENTE ROCHA BEDIA",3,21,1710,3102,"01","04","PB",28,204063,3,null,20151001,20151231,0,0]
[null,"GUANAJUATO","11DPT0009I",100,"ROFA780327DH3","ROFA780327HGTDLL03","JOSE ALVARO RODRIGUEZ FLORES",3,16,1130,3102,"01",74,"PA",15,204114,3,null,20151001,20151231,0,0]
[null,"GUANAJUATO","11DPT0009I",100,"ROGA700124964","ROGA700124MGTCZN09","ANA ELENA ROCHA GUZMÁN",3,10,1130,3102,"01",74,"PB",16,204064,3,null,20151001,20151231,0,0]
[null,"GUANAJUATO","11DPT0012W",120,"ROHA790902MQ8","ROHA790902HGTDRL09","ALEJANDRO RODRIGUEZ HERNANDEZ",3,20,1130,3102,"01","02","PB",18,204115,3,null,20151001,20151231,0,0]
[null,"GUANAJUATO","11DPT0001Q",120,"ROMO790623E30","ROMO790623HGTSRL08","OLIMPO ROSILLO MORENO",3,15,1130,3102,"01",28,"PB",20,204066,3,null,20151001,20151231,0,0]
[null,"GUANAJUATO","11DPT0011X",100,"ROMR620310CS2","ROMR620310MDFMNC01","ROCÍO ROMERO MENA",3,10,1130,3102,"01",49,"PC",20,204065,3,null,20151001,20151231,0,0]
[null,"GUANAJUATO","11DPT0007K",120,"SAMD841004000","SAMD841004MGTNLN03","DINORHA GEORGINA SANTIAGO MELCHOR",3,12,1710,3102,"01","03","PA",12,204096,3,null,20151001,20151231,0,0]
[null,"GUANAJUATO","11DPT0014U",120,"SOGC7802151Z2","SOGC780215MDFLRL01","CLAUDIA SOLACHE GARCÍA",3,20,1130,3102,"01","03","PB",20,204067,3,null,20151001,20151231,0,0]
[null,"GUANAJUATO","11DPT0009I",100,"TEAA800207442","TEAA800207MGTRGL00","ALEJANDRA ISABEL TREJO AGUILAR",3,10,1130,3102,"01",74,"PC",15,204069,3,null,20151001,20151231,0,0]
[null,"GUANAJUATO","11DPT0006L",120,"VELL651008V35","VELL651008MDFLGR02","MARÍA DE LOURDES JUANA VELÁZQUEZ LUGO",3,14,1710,3102,"01",63,"PB",11,204070,3,null,20151001,20151231,0,0]
[null,"GUANAJUATO","11DPT0001Q",100,"VESX850703GKA","VESX850703MGTLLC16","XOCHITL TOMASA VELÁZQUEZ SILVA",3,25,1130,3102,"01",28,"PB",24,204071,3,null,20151001,20151231,0,0]
[null,"GUANAJUATO","11DPT0002P",100,"VIMU840526EL5","VIMU840526HDFLRR00","URIEL ALEJANDRO VILLÁGOMEZ MARTÍNEZ",3,17,1130,3102,"01",29,"TA",25,204072,3,null,20151001,20151231,0,0]
[null,"GUANAJUATO","11DPT0001Q",100,"AALJ750316LPA","AALJ750316HGTYLS05","JOSE  AYALA  LULE ",3,24,1130,3102,"01",28,"PB",12,249007,3,null,20151001,20151231,0,0]
[null,"GUANAJUATO","11DPT0007K",120,"AAME860903","AAME860903HMNLDD08","EDGAR ALAN ALFARO MEDINA",3,17,1710,3102,"01","03","PC",25,249138,3,null,20151001,20151231,0,0]
[null,"GUANAJUATO","11DPT0013V",120,"AOGE690325D41","AOGE690325HGTBZM07","EMILIO ABONCE GUZMAN",3,12,1130,3102,"01","02","PB",15,249002,3,null,20151001,20151231,0,0]
[null,"GUANAJUATO","11DPT0010Y",100,"AUGJ780722V55","AUGJ780722HGTGMN00","JUAN SIMON  AGUILAR  GOMEZ ",3,15,1710,3102,"01","04","PC",8,249003,3,null,20151001,20151231,0,0]
[null,"GUANAJUATO","11DPT0008J",120,"CABG7405015A5","CABG740501MGTSRB06","GABRIELA  CASTRO  BARBOSA ",3,30,1130,3102,"01",33,"PB",20,249014,3,null,20151001,20151231,0,0]
[null,"GUANAJUATO","11DPT0004N",100,"CAER830626JA4","CAER830626MGTRSY00","REYNA LILIANA  CARDOSO  ESCUTIA ",3,15,1130,3102,"01",28,"PA",9,249011,3,null,20151001,20151231,0,0]
[null,"GUANAJUATO","11DPT0011X",100,"CARH670101MS3","CARH670101HGTRZC08","HECTOR  CARDENAS  RUIZ ",3,18,1130,3102,"01",49,"PB",18,249010,3,null,20151001,20151231,0,0]
[null,"GUANAJUATO","11DPT0003O",120,"CILH750107147","CILH750107MGTSPL00","HILDA LUCIA  CISNEROS  LOPEZ ",3,15,1210,3102,"01",30,"PB",16,249015,3,null,20151001,20151231,0,0]
[null,"GUANAJUATO","11DPT0012W",100,"DICJ590119T4A","DICJ590119HGTZCS01","JOSE  DIAZ  COCILION ",3,40,1130,3102,"01","02","PB",8,249016,3,null,20151001,20151231,0,0]
[null,"GUANAJUATO","11DPT0011X",100,"EAMA860511UL8","EAMA860511MMNSRN08","ANA LUCIA ESCALANTE MARIN",3,15,1130,3102,"01",49,"PA",25,249017,3,null,20151001,20151231,0,0]
[null,"GUANAJUATO","11DPT0003O",120,"FAMD850123CZ0","FAMD850123HGTLNN04","DANIEL  FALCON  MONROY ",3,20,1210,3102,"01",30,"PA",19,249086,3,null,20151001,20151231,0,0]
[null,"GUANAJUATO","11DPT0007K",120,"GAAM880803SI2","GAAM880803MGTNLR00","MARIANA GANTES ALCANTAR",3,19,1710,3102,"01","03","PA",15,249128,3,null,20151001,20151231,0,0]
[null,"GUANAJUATO","11DPT0002P",120,"GAFM620222JY6","GAFM620222HGTRLN19","JOSE MANUEL  GARCIA  FLORES ",3,15,1130,3102,"01",29,"PB",20,249020,3,null,20151001,20151231,0,0]
[null,"GUANAJUATO","11DPT0011X",100,"GALL871108","GALL871108MGTRPL08","LILIANA GARCIA LOPEZ",3,23,1130,3102,"01",49,"TA",20,249139,3,null,20151001,20151231,0,0]
[null,"GUANAJUATO","11DPT0010Y",100,"GAMB800204HK9","GAMB800204MGTRRR01","BERENICE ELENA MARIA GARCIA MARQUEZ",3,26,1710,3102,"01","04","PB",15,249021,3,null,20151001,20151231,0,0]
[null,"GUANAJUATO","11DPT0007K",120,"GARR8203151UA","GARR820315HHGRBY08","REYMUNDO GARCIA ROBLES",3,10,1130,3102,"01","03","PC",13,249102,3,null,20151001,20151231,0,0]
[null,"GUANAJUATO","11DPT0007K",120,"GOVE850725","GOVE850725HTSMLD03","EDUARDO GOMEZ VILLAGOMEZ",3,16,1710,3102,"01","03","PA",10,249137,3,null,20151001,20151231,0,0]
[null,"GUANAJUATO","11DPT0006L",100,"GUCT560830E19","GUCT560830MGTRSR17","MA TERESA GUERRERO CASTRO",3,10,1710,3102,"01",63,"PB",22,249025,3,null,20151001,20151231,0,0]
[null,"GUANAJUATO","11DPT0007K",100,"HECM670422CC4","HECM670422MDFRBR02","MARIA MARCELA  HERRERA  CEBALLOS ",3,13,1710,3102,"01","03","PC",20,249026,3,null,20151001,20151231,0,0]
[null,"GUANAJUATO","11DPT0012W",120,"HEJJ860302000","HEJJ860302HGTRMN01","JUAN CARLOS  HERNANDEZ  JIMENEZ ",3,25,1130,3102,"01","02","PC",10,249001,3,null,20151001,20151231,0,0]
[null,"GUANAJUATO","11DPT0006L",100,"LIRK810903L47","LIRK810903MCHNLR02","KARLA ROCIO LINO DEL REAL",3,15,1710,3102,"01",63,"PC",10,249083,3,null,20151001,20151231,0,0]
[null,"GUANAJUATO","11DPT0003O",120,"LUCF7002115Q9","LUCF700211HGTLND05","FIDEL  LULE  CONTRERAS ",3,17,1130,3102,"01",30,"TA",6,249028,3,null,20151001,20151231,0,0]
[null,"GUANAJUATO","11DPT0008J",120,"LUML8603214V6","LUML860321MGTNDN02","LINA LUNA MEDINA",3,25,1130,3102,"01",33,"PC",13,249096,3,null,20151001,20151231,0,0]
[null,"GUANAJUATO","11DPT0009I",100,"MABR8302104V5","MABR830210HGTRRB02","ROBERTO  MARTINEZ  BARRERA ",3,15,1130,3102,"01",74,"PA",15,249029,3,null,20151001,20151231,0,0]
[null,"GUANAJUATO","11DPT0011X",120,"MAHA821225TQ5","MAHA821225MGTRRL02","ALEJANDRA  MARTINEZ  HERNANDEZ ",3,18,1130,3102,"01",49,"PB",15,249030,3,null,20151001,20151231,0,0]
[null,"GUANAJUATO","11DPT0001Q",100,"MAPJ880510","MAPJ880510MGTRXS01","MARIA DE JESUS MARTINEZ PEÑA",3,20,1130,3102,"01",28,"PB",20,249148,3,null,20151001,20151231,0,0]
[null,"GUANAJUATO","11DPT0003O",120,"MAST560810KJ7","MAST560810HGTRNR00","J. TRINIDAD  MARTINEZ  SANCHEZ ",3,20,1210,3102,"01",30,"PB",15,249032,3,null,20151001,20151231,0,0]
[null,"GUANAJUATO","11DPT0004N",120,"MERA6410168B4","MERA641016HGTDZL14","ALEJANDRO MEDINA REZA",3,18,1710,3102,"01",28,"PB",15,249033,3,null,20151001,20151231,0,0]
[null,"GUANAJUATO","11DPT0010Y",100,"MUAO8512081H3","MUAO851208HGTXCS06","OSCAR  MUÑOZ ACEVEDO ",3,31,1710,3102,"01","04","PC",18,249035,3,null,20151001,20151231,0,0]
[null,"GUANAJUATO","11DPT0011X",100,"NACJ810605U92","NACJ810605HGTRRR09","JORGE ALBERTO NARVAEZ CARDOSO",3,22,1130,3102,"01",49,"PA",20,249036,3,null,20151001,20151231,0,0]
[null,"GUANAJUATO","11DPT0006L",100,"PACM790918HT8","PACM790918HGTNRR13","MAURICIO  PANIAGUA  CARRILLO ",3,15,1710,3102,"01",63,"PC",15,249040,3,null,20151001,20151231,0,0]
[null,"GUANAJUATO","11DPT0010Y",100,"PACM9001045J2","PACM900104MGTNRR08","MIRIAM EDITH PANIAGUA CARRILLO",3,26,1710,3102,"01","04","PB",10,249125,3,null,20151001,20151231,0,0]
[null,"GUANAJUATO","11DPT0012W",120,"PEHS851206000","PEHS851206HGTXRL09","JOSE SALUD PEÑA HERNANDEZ",3,15,1130,3102,"01","02","PA",15,249042,3,null,20151001,20151231,0,0]
[null,"GUANAJUATO","11DPT0010Y",120,"RAGE851021JI8","RAGE851021MGTYML08","ELVIA SUSANA RAYA GOMEZ",3,20,1710,3102,"01","04","PC",20,249101,3,null,20151001,20151231,0,0]
[null,"GUANAJUATO","11DPT0003O",120,"RAGF920620","RAGF920620MGTYRR08","MARIA FERNANDA RAYA GUERRERO",3,18,1210,3102,"01",30,"PC",20,249150,3,null,20151001,20151231,0,0]
[null,"GUANAJUATO","11DPT0009I",100,"RIOL830629124","RIOL830629MGTVJZ05","MARIA DE LA LUZ RIVERA OJEDA",3,25,1130,3102,"01",74,"PB",11,249126,3,null,20151001,20151231,0,0]
[null,"GUANAJUATO","11DPT0006L",100,"RISA740722842","RISA740722MGTCNL08","ALEJANDRA  RICALDE  SANCHEZ ",3,10,1710,3102,"01",63,"PB",20,249045,3,null,20151001,20151231,0,0]
[null,"GUANAJUATO","11DPT0010Y",100,"SACF740918BK7","SACF740918HJCNML11","FELIX SANCHEZ CAMPOS",3,28,1130,3102,"01","04","PB",10,249049,3,null,20151001,20151231,0,0]
[null,"GUANAJUATO","11DPT0008J",120,"SACM860807000","SACM860807HGTMMN00","JOSE MANUEL  SAMANO  CAMARGO ",3,30,1130,3102,"01",33,"PB",20,249085,3,null,20151001,20151231,0,0]
[null,"GUANAJUATO","11DPT0005M",120,"SAOF7912075J9","SAOF791207HGTLRR02","FRANCISCO JAVIER  SALGADO ORTIZ",3,25,1130,3102,"01",72,"PC",10,249048,3,null,20151001,20151231,0,0]
[null,"GUANAJUATO","11DPT0006L",100,"SAPG631009QMA","SAPG631009MGTNRD02","MA GUADALUPE  SANCHEZ  PARRA ",3,23,1710,3102,"01",63,"PC",15,249051,3,null,20151001,20151231,0,0]
[null,"GUANAJUATO","11DPT0010Y",100,"SIPH640527P81","SIPH640527HGTRRG09","HUGO EVERARDO  SIERRA  PARADA ",3,8,1130,3102,"01","04","PB",22,249052,3,null,20151001,20151231,0,0]
[null,"GUANAJUATO","11DPT0008J",120,"TOCR790420PZ9","TOCR790420HGTRRB01","RUBEN  TORRES  CARMONA ",3,21,1130,3102,"01",33,"PC",20,249053,3,null,20151001,20151231,0,0]
[null,"GUANAJUATO","11DPT0003O",120,"ZAMJ740416EMO","ZAMJ740416HDFMXR00","JORGE ZAMORA MUÑIZ",3,20,1210,3102,"01",30,"PA",18,249056,3,null,20151001,20151231,0,0]
[null,"GUANAJUATO","11DPT0001Q",100,"AARO850826GKA","AARO850826HGTMVR08","ORLANDO AMAYA RIVERA",3,20,1130,3102,"01",28,"PB",30,511203,3,null,20151001,20151231,0,0]
[null,"GUANAJUATO","11DPT0003O",120,"AEDI770518OLA","AEDI770518HGTRRS01","ISRAEL ARMANDO ARREDONDO  DORANTES",3,10,1130,3102,"01",30,"PA",20,27002,3,null,20151001,20151231,0,0]
[null,"GUANAJUATO","11DPT0001Q",100,"AEPI820115AQ1","AEPI820115MDFRLS04","ISABEL ARREDONDO PLATA",3,20,1130,3102,"01",28,"PA",10,27000,3,null,20151001,20151231,0,0]
[null,"GUANAJUATO","11DPT0010Y",120,"AUMA910826000","AUMA910826MGTGXL03","ALEJANDRA AGUILLON MUÑOZ",3,14,1710,3102,"01","04","TA",12,270014,3,null,20151001,20151231,0,0]
[null,"GUANAJUATO","11DPT0007K",120,"AUMJ800706AM9","AUMJ800706HMCGRL14","JOEL AGUILLON MORALES",3,13,1710,3102,"01","03","PC",37,270001,3,null,20151001,20151231,0,0]
[null,"GUANAJUATO","11DPT0007K",120,"BAAJ771007440","BAAJ771007HGTSLV00","JAVIER BASALDUA ALVAREZ",3,9,1710,3102,"01","03","PB",35,27000,3,null,20151001,20151231,0,0]
[null,"GUANAJUATO","11DPT0003O",120,"BAMV8801104X4","BAMV880110MGTRNR09","VERONICA GUADALUPE BRAVO MONTES",3,20,1130,3102,"01",30,"PB",10,270161,3,null,20151001,20151231,0,0]
[null,"GUANAJUATO","11DPT0010Y",100,"BASC910503127","BASC910503MGTZNR03","MARIA CRUZ BAEZA SANCHEZ",3,15,1710,3102,"01","04","PC",25,270009,3,null,20151001,20151231,0,0]
[null,"GUANAJUATO","11DPT0003O",120,"CACV851205PW0","CACV851205MQTRRR00","VERA CABELLO  CORONA",3,15,1130,3102,"01",30,"PB",30,27005,3,null,20151001,20151231,0,0]
[null,"GUANAJUATO","11DPT0009I",100,"CASL890905LA5","CASL890905HDFBRS01","LUIS EDGAR CABEZA SUAREZ",3,15,1130,3102,"01",74,"PA",8,511162,3,null,20151001,20151231,0,0]
[null,"GUANAJUATO","11DPT0010Y",120,"EIHA7010296Z8","EIHA701029HGTSRL01","ALEJANDRO ESPINOSA HERNANDEZ",3,16,1710,3102,"01","04","PA",10,27007,3,null,20151001,20151231,0,0]
[null,"GUANAJUATO","11DPT0014U",120,"GACI810611U19","GACI810611HGTRRS03","JOSE ISRAEL GARCIA CORONA",3,16,1130,3102,"01","03","PB",12,511190,3,null,20151001,20151231,0,0]
[null,"GUANAJUATO","11DPT0007K",120,"GARB840625CP8","GARB840625MQTLDR08","BRENDA LIDIA GALLEGOS RODRIGUEZ",3,25,1130,3102,"01","03","PC",29,270008,3,null,20151001,20151231,0,0]
[null,"GUANAJUATO","11DPT0010Y",120,"GOHS8907177Z1","GOHS890717MQTMRN05","SANDRA IRAIS GOMEZ HERNANDEZ",3,33,1710,3102,"01","04","TA",30,270008,3,null,20151001,20151231,0,0]
[null,"GUANAJUATO","11DPT0001Q",100,"GORC720101Q12","GORC720101MMNNBR04","CRISTINA GONZALEZ ROBLES",3,20,1130,3102,"01",28,"PA",28,270178,3,null,20151001,20151231,0,0]
[null,"GUANAJUATO","11DPT0007K",120,"GOZV911104PZ4","GOZV911104HGTNMC06","VICTOR HUGO GONZALEZ ZAMUDIO",3,10,1710,3102,"01","03","PB",10,270011,3,null,20151001,20151231,0,0]
[null,"GUANAJUATO","11DPT0010Y",120,"GUSA851101LLA","GUSA851101MGTLTN00","MARIA DE LOS ANGELES GUALITO SOTO",3,15,1710,3102,"01","04","PC",16,270008,3,null,20151001,20151231,0,0]
[null,"GUANAJUATO","11DPT0007K",120,"HEMJ750321M79","HEMJ750321HPLRRV10","JAVIER HERRERA MARTINEZ",3,20,1710,3102,"01","03","PC",11,511181,3,null,20151001,20151231,0,0]
[null,"GUANAJUATO","11DPT0012W",120,"LOHF8609268M2","LOHF860926MGTPRR03","MARIA FERNANDA LOPEZ HERNANDEZ",3,20,1130,3102,"01","02","PA",10,511208,3,null,20151001,20151231,0,0]
[null,"GUANAJUATO","11DPT0011X",120,"LOVE8010111T5","LOVE801011HDFPZD02","EDGAR LOPEZ VAZQUEZ",3,24,1130,3102,"01",49,"PB",8,511200,3,null,20151001,20151231,0,0]
[null,"GUANAJUATO","11DPT0008J",120,"LOZE710604574","LOZE710604MGTZRG00","MA. EUGENIA LOZADA ZARAZUA ",3,15,1130,3102,"01",33,"PA",10,27016,3,null,20151001,20151231,0,0]
[null,"GUANAJUATO","11DPT0010Y",120,"MASA840303K12","MASA840303MDFRNN08","MARIA DE LOS ANGELES MARTINEZ SANCHEZ",3,15,1710,3102,"01","04","PC",20,270007,3,null,20151001,20151231,0,0]
[null,"GUANAJUATO","11DPT0013V",120,"MEGR720113GQ8","MEGR720113HMNRNM02","RAMIRO MERCADO  GONZALEZ",3,10,1130,3102,"01","02","PB",10,270018,3,null,20151001,20151231,0,0]
[null,"GUANAJUATO","11DPT0012W",100,"MESL721106M79","MESL721106HMCNNC01","LUCIANO MENDOZA SANCHEZ",3,15,1130,3102,"01","02","PB",25,270163,3,null,20151001,20151231,0,0]
[null,"GUANAJUATO","11DPT0010Y",120,"MOHS911002127","MOHS911002HMCNRR00","SERGIO MONTES DE OCA HURTADO",3,15,1710,3102,"01","04","TA",10,270015,3,null,20151001,20151231,0,0]
[null,"GUANAJUATO","11DPT0010Y",100,"NOIG870606719","NOIG870606HMCGNS09","GUSTAVO NOGUEZ INIESTA",3,16,1710,3102,"01","04","PB",10,270165,3,null,20151001,20151231,0,0]
[null,"GUANAJUATO","11DPT0012W",120,"OIMG610814NA3","OIMG610814MGTRLD00","MA. GUADALUPE ORTIZ MELENDEZ",3,10,1130,3102,"01","02","PB",25,27026,3,null,20151001,20151231,0,0]
[null,"GUANAJUATO","11DPT0010Y",120,"PABJ671110D69","PABJ671110HJCLRS08","JOSE DE JESUS PLASCENCIA BARAJAS",3,22,1710,3102,"01","04","TA",15,27031,3,null,20151001,20151231,0,0]
[null,"GUANAJUATO","11DPT0014U",120,"PARB8612287J6","PARB861228MGTCDR09","BARBARA PALOMA PACHECO  RODRIGUEZ",3,10,1130,3102,"01","03","PB",24,27027,3,null,20151001,20151231,0,0]
[null,"GUANAJUATO","11DPT0008J",120,"PASA661227JN5","PASA661227HDFCLL05","ALBERTO ARTURO PACHECO SILVA",3,24,1130,3102,"01",33,"PC",10,511192,3,null,20151001,20151231,0,0]
[null,"GUANAJUATO","11DPT0003O",120,"PEBG910930PM0","PEBG910930MQTRCD18","MARIA GUADALUPE PEREZ BECERRA",3,20,1210,3102,"01",30,"PC",10,270013,3,null,20151001,20151231,0,0]
[null,"GUANAJUATO","11DPT0008J",120,"PEGA8608144V9","PEGA860814MGTRTD07","MARIA AIDA PEREZ  GUTIERREZ ",3,25,1130,3102,"01",33,"PC",40,27029,3,null,20151001,20151231,0,0]
[null,"GUANAJUATO","11DPT0009I",100,"PEGR750725A34","PEGR750725HDFRTC00","RICARDO PEREZ GUTIERREZ",3,21,1130,3102,"01",74,"TA",15,270011,3,null,20151001,20151231,0,0]
[null,"GUANAJUATO","11DPT0007K",120,"PEQP6003137R3","PEQP600313MQTRNT01","PATRICIA ANTONIA PEREZ  QUINTERO ",3,15,1710,3102,"01","03","PA",32,27030,3,null,20151001,20151231,0,0]
[null,"GUANAJUATO","11DPT0007K",120,"RIHS8511232P3","RIHS851123MGTVRC00","MARIA SOCORRO RIVERA HERNANDEZ",3,18,1710,3102,"01","03","PC",37,27038,3,null,20151001,20151231,0,0]
[null,"GUANAJUATO","11DPT0012W",120,"ROEL820326QF8","ROEL820326MGTCSZ05","MARIA DE LA LUZ ROCHA  ESCOBAR ",3,23,1130,3102,"01","02","PC",30,270040,3,null,20151001,20151231,0,0]
[null,"GUANAJUATO","11DPT0011X",100,"ROFD810129RM2","ROFD810129HDFDNV09","DAVID IGNACIO RODRIGUEZ FUENTES",3,8,1130,3102,"01",49,"PB",10,511271,3,null,20151001,20151231,0,0]
[null,"GUANAJUATO","11DPT0005M",120,"ROFM640322BG7","ROFM640322HGTMRR00","MARTIN ROMERO  FERRO ",3,30,1130,3102,"01",72,"PB",15,270044,3,null,20151001,20151231,0,0]
[null,"GUANAJUATO","11DPT0007K",120,"ROGJ7510022G2","ROHJ751002HGTDNX00","JOEL  RODRIGUEZ  GONZALEZ",3,10,1710,3102,"01","03","TA",11,27041,3,null,20151001,20151231,0,0]
[null,"GUANAJUATO","11DPT0011X",100,"RORE431022TB0","RORE431022HGTDMD08","EDILBERTO RODRIGUEZ ROMERO",3,12,1130,3102,"01",49,"TA",20,270130,3,null,20151001,20151231,0,0]
[null,"GUANAJUATO","11DPT0004N",100,"RORJ620506HP8","RORJ620506HTLDMN05","JUAN RODRIGUEZ ROMERO",3,12,1710,3102,"01",28,"PB",17,27043,3,null,20151001,20151231,0,0]
[null,"GUANAJUATO","11DPT0006L",100,"SAGE751202C27","SAGE751202HGTLLD01","EDGAR RICARDO SALINAS GUALITO",3,18,1710,3102,"01",63,"PA",30,270011,3,null,20151001,20151231,0,0]
[null,"GUANAJUATO","11DPT0002P",100,"SAPG700911SZ4","SAPG700911HDFNRS05","GUSTAVO SANCHEZ  PEREZ ",3,20,1130,3102,"01",29,"PB",40,27046,3,null,20151001,20151231,0,0]
[null,"GUANAJUATO","11DPT0010Y",120,"SARN921110T2A","SARN921110HGTNMX07","JOSE NOE SANABRIA MARTINEZ",3,12,1710,3102,"01","04","PB",16,511207,3,null,20151001,20151231,0,0]
[null,"GUANAJUATO","11DPT0014U",100,"SATE820405F51","SATE820405MGTNRV00","EVA MARIA DEL ROSARIO SANCHEZ TURRUBIARTES",3,10,1130,3102,"01","03","PB",15,27047,3,null,20151001,20151231,0,0]
[null,"GUANAJUATO","11DPT0005M",120,"SAVD840330123","SAVD840330MCLLGL06","DULCE IRENE SALINAS VEGA",3,20,1130,3102,"01",72,"PA",10,270014,3,null,20151001,20151231,0,0]
[null,"GUANAJUATO","11DPT0012W",120,"SOMJ860107SDA","SOMJ860107MTSSNS08","JESSICA SOSA MENA",3,40,1130,3102,"01","02","PA",22,270158,3,null,20151001,20151231,0,0]
[null,"GUANAJUATO","11DPT0009I",100,"SORR730605V46","SORR730605HDFTMD03","RODOLFO SOTO  ROMERO ",3,20,1130,3102,"01",74,"PB",15,270051,3,null,20151001,20151231,0,0]
[null,"GUANAJUATO","11DPT0006L",100,"SOZC590907935","SOZC590907HQTRXN08","JOSE CONRADO SORIA  ZUÑIGA ",3,20,1130,3102,"01",63,"PB",26,27049,3,null,20151001,20151231,0,0]
[null,"GUANAJUATO","11DPT0014U",120,"VAMG850109N64","VAMG850109MBSZNB01","GABRIELA VAZQUEZ MONJARAZ",3,10,1130,3102,"01","03","PB",36,270052,3,null,20151001,20151231,0,0]
[null,"GUANAJUATO","11DPT0012W",120,"VAPG660502A11","VAPG660502HMCZRR05","GERMAN VAZQUEZ PERALTA",3,15,1130,3102,"01","02","PA",28,27053,3,null,20151001,20151231,0,0]
[null,"GUANAJUATO","11DPT0009I",100,"ZABA871015J40","ZABA871015HGTRCM04","AMANDO ZARAZUA BECERRA",3,15,1130,3102,"01",74,"PC",15,270015,3,null,20151001,20151231,0,0]
[null,"GUANAJUATO","11DPT0013V",120,"ZAGE8607139H0","ZAGE860713HDFRTN06","ENRIQUE ALFONSO ZARAZUA GUTIERREZ",3,20,1130,3102,"01","02","PA",15,511202,3,null,20151001,20151231,0,0]
[null,"GUANAJUATO","11DPT0006L",120,"ZARI821025R29","ZARI821025MGTRBG09","MARIA IGNACIA ZARAZUA  RUBIO ",3,10,1710,3102,"01",63,"PC",25,27054,3,null,20151001,20151231,0,0]
[null,"GUANAJUATO","11DPT0004N",120,"ZARJ781201E25","ZARJ781201HGTRNS07","JESUS ZARAZUA RANGEL",3,16,1130,3102,"01",28,"PC",10,270010,3,null,20151001,20151231,0,0]
[null,"GUANAJUATO","11DPT0007K",120,"AAAL5409208IA","AAXA540920HDFLXL04","JOSE ALEJANDRO ALVAREZ ",3,20,1130,3102,"01","03","PB",20,302003,3,null,20151001,20151231,0,0]
[null,"GUANAJUATO","11DPT0009I",100,"AAMT550321C79","AAMT550321MGTLRR02","MARIA TERESA ALVAREZ MARES",3,6,1130,3102,"01",74,"PA",17,302004,3,null,20151001,20151231,0,0]
[null,"GUANAJUATO","11DPT0010Y",120,"BURL821104LM8","BURL821104MGTTMT09","LETICIA BUTANDA RAMIREZ",3,16,1130,3102,"01","04","PC",30,302006,3,null,20151001,20151231,0,0]
[null,"GUANAJUATO","11DPT0007K",120,"CAMJ670419324","CAMJ670419HGTRRS00","JOSE DE JESUS CARRILLO MARTINEZ",3,15,1710,3102,"01","03","PC",16,302120,3,null,20151001,20151231,0,0]
[null,"GUANAJUATO","11DPT0009I",100,"COML571122DD6","COML571122MGTRRT18","LETICIA CORNEJO MARTINEZ",3,11,1130,3102,"01",74,"PC",16,302009,3,null,20151001,20151231,0,0]
[null,"GUANAJUATO","11DPT0009I",100,"DOIB750304RM3","DOIB750304HGTRNN07","BENJAMIN DORANTES INFANTE",3,15,1130,3102,"01",74,"PB",17,302011,3,null,20151001,20151231,0,0]
[null,"GUANAJUATO","11DPT0009I",100,"DULJ8108233XA","DULJ810823HGTQPN02","JUAN IGNACIO DUQUE LOPEZ",3,20,1130,3102,"01",74,"PA",25,302042,3,null,20151001,20151231,0,0]
[null,"GUANAJUATO","11DPT0011X",100,"EILL500310BA8","EILL500310MDFLLL09","LILIA SUSANA ELIZALDE LLOPIS",3,20,1130,3102,"01",49,"PA",21,302117,3,null,20151001,20151231,0,0]
[null,"GUANAJUATO","11DPT0011X",100,"GOAJ880125GX4","GOAJ880125HGTNLS06","JOSUE ABRAHAM GONZALEZ ALCANTAR",3,15,1130,3102,"01",49,"TA",20,302092,3,null,20151001,20151231,0,0]
[null,"GUANAJUATO","11DPT0006L",100,"LORM590406948","LORM590406MGTPDD05","MA GUADALUPE LOPEZ RODRIGUEZ",3,8,1130,3102,"01",63,"PC",30,302020,3,null,20151001,20151231,0,0]
[null,"GUANAJUATO","11DPT0007K",120,"LOSC860106KF2","LOSC860106HGTPRH07","CHRISTIAN EMMANUEL LOPEZ SUAREZ",3,10,1710,3102,"01","03","TA",15,302114,3,null,20151001,20151231,0,0]
[null,"GUANAJUATO","11DPT0004N",100,"MAEC690729XXX","MAEC690729MGTTSL04","CLAUDIA MATA ESTRADA",3,12,1710,3102,"01",28,"PA",20,302057,3,null,20151001,20151231,0,0]
[null,"GUANAJUATO","11DPT0002P",100,"MAMF050210ZPA","MAFM770502MGTCNR08","MARICRUZ MACIAS FUENTES",3,20,1130,3102,"01",29,"PA",10,302129,3,null,20151001,20151231,0,0]
[null,"GUANAJUATO","11DPT0006L",100,"MARM860927B16","MARM860927MGTRVN09","MARIA MONTSERRAT MARES RIVERA",3,10,1710,3102,"01",63,"PB",15,302093,3,null,20151001,20151231,0,0]
[null,"GUANAJUATO","11DPT0009I",100,"MEGC861127FF5","MEGC861127HGTZRR00","CARLOS FRANCISCO MEZA GARCIA",3,11,1130,3102,"01",74,"TA",10,302056,3,null,20151001,20151231,0,0]
[null,"GUANAJUATO","11DPT0008J",120,"MORJ631227S89","MORJ631227HGTTMN01","JUAN  MOTA RAMIREZ",3,26,1130,3102,"01",33,"PC",19,302025,3,null,20151001,20151231,0,0]
[null,"GUANAJUATO","11DPT0012W",100,"OINM651022J76","OINM651022HGTRVR07","MARTIN ORTIZ NAVARRO",3,36,1130,3102,"01","02","PB",20,302111,3,null,20151001,20151231,0,0]
[null,"GUANAJUATO","11DPT0006L",100,"RAEM750806613","RAEM750806MDFMLN07","MONICA MARCELA RAMIREZ ELIZALDE",3,20,1710,3102,"01",63,"PA",10,302058,3,null,20151001,20151231,0,0]
[null,"GUANAJUATO","11DPT0006L",100,"REDA870319HH9","REDA870319HGTGVR03","ARTURO REGALADO DAVILA",3,20,1710,3102,"01",63,"PB",16,302094,3,null,20151001,20151231,0,0]
[null,"GUANAJUATO","11DPT0012W",120,"SAPJ7305052R5","SAPJ730505HGTNRN06","JUAN CARLOS SANCHEZ PEREZ",3,28,1130,3102,"01","02","PA",20,302035,3,null,20151001,20151231,0,0]
[null,"GUANAJUATO","11DPT0003O",120,"SECJ780511UPA","SECJ780511MGTRHN02","JUANA MARIA CONCEPCION SERRANO CHAGOYA",3,10,1130,3102,"01",30,"PA",20,302096,3,null,20151001,20151231,0,0]
[null,"GUANAJUATO","11DPT0009I",100,"VIBM750212ED8","VIBM750212MDFLRN06","MONICA VILCHIS BARCENAS",3,20,1130,3102,"01",74,"PB",25,302039,3,null,20151001,20151231,0,0]
[null,"GUANAJUATO","11DPT0003O",120,"RIMF850611721","RIMF850611MGTNJB09","FABIOLA RINCON  MOJICA",3,20,1210,3102,"01",30,"PA",18,303013,3,null,20151001,20151231,0,0]
[null,"GUANAJUATO","11DPT0003O",120,"SAPG841029F61","SAPG841029HGTNRD01","JOSE GUADALUPE SANDOVAL PEREZ",3,16,1130,3102,"01",30,"TA",30,303027,3,null,20151001,20151231,0,0]
[]
[]
[]
[]
[]
[]
[]
[]
[]
[]
[]
[]
[]
[]
[]
[]
[null,"Total Personas : ",null,{"$f":"COUNT(D16:D1045)","v":1030},null,null,null,null,null,null,null,null,null,"Total Plazas : ",null,{"$f":"COUNT(P16:P1045)","v":1030},null,null,"Total Pto. Federal",null,{"$f":"SUBTOTAL(109,Tabla12[Percepciones pagadas en el Periodo de Comisión con Presupuesto Federal*])","v":2022529.5699999998}]
[]
[null,null,null,null,null,null,null,null,null,null,null,null,null,null,null,null,null,null,"Total Ppto. Otras Fuentes:",null,null,{"$f":"SUM(V16:V1063)","v":0}]
[]
[null,"*Total de Percepciones reportadas por la Entidad Federativa como pagadas al trabajador durante la comisión."]
[null,"Fuente : Información proporcionada por las Entidades Federativas"]

{"sheet":"II D) 2","index":6,"n_rows":25,"n_cols":19,"rows_kept":25,"cut":false,"hidden":false,"merged":[[8,1,8,9],[11,0,12,0],[11,1,12,1],[11,5,12,5],[11,2,12,2],[11,3,12,3],[11,4,12,4],[11,16,12,16],[11,15,12,15],[11,17,12,17],[11,18,12,18],[11,6,11,12],[11,13,12,13],[11,14,12,14]]}
[]
[]
[]
[]
[]
[]
[]
[null,"Formato: Movimientos de Plazas"]
[null,{"$f":"IF('Caratula Resumen'!D22=\"Elige el Periodo…\",\"\",'Caratula Resumen'!D22)","v":"Fondo de Aportaciones para la Educación Tecnológica y de Adultos/Colegio Nacional de Educación Profesional Técnica (FAETA/CONALEP)"},null,null,null,null,null,null,null,null,null,null,null,null,null,null,null,{"$f":"IF('Caratula Resumen'!D23=\"Elige el Periodo…\",\"\",'Caratula Resumen'!D23)","v":"4to. Trimestre"}]
[]
[]
[null,"Entidad Federativa","RFC","CURP","Nombre","Origen Presupuestal\n de la plazas","Clave Presupuestal",null,null,null,null,null,null,"Clave de nivel de puesto","Clave de nivel de sueldo","Zona Económica","Tipo de movimiento","Quincena Inicial","Quincena Final"]
[null,null,null,null,null,null,"Partida Presupuestal","Código de Pago","Clave de Unidad","Clave de Sub Unidad","Clave de Categoría","Horas Semana Mes ","Número de Plaza"]
[]
[null,"Entidad Federativa","RFC","CURP","Nombbre","Origen Presupuestal\n de la plazas","Partida Presupuestal","Código de Pago","Clave de Unidad","Clave de Sub Unidad","Clave de Categoría","Horas semana mes","Número de plaza","Clave de nivel de puesto","Clave de nivel de sueldo","Zona Económica","Tipo de movimiento","Quincena Inicial","Quincena Final"]
[]
[]
[]
[]
[]
[null,"Total Personas : ",null,null,null,null,null,null,null,null,"Total Plazas : "]
[]
[]
[]
[null,"Fuente : Información proporcionada por las Entidades Federativas"]

{"sheet":"II D) 4","index":7,"n_rows":24,"n_cols":17,"rows_kept":24,"cut":false,"hidden":false,"merged":[[20,13,20,14],[12,0,13,0],[12,6,13,6],[12,7,12,13],[12,14,12,15],[12,2,13,2],[12,1,13,1],[12,16,13,16],[12,5,13,5],[12,4,13,4],[12,3,13,3],[9,1,9,9]]}
[]
[]
[]
[]
[]
[]
[]
[]
[null,"Formato: Trabajadores Jubilados en el Periodo"]
[null,{"$f":"IF('Caratula Resumen'!D22=\"Elige el Periodo…\",\"\",'Caratula Resumen'!D22)","v":"Fondo de Aportaciones para la Educación Tecnológica y de Adultos/Colegio Nacional de Educación Profesional Técnica (FAETA/CONALEP)"},null,null,null,null,null,null,null,null,null,null,null,null,null,{"$f":"IF('Caratula Resumen'!D23=\"Elige el Periodo…\",\"\",'Caratula Resumen'!D23)","v":"4to. Trimestre"}]
[]
[]
[null,"Entidad Federativa","R.F.C.","CURP","NOMBRE","Clave CT","Última(s) ó Penultima(s) Plaza(s) Ocupada(s)\n(*)","Clave Presupuestal de la Jubilación",null,null,null,null,null,null,"Periodo ocupado",null,"Quincena de inicio de jubilación"]
[null,null,null,null,null,null,null,"Partida Presupuestal","Código de Pago","Clave de Unidad","Clave de Sub Unidad","Clave de Categoría","Horas Semana Mes ","Número de Plaza","Inicio","Conclusión"]
[]
[null,"Entidad Federativa","R.F.C.","CURP","NOMBRE","Clave Centro de Trabajo","Última(s) ó Penultima(s) Plaza(s) Ocupada(s)\n(*)","Partida Presupuestal","Código de Pago","Clave de Unidad","Clave de Sub Unidad","Clave de Categoría","Horas Semana Mes ","Número de Plaza","Periodo ocupado\nInicio","Periodo ocupado\nConclusión","Quincena de inicio de jubilación"]
[null,"GUANAJUATO","CACX500817KXA","CXCA500817MGTBMN03","ANITA CABEZA CAMARGO","11DPT000009I",1,1130,1003,"01",74,"S01202","00.0","8082",198416,201513,201514]
[null,"GUANAJUATO","NECL411005F85","NECL411005HGTGRS08","LUIS NEGRETE CRUZ","11DPT000009I",1,1130,1003,"01",74,"CF18201","00.0","8093",198417,201513,201514]
[null,"Total Personas : ",2,null,null,null,null,null,null,null,null,"Total Plazas : ",null,2]
[]
[]
[]
[null,"Fuente : Información proporcionada por las Entidades Federativas"]
[null,"(*) Si  el trabajador se jubila con más de una clave presupuestal, por cada plaza se debe llenar un registro hasta que se haya informado acerca de todas las plazas del trabajador."]

{"sheet":"II D) 4 A","index":8,"n_rows":24,"n_cols":18,"rows_kept":24,"cut":false,"hidden":false,"merged":[[18,13,18,14],[9,1,9,7],[20,13,20,14],[12,17,13,17],[12,1,13,1],[12,2,13,2],[12,3,13,3],[12,4,13,4],[12,5,13,5],[12,6,12,12],[12,13,12,14],[12,15,13,15],[12,16,13,16]]}
[]
[]
[]
[]
[]
[]
[]
[]
[null,"Formato: Trabajadores que Tramitaron Licencia Prejubilatoria en el Periodo"]
[null,{"$f":"IF('Caratula Resumen'!D22=\"Elige el Periodo…\",\"\",'Caratula Resumen'!D22)","v":"Fondo de Aportaciones para la Educación Tecnológica y de Adultos/Colegio Nacional de Educación Profesional Técnica (FAETA/CONALEP)"},null,null,null,null,null,null,null,null,null,null,null,null,null,null,null,{"$f":"IF('Caratula Resumen'!D23=\"Elige el Periodo…\",\"\",'Caratula Resumen'!D23)","v":"4to. Trimestre"}]
[]
[]
[null,"Entidad Federativa","R.F.C.","CURP","NOMBRE","Clave integrada","Clave Presupuestal",null,null,null,null,null,null,"Periodo Licencia",null,"Percepciones pagadas con Presupuesto Federal en el  Periodo reportado*","Percepciones pagadas con Presupuesto de otra Fuente en el  Periodo reportado*","Clave CT Origen"]
[null,null,null,null,null,null,"Partida Presupuestal","Código de Pago","Clave de Unidad","Clave de Sub Unidad","Clave de Categoría","Horas Semana Mes ","Número de Plaza","Inicio","Conclusión"]
[]
[null,"Entidad Federativa","R.F.C.","CURP","NOMBRE","Clave integrada","Partida Presupuestal","Código de Pago","Clave de Unidad","Clave de Sub Unidad","Clave de Categoría","Horas Semana Mes ","Número de Plaza","Periodo Licencia\nInicio","Periodo Licencia\nConclusión","Percepciones pagadas con Presupuesto Federal en el  Periodo reportado*","Percepciones pagadas con Presupuesto de otra Fuente en el  Periodo reportado*","Clave CT Origen"]
[null,"GUANAJUATO","MIRA590513QB0","MIRA590513HGTRMR01","MIRANDA RAMOS JOSE ARMANDO","113010030029CF3420100.02587",1130,1003,"00",29,"CF34201","00.0",2587,20150801,20151031,40381.33,0,"11DPT0002P"]
[null,"GUANAJUATO","PEVG640422LA3","PEVG640422MGTRRR00","PEREZ VERA GEORGINA SOLEDAD","113010030029CF3320200.02594",1130,1003,"00",29,"CF33202","00.0",2594,20150801,20151031,44503.270000000004,0,"11DPT0002P"]
[null,"Total Personas : ",2,null,null,null,null,null,null,null,"Total Plazas : ",null,2,"Total Pto. Federal",null,{"$f":"SUBTOTAL(109,Tabla5[Percepciones pagadas con Presupuesto Federal en el  Periodo reportado*])","v":84884.6}]
[]
[null,null,null,null,null,null,null,null,null,null,null,null,null,"Total Ppto. Otras Fuentes",null,null,0]
[]
[null,"*Total de Percepciones reportadas por la Entidad Federativa como pagadas en el periodo "]
[null,"Fuente : Información proporcionada por las Entidades Federativas"]

{"sheet":"II D) 6","index":9,"n_rows":28,"n_cols":13,"rows_kept":28,"cut":false,"hidden":false,"merged":[[10,1,10,6],[13,12,14,12],[13,9,13,10],[13,11,14,11],[13,1,14,1],[13,2,14,2],[13,3,14,3],[13,4,14,4],[13,5,14,5],[13,6,14,6],[13,7,13,8]]}
[]
[]
[]
[]
[]
[]
[]
[]
[]
[null,"Formato: Trabajadores Contratados por Honorarios en el Periodo"]
[null,{"$f":"IF('Caratula Resumen'!D22=\"Elige el Periodo…\",\"\",'Caratula Resumen'!D22)","v":"Fondo de Aportaciones para la Educación Tecnológica y de Adultos/Colegio Nacional de Educación Profesional Técnica (FAETA/CONALEP)"},null,null,null,null,null,null,null,null,null,null,{"$f":"IF('Caratula Resumen'!D23=\"Elige el Periodo…\",\"\",'Caratula Resumen'!D23)","v":"4to. Trimestre"}]
[]
[]
[null,"Entidad Federativa","Clave Centro de Trabajo","R.F.C.","CURP","Nombre","Identificador del Contrato","Equivalencia",null,"Periodo de Contratación",null,"Función","Percepciones pagadas dentro del periodo reportado"]
[null,null,null,null,null,null,null,"Clave de Categoría","Horas Semana Mes ","Inicio","Conclusión"]
[]
[null,"Entidad Federativa","Clave Centro de Trabajo","R.F.C.","CURP","Nombre","Identificador del Contrato","Clave de Categoría","Horas Semana Mes ","Periodo de Contratación\nInicio","Periodo de Contratación\nConclusión","Función","Percepciones pagadas dentro del periodo reportado"]
[]
[]
[]
[]
[]
[null,"Total Entidad Federativa Personas : ",null,null,null,null,null,null,null,null,null,"Subtotal Monto Pagado en el Periodo:"]
[]
[]
[null,null,null,null,null,null,null,null,null,"Total   Percepciones :"]
[]
[null,"Fuente : Información proporcionada por las Entidades Federativas"]

{"sheet":"II D) 7 1","index":10,"n_rows":50,"n_cols":19,"rows_kept":50,"cut":false,"hidden":false,"merged":[[46,16,46,17],[12,18,13,18],[12,13,13,13],[12,14,13,14],[12,15,13,15],[12,16,13,16],[8,17,8,18],[9,1,9,9],[12,6,13,6],[12,7,12,9],[12,10,13,10],[12,11,13,11],[12,12,13,12],[12,1,13,1],[12,2,13,2],[12,3,13,3],[12,4,13,4],[12,5,13,5],[12,17,13,17]]}
[]
[]
[]
[]
[]
[]
[]
[]
[null,"Formato: Analítico de Categorías / Plazas Autorizadas con su Tabulador",null,null,null,null,null,null,null,null,null,null,null,null,null,null,"Entidad Federativa:",{"$f":"IF('Caratula Resumen'!D21=\"Elige el Periodo…\",\"\",'Caratula Resumen'!D21)","v":" GUANAJUATO "}]
[null,{"$f":"IF('Caratula Resumen'!D22=\"Elige el Periodo…\",\"\",'Caratula Resumen'!D22)","v":"Fondo de Aportaciones para la Educación Tecnológica y de Adultos/Colegio Nacional de Educación Profesional Técnica (FAETA/CONALEP)"},null,null,null,null,null,null,null,null,null,null,null,null,null,null,null,null,{"$f":"IF('Caratula Resumen'!D23=\"Elige el Periodo…\",\"\",'Caratula Resumen'!D23)","v":"4to. Trimestre"}]
[]
[]
[null,"Clave Tipo educativo","Clave Nivel educativo","Clave Subnivel educativo","Descripción Nivel / Subnivel","Tipo Financiamiento","Partida Presupuestal","CATEGORIA",null,null,"Zona Económica","Nivel Puesto","Nivel Sueldo","Tipo Contratación","Monto mensual\npor plaza jornada","Monto mensual\nPor Plaza HSM","Número de Plazas Jornada","Número de Plazas HSM","Monto total autorizado"]
[null,null,null,null,null,null,null,"Tipo de Categoría"," Categoría","Descripción"]
[]
[null,"Clave Tipo educativo","Clave Nivel educativo","Clave Subnivel educativo","Descripción Nivel / Subnivel","Tipo Financiamiento","Partida Presupestal","Tipo de Categoría"," Categoría","Descripción","Zona Económica","Nivel Puesto","Nivel Sueldo","Tipo Contratación","Monto mensual\npor plaza jornada","Monto mensual\nPor Plaza HSM","Número de Plazas Jornada","Número de Plazas HSM","Monto total autorizado"]
[null,3,32,31,"LICENCIATURA UNIVERSITARIA",1,1130,3,"000000PC","PROFESIONISTA INSTRUCTOR TIPO \"C\"","C","000000D1",1,"H",0,{"$f":"107.49*4","v":429.96},0,1831,{"$f":"Tabla15[[#This Row],[Monto mensual\nPor Plaza HSM]]*Tabla15[[#This Row],[Número de Plazas HSM]]","v":787256.76}]
[null,3,32,31,"LICENCIATURA UNIVERSITARIA",1,1130,3,"000000PB","PROFESIONISTA INSTRUCTOR TIPO \"B\"","C","000000D2",2,"H",0,{"$f":"93.13*4","v":372.52},0,2727,{"$f":"Tabla15[[#This Row],[Monto mensual\nPor Plaza HSM]]*Tabla15[[#This Row],[Número de Plazas HSM]]","v":1015862.0399999999}]
[null,3,32,31,"LICENCIATURA UNIVERSITARIA",1,1130,3,"000000PA","PROFESIONISTA INSTRUCTOR TIPO \"A\"","C","000000D3",3,"H",0,{"$f":"82.86*4","v":331.44},0,3151,{"$f":"Tabla15[[#This Row],[Monto mensual\nPor Plaza HSM]]*Tabla15[[#This Row],[Número de Plazas HSM]]","v":1044367.44}]
[null,2,21,20,"PROFESIONAL TÉCNICO",1,1130,3,"000000TA","TÉCNICO INSTRUCTOR \"A\"","C","000000D4",4,"H",0,{"$f":"60.91*4","v":243.64},0,2304,{"$f":"Tabla15[[#This Row],[Monto mensual\nPor Plaza HSM]]*Tabla15[[#This Row],[Número de Plazas HSM]]","v":561346.55999999994}]
[null,1,12,4,"PRIMARIA GENERAL",1,1540,2,"00S01201","ASISTENTE DE SERV. BASICOS","C",2,2,"P",5832.15,0,68,0,{"$f":"Tabla15[[#This Row],[Monto mensual\npor plaza jornada]]*Tabla15[[#This Row],[Número de Plazas Jornada]]","v":396586.19999999995}]
[null,1,12,4,"PRIMARIA GENERAL",1,1540,2,"0CF18201","AUXILIAR DE SEGURIDAD","C",2,2,"P",5832.15,0,15,0,{"$f":"Tabla15[[#This Row],[Monto mensual\npor plaza jornada]]*Tabla15[[#This Row],[Número de Plazas Jornada]]","v":87482.25}]
[null,1,12,4,"PRIMARIA GENERAL",1,1540,2,"0CF18202","OPERADOR DE SERVICIOS BÁSICOS","C",2,2,"P",5832.15,0,1,0,{"$f":"Tabla15[[#This Row],[Monto mensual\npor plaza jornada]]*Tabla15[[#This Row],[Número de Plazas Jornada]]","v":5832.15}]
[null,1,13,7,"SECUNDARIA GENERAL",1,1540,2,"00S01202","AUXILIAR DE SERV. GENERALES","C",4,4,"P",6355.5,0,54,0,{"$f":"Tabla15[[#This Row],[Monto mensual\npor plaza jornada]]*Tabla15[[#This Row],[Número de Plazas Jornada]]","v":343197}]
[null,1,13,7,"SECUNDARIA GENERAL",1,1540,2,"0CF34202","PROMOTOR CULTURAL Y DEP.","C",5,5,"P",6619.2,0,9,0,{"$f":"Tabla15[[#This Row],[Monto mensual\npor plaza jornada]]*Tabla15[[#This Row],[Número de Plazas Jornada]]","v":59572.799999999996}]
[null,1,13,7,"SECUNDARIA GENERAL",1,1540,2,"00A03202","SECRETARIA \"C\"","C",5,5,"P",6619.2,0,32,0,{"$f":"Tabla15[[#This Row],[Monto mensual\npor plaza jornada]]*Tabla15[[#This Row],[Número de Plazas Jornada]]","v":211814.39999999999}]
[null,2,22,22,"BACHILLERATO GENERAL",1,1540,2,"0CF34201","TECNICO BIBLIOTECARIO","C",6,6,"P",6885.25,0,12,0,{"$f":"Tabla15[[#This Row],[Monto mensual\npor plaza jornada]]*Tabla15[[#This Row],[Número de Plazas Jornada]]","v":82623}]
[null,2,22,22,"BACHILLERATO GENERAL",1,1540,2,"0ED01201","TECNICO EN MAT. DIDÁCTICOS","C",6,6,"P",6885.25,0,11,0,{"$f":"Tabla15[[#This Row],[Monto mensual\npor plaza jornada]]*Tabla15[[#This Row],[Número de Plazas Jornada]]","v":75737.75}]
[null,2,22,22,"BACHILLERATO GENERAL",1,1540,2,"0CF19201","TUTOR ESCOLAR","C",6,6,"P",6885.25,0,15,0,{"$f":"Tabla15[[#This Row],[Monto mensual\npor plaza jornada]]*Tabla15[[#This Row],[Número de Plazas Jornada]]","v":103278.75}]
[null,2,22,22,"BACHILLERATO GENERAL",1,1540,2,"0CF21202","ASISTENTE ESCOLAR Y S.","C",7,7,"P",7154.2,0,14,0,{"$f":"Tabla15[[#This Row],[Monto mensual\npor plaza jornada]]*Tabla15[[#This Row],[Número de Plazas Jornada]]","v":100158.8}]
[null,2,22,22,"BACHILLERATO GENERAL",1,1540,2,"0CF04201","SECRETARIA \"B\"","C",7,7,"P",7154.2,0,14,0,{"$f":"Tabla15[[#This Row],[Monto mensual\npor plaza jornada]]*Tabla15[[#This Row],[Número de Plazas Jornada]]","v":100158.8}]
[null,2,22,22,"BACHILLERATO GENERAL",1,1540,2,"00T08201","TECNICO EN GRAFICACIÓN","C",8,8,"P",7424.25,0,5,0,{"$f":"Tabla15[[#This Row],[Monto mensual\npor plaza jornada]]*Tabla15[[#This Row],[Número de Plazas Jornada]]","v":37121.25}]
[null,2,22,22,"BACHILLERATO GENERAL",1,1540,2,"0CF33202","TECNICO EN CONTABILIDAD","C",9,9,"P",7968.45,0,7,0,{"$f":"Tabla15[[#This Row],[Monto mensual\npor plaza jornada]]*Tabla15[[#This Row],[Número de Plazas Jornada]]","v":55779.15}]
[null,2,22,22,"BACHILLERATO GENERAL",1,1540,2,"0CF33203","TECNICO FINANCIERO","C",9,9,"P",7968.45,0,9,0,{"$f":"Tabla15[[#This Row],[Monto mensual\npor plaza jornada]]*Tabla15[[#This Row],[Número de Plazas Jornada]]","v":71716.05}]
[null,2,22,22,"BACHILLERATO GENERAL",1,1540,2,"0CF18203","SUPERVISOR DE MTTO","C",9,9,"P",7968.45,0,19,0,{"$f":"Tabla15[[#This Row],[Monto mensual\npor plaza jornada]]*Tabla15[[#This Row],[Número de Plazas Jornada]]","v":151400.54999999999}]
[null,2,22,22,"BACHILLERATO GENERAL",1,1540,2,"00A01801","ADMINISTRATIVO TEC. ESP.","C",11,11,"P",8254.75,0,10,0,{"$f":"Tabla15[[#This Row],[Monto mensual\npor plaza jornada]]*Tabla15[[#This Row],[Número de Plazas Jornada]]","v":82547.5}]
[null,2,22,22,"BACHILLERATO GENERAL",1,1540,2,"0CF33204","SUBJEFE TECNICO ESP.","C",13,13,"P",13615.35,0,60,0,{"$f":"Tabla15[[#This Row],[Monto mensual\npor plaza jornada]]*Tabla15[[#This Row],[Número de Plazas Jornada]]","v":816921}]
[null,3,32,31,"LICENCIATURA UNIVERSITARIA",1,1540,2,"0CF33206","JEFE DE PROYECTO","C",15,15,"P",20993.25,0,82,0,{"$f":"Tabla15[[#This Row],[Monto mensual\npor plaza jornada]]*Tabla15[[#This Row],[Número de Plazas Jornada]]","v":1721446.5}]
[null,3,32,31,"LICENCIATURA UNIVERSITARIA",1,1540,5,"0CF02105","COORDINADOR EJECUTIVO","C",21,21,"P",25707.39,0,10,0,{"$f":"Tabla15[[#This Row],[Monto mensual\npor plaza jornada]]*Tabla15[[#This Row],[Número de Plazas Jornada]]","v":257073.9}]
[null,3,32,31,"LICENCIATURA UNIVERSITARIA",1,1540,5,"0CF01601","JEFE DE UNIDAD","C",22,22,"P",29719.360000000001,0,7,0,{"$f":"Tabla15[[#This Row],[Monto mensual\npor plaza jornada]]*Tabla15[[#This Row],[Número de Plazas Jornada]]","v":208035.52000000002}]
[null,3,32,31,"LICENCIATURA UNIVERSITARIA",1,1540,5,"0CF11102","DIRECTOR DE CENTRO","C",24,24,"P",37686.910000000003,0,3,0,{"$f":"Tabla15[[#This Row],[Monto mensual\npor plaza jornada]]*Tabla15[[#This Row],[Número de Plazas Jornada]]","v":113060.73000000001}]
[null,3,32,31,"LICENCIATURA UNIVERSITARIA",1,1540,5,"0CF02100","SUBCOORDINADOR","C",25,25,"P",37378.76,0,1,0,{"$f":"Tabla15[[#This Row],[Monto mensual\npor plaza jornada]]*Tabla15[[#This Row],[Número de Plazas Jornada]]","v":37378.76}]
[null,3,32,31,"LICENCIATURA UNIVERSITARIA",1,1540,5,"0CF02104","DIRECTOR DE PLANTEL \"D\" Y \"E\"","C",26,26,"P",29695.83,0,5,0,{"$f":"Tabla15[[#This Row],[Monto mensual\npor plaza jornada]]*Tabla15[[#This Row],[Número de Plazas Jornada]]","v":148479.15000000002}]
[null,3,32,31,"LICENCIATURA UNIVERSITARIA",1,1540,5,"0CF02103","DIRECTOR DE PLANTEL \"B\" Y \"C\"","C",27,27,"P",30324.799999999999,0,8,0,{"$f":"Tabla15[[#This Row],[Monto mensual\npor plaza jornada]]*Tabla15[[#This Row],[Número de Plazas Jornada]]","v":242598.39999999999}]
[null,3,32,31,"LICENCIATURA UNIVERSITARIA",1,1540,5,"0CF02102","DIRECTOR DE PLANTEL \"A\"","C",28,28,"P",30374.94,0,1,0,{"$f":"Tabla15[[#This Row],[Monto mensual\npor plaza jornada]]*Tabla15[[#This Row],[Número de Plazas Jornada]]","v":30374.94}]
[null,3,32,31,"LICENCIATURA UNIVERSITARIA",1,1540,5,"0CF11100","REPRESENTANTE","C",30,30,"P",79876.210000000006,0,1,0,{"$f":"Tabla15[[#This Row],[Monto mensual\npor plaza jornada]]*Tabla15[[#This Row],[Número de Plazas Jornada]]","v":79876.210000000006}]
[null,null,null,null,null,null,null,null,null,null,null,null,null,"Total Jornada:",{"$f":"SUBTOTAL(109,Tabla15[Monto mensual\npor plaza jornada])","v":447011.65},null,"Total Autorizado:",null,{"$f":"SUBTOTAL(109,Tabla15[Monto total autorizado])","v":9029084.3100000024}]
[null,null,null,null,null,null,null,null,null,null,null,null,null,"Total HSM",null,{"$f":"SUM(P17:P47)","v":1377.56}]
[]
[null,"Fuente : Información proporcionada por las Entidades Federativas"]

{"sheet":"II D) 7 2 ","index":11,"n_rows":53,"n_cols":18,"rows_kept":53,"cut":false,"hidden":false,"merged":[[14,8,15,8],[14,9,14,13],[14,14,14,16],[10,16,10,17],[11,1,11,9],[14,1,15,1],[14,2,15,2],[14,3,15,3],[14,17,15,17],[14,6,15,6],[14,7,15,7],[14,4,15,4],[14,5,15,5]]}
[]
[]
[]
[]
[]
[]
[]
[]
[]
[]
[null,"Formato: Catálogo de Categorías y Tabuladores",null,null,null,null,null,null,null,null,null,null,null,null,null,"Entidad Federativa:",{"$f":"IF('Caratula Resumen'!D21=\"Elige el Periodo…\",\"\",'Caratula Resumen'!D21)","v":" GUANAJUATO "}]
[null,{"$f":"IF('Caratula Resumen'!D22=\"Elige el Periodo…\",\"\",'Caratula Resumen'!D22)","v":"Fondo de Aportaciones para la Educación Tecnológica y de Adultos/Colegio Nacional de Educación Profesional Técnica (FAETA/CONALEP)"},null,null,null,null,null,null,null,null,null,null,null,null,null,null,null,{"$f":"IF('Caratula Resumen'!D23=\"Elige el Periodo…\",\"\",'Caratula Resumen'!D23)","v":"4to. Trimestre"}]
[]
[]
[null,"Identificador origen presupuestal de la plaza","Clave de categoría","Descripción de la categoría","Tipo de contratación","Tipo de categoría","Clave de concepto de pago","Clave de nivel de puesto","Clave de nivel de sueldo","Sueldo asignado por zona económica",null,null,null,null,"Datos adicionales de horas",null,null,"Fecha de actualización"]
[null,null,null,null,null,null,null,null,null,"Inicio de vigencia del sueldo","Fin de vigencia del sueldo","Monto Mensual Jornada ó de HSM\nZona A","Monto Mensual Jornada ó de HSM\nZona B","Monto Mensual Jornada ó de HSM\nZona C","Horas \nde compatibilidad","Horas de servicio (HSM)","Horas de docencia"]
[]
[null,"Identificador origen presupuestal de la plaza","Clave de categoría","Descripción de la categoría","Tipo de contratación","Tipo de categoría","Clave de concepto de pago","Clave de nivel de puesto","Clave de nivel de sueldo","Inicio de vigencia del sueldo","Fin de vigencia del sueldo","Monto Mensual Jornada ó de HSM\nZona A","Monto Mensual Jornada ó de HSM\nZona B","Monto Mensual Jornada ó de HSM\nZona C","Horas \nde compatibilidad","Horas de servicio (HSM)","Horas de docencia","Fecha de actualización"]
[null,1,"0CF02105","COORDINADOR EJECUTIVO II","P",5,1003,21,21,201501,999999,0,0,25707.39,8,0,"00.0",20150101]
[null,1,"0CF01601","JEFE DE UNIDAD","P",5,1003,22,22,201501,999999,0,0,29719.360000000001,8,0,"00.0",20150101]
[null,1,"0CF11102","DIRECTOR DE CENTRO","P",5,1003,24,24,201501,999999,0,0,37686.910000000003,8,0,"00.0",20150101]
[null,1,"0CF02100","SUBCOORDINADOR","P",5,1003,25,25,201501,999999,0,0,37378.76,8,0,"00.0",20150101]
[null,1,"0CF02104","DIRECTOR DE PLANTEL \"D\" Y \"E\" II","P",5,1003,26,26,201501,999999,0,0,29695.83,8,0,"00.0",20150101]
[null,1,"0CF02103","DIRECTOR DE PLANTEL \"B\" Y \"C\" II","P",5,1003,27,27,201501,999999,0,0,30324.799999999999,8,0,"00.0",20150101]
[null,1,"0CF02102","DIRECTOR DE PLANTEL \"A\" II","P",5,1003,28,28,201501,999999,0,0,30374.94,8,0,"00.0",20150101]
[null,1,"0CF11100","REPRESENTANTE","P",5,1003,30,30,201501,999999,0,0,79876.210000000006,8,0,"00.0",20150101]
[null,1,"000000TA","DOCENTE TIPO 'TA'","H",1,1001,"000000D4",4,201501,999999,0,0,{"$f":"60.91*4","v":243.64},0,0,20,20150101]
[null,1,"000000PA","DOCENTE TIPO 'PA'","H",1,1001,"000000D3",3,201501,999999,0,0,{"$f":"82.86*4","v":331.44},0,0,20,20150101]
[null,1,"000000PB","DOCENTE TIPO 'PB'","H",1,1001,"000000D2",2,201501,999999,0,0,{"$f":"93.13*4","v":372.52},0,0,20,20150101]
[null,1,"000000PC","DOCENTE TIPO 'PC'","H",1,1001,"000000D1",1,201501,999999,0,0,{"$f":"107.49*4","v":429.96},0,0,20,20150101]
[null,1,"00S01201","ASISTENTE DE SERVICIOS BASICOS","P",2,1003,2,2,201501,999999,0,0,5832.15,8,0,"00.0",20150101]
[null,1,"0CF18201","AUXILIAR DE SEGURIDAD","P",2,1003,2,2,201501,999999,0,0,5832.15,8,0,"00.0",20150101]
[null,1,"0CF18202","OPERADOR DE SERVICIOS BASICOS","P",2,1003,2,2,201501,999999,0,0,5832.15,8,0,"00.0",20150101]
[null,1,"00S01202","AUXILIAR DE SERVICIOS GENERALES","P",2,1003,4,4,201501,999999,0,0,6355.5,8,0,"00.0",20150101]
[null,1,"0CF34202","PROMOTOR CULTURAL Y DEP","P",2,1003,5,5,201501,999999,0,0,6619.2,8,0,"00.0",20150101]
[null,1,"00A03202","SECRETARIA 'C'","P",2,1003,5,5,201501,999999,0,0,6619.2,8,0,"00.0",20150101]
[null,1,"0CF34201","TECNICO BIBILIOTECARIO","P",2,1003,6,6,201501,999999,0,0,6885.25,8,0,"00.0",20150101]
[null,1,"0ED01201","TECNICO DE MATS DIDACTICOS","P",2,1003,6,6,201501,999999,0,0,6885.25,8,0,"00.0",20150101]
[null,1,"0CF19201","TUTOR ESCOLAR","P",2,1003,6,6,201501,999999,0,0,6885.25,8,0,"00.0",20150101]
[null,1,"0CF21202","ASISTENTE ESCOLAR Y SOCIAL","P",2,1003,7,7,201501,999999,0,0,7154.2,8,0,"00.0",20150101]
[null,1,"0CF04201","SECRETARIA   B","P",2,1003,7,7,201501,999999,0,0,7154.2,8,0,"00.0",20150101]
[null,1,"00T08201","TECNICO EN GRAFICACION","P",2,1003,8,8,201501,999999,0,0,7424.25,8,0,"00.0",20150101]
[null,1,"0CF33202","TECNICO EN CONTABILIDAD","P",2,1003,9,9,201501,999999,0,0,7968.45,8,0,"00.0",20150101]
[null,1,"0CF33203","TECNICO FINANCIERO","P",2,1003,9,9,201501,999999,0,0,7968.45,8,0,"00.0",20150101]
[null,1,"0CF18203","SUPERVISOR DE MANTENIMIENTO","P",2,1003,9,9,201501,999999,0,0,7968.45,8,0,"00.0",20150101]
[null,1,"00A01801","ADMINISTRATIVO TECNICO ESPECIALISTA","P",2,1003,11,11,201501,999999,0,0,8254.75,8,0,"00.0",20150101]
[null,1,"0CF33204","SUBJEFE TECNICO ESPECIALISTA","P",2,1003,13,13,201501,999999,0,0,13615.35,8,0,"00.0",20150101]
[null,1,"0CF33206","JEFE DE PROYECTO","P",2,1003,15,15,201501,999999,0,0,20993.25,8,0,"00.0",20150101]
[null,null,null,null,null,null,null,null,null,null,"Total Zona A:",{"$f":"SUBTOTAL(109,Tabla16[Monto Mensual Jornada ó de HSM\nZona A])","v":0}]
[null,null,null,null,null,null,null,null,null,null,null,"Total Zona B:",{"$f":"SUM(M19:M49)","v":0}]
[null,null,null,null,null,null,null,null,null,null,null,null,"Total Zona C:",{"$f":"SUM(N19:N50)","v":448389.2100000002}]
[]
[null,"Fuente : Información proporcionada por las Entidades Federativas"]

{"sheet":"II D) 7 3","index":12,"n_rows":84,"n_cols":11,"rows_kept":84,"cut":false,"hidden":false,"merged":[[9,1,9,7],[8,9,8,10]]}
[]
[]
[]
[]
[]
[]
[]
[]
[null,"Formato: Catálogo de Percepciones y Deducciones",null,null,null,null,null,null,"Entidad Federativa:",{"$f":"IF('Caratula Resumen'!D21=\"Elige el Periodo…\",\"\",'Caratula Resumen'!D21)","v":" GUANAJUATO "}]
[null,{"$f":"IF('Caratula Resumen'!D22=\"Elige el Periodo…\",\"\",'Caratula Resumen'!D22)","v":"Fondo de Aportaciones para la Educación Tecnológica y de Adultos/Colegio Nacional de Educación Profesional Técnica (FAETA/CONALEP)"},null,null,null,null,null,null,null,null,{"$f":"IF('Caratula Resumen'!D23=\"Elige el Periodo…\",\"\",'Caratula Resumen'!D23)","v":"4to. Trimestre"}]
[]
[]
[null,"Identificador origen presupuestal de la plaza","Tipo de concepto de pago ","Origen de financiamiento del concepto de percepciones.","Porcentaje de participación federal por fuente de recursos","Grupo al que pertenece concepto de pago (Percepción y/o Deducción)","Clave de concepto de pago","Descripción del concepto de pago ","Partida presupuestal","Fecha del","Fecha  al"]
[]
[null,"Identificador origen presupuestal de la plaza","Tipo de concepto de pago ","Origen de financiamiento del concepto de percepciones.","Porcentaje de participación federal por fuente de recursos","Grupo al que pertenece concepto de pago (Percepción y/o Deducción)","Clave de concepto de pago","Descripción del concepto de pago ","Partida presupuestal","Fecha del","Fecha  al"]
[null,1,"P","F",100,"P0",1003,"Salario Base",1130,20150101,20151231]
[null,1,"P","F",100,"P1",2517,"Estímulo de Productividad",1540,20150101,20151231]
[null,1,"P","F",100,"P1",2800,"Despensa",1540,20150101,20151231]
[null,1,"P","F",100,"P1",1602,"Desarrollo y Capacitación",1540,20150101,20151231]
[null,1,"P","F",100,"P1",2766,"Prima de Antigüedad",1540,20150101,20151231]
[null,1,"P","F",100,"P1",2754,"Ayuda de Guardería",1540,20150101,20151231]
[null,1,"P","F",100,"P1",2615,"Canastilla Materna",1540,20150101,20151231]
[null,1,"P","F",100,"P1",2600,"Estímulo por Puntualidad y Asistencia",1540,20150101,20151231]
[null,1,"P","F",100,"P1",2680,"Anteojos  y/o Lentes de contacto",1540,20150101,20151231]
[null,1,"P","F",100,"P1",3503,"Pago por Defunción",1540,20150101,20151231]
[null,1,"P","F",100,"P1",1624,"Prima Dominical",1320,20150101,20151231]
[null,1,"P","F",100,"P1",3623,"Prima Vacacional",1320,20150101,20151231]
[null,1,"P","F",100,"P1",2850,"Labores en Condiciones Insalubres",1540,20150101,20151231]
[null,1,"P","F",100,"P1",2655,"Aparatos Ortopédicos",1540,20150101,20151231]
[null,1,"P","F",100,"P1",2627,"Estímulo por día de la Madres",1540,20150101,20151231]
[null,1,"P","F",100,"P1",2810,"Ayuda para Titulación",1540,20150101,20151231]
[null,1,"P","F",100,"P1",2625,"Ayuda para Utiles Escolares",1540,20150101,20151231]
[null,1,"P","F",100,"P1",1601,"Apoyo por contraer Nupcias",1540,20150101,20151231]
[null,1,"P","F",100,"P1",1603,"Compensación",1340,20150101,20151231]
[null,1,"P","F",100,"P1",5050,"Exceso del credito al salario",1130,20150101,20151231]
[null,1,"P","F",100,"P1",2553,"Días económicos",1540,20150101,20151231]
[null,1,"P","F",100,"P1",2565,"Ajuste salarial",1540,20150101,20151231]
[null,1,"P","F",100,"P1",2573,"Días de descanso obligatorio",1540,20150101,20151231]
[null,1,"P","F",100,"P1",1002,"subsidio al empleo",1130,20150101,20151231]
[null,1,"D",null,0,"D1",5045,"I.S.P.T. a Retener",0,20150101,20151231]
[null,1,"D",null,0,"D1",2920,"Seguro de Retiro",0,20150101,20151231]
[null,1,"D",null,0,"D1",2735,"Seg.Vida METLIFE de MEXICO",0,20150101,20151231]
[null,1,"D",null,0,"D2",8135,"Prestamo Issste",0,20150101,20151231]
[null,1,"D",null,0,"D1",8523,"Cuota Sindical Local",0,20150101,20151231]
[null,1,"D",null,0,"D1",6250,"Seg.Salud T.Activo",0,20150101,20151231]
[null,1,"D",null,0,"D1",6251,"Seg.Salud T.Pensionado",0,20150101,20151231]
[null,1,"D",null,0,"D1",6252,"Seg.Invalidez y Vida",0,20150101,20151231]
[null,1,"D",null,0,"D1",6253,"S.Sociales y Cult.",0,20150101,20151231]
[null,1,"D",null,0,"D1",6254,"S.Ret.Cesantia Avzda",0,20150101,20151231]
[null,1,"D",null,0,"D2",8095,"Cred. Hip. Creciente",0,20150101,20151231]
[null,1,"D",null,0,"D2",1927,"Seg. da%os Fovissste",0,20150101,20151231]
[null,1,"D",null,0,"D2",8580,"Pension Alimenticia",0,20150101,20151231]
[null,1,"D",null,0,"D3",2950,"Otras deducciones",0,20150101,20151231]
[null,1,"P","F",100,"P0",1001,"Salario Base del personal docente",1130,20150101,20151231]
[null,1,"P","F",100,"P1",1002,"subsidio al empleo del personal docente",3301,20150101,20151231]
[null,1,"P","F",100,"P1",1019,"Bonificación (graba para ISPT) del personal docente",1590,20150101,20151231]
[null,1,"P","F",100,"P1",1020,"Bonificación (no graba para ISPT) del personal docente",1590,20150101,20151231]
[null,1,"P","F",100,"P1",1021,"Prima Vacacional",1320,20150101,20151231]
[null,1,"P","F",100,"P1",1005,"Estimulo al desempeño docente",1710,20150101,20151231]
[null,1,"P","F",100,"P1",1006,"Horas recuperadas",1540,20150101,20151231]
[null,1,"D",null,0,"D1",2001,"I.S.P.T. a Retener del personal docente",0,20150101,20151231]
[null,1,"D",null,0,"D2",2002,"Cuota Sindical Local del personal docente",0,20150101,20151231]
[null,1,"D",null,0,"D2",2003,"Seg. de salud activo para el personal docente",0,20150101,20151231]
[null,1,"D",null,0,"D2",2004,"Seg. de salud t. pensionado del personal docente",0,20150101,20151231]
[null,1,"D",null,0,"D2",2005,"Seg. invalidez y vida del personal docente",0,20150101,20151231]
[null,1,"D",null,0,"D2",2006,"S. social y cultural del personal docente",0,20150101,20151231]
[null,1,"D",null,0,"D2",2007,"S.Ret.Cesantia Avzda del personal docente",0,20150101,20151231]
[null,1,"D",null,0,"D2",2008,"Horas no impartidas del personal docente",0,20150101,20151231]
[null,1,"D",null,0,"D2",2009,"Pensión alimenticia del personal docente",0,20150101,20151231]
[null,1,"D",null,0,"D3",2010,"Otros descuentos del personal docente",0,20150101,20151231]
[null,1,"D",null,0,"D2",2011,"Descuento por retardos del personal docente",0,20150101,20151231]
[null,1,"D",null,0,"D2",2015,"Crédito hipotecario del personal docente",0,20150101,20151231]
[null,1,"D",null,0,"D2",2014,"Préstamo personal del personal docente",0,20150101,20151231]
[null,1,"D",null,0,"D2",2021,"Ahorro solidario del personal docente",0,20150101,20151231]
[null,1,"P","F",100,"P1",2805,"Previsión Múltiple",1540,20150101,20151231]
[null,1,"P","F",100,"P1",1022,"Asesorías Complementarias",1130,20150101,20151231]
[null,1,"P","F",100,"P1",1023,"Interinatos",1130,20150101,20151231]
[null,1,"D",null,100,"D2",2010,"Ajuste por pago indebido",0,20150101,20151231]
[null,1,"D",null,100,"D2",2016,"Seguro de Daños de Fovissste",0,20150101,20151231]
[null,1,"D",null,100,"D2",2017,"Cuota Sindical para Docentes TD",0,20150101,20151231]
[null,1,"D",null,100,"D2",2022,"Seguro de Vida",0,20150101,20151231]
[null,1,"P","F",100,"P1",1004,"Aguinaldo Personal Docente",1320,20150101,20151231]
[null,1,"P","F",100,"P1",3613,"Aguinaldo",1320,20150101,20151231]
[null,"Fuente : Información proporcionada por las Entidades Federativas"]

{"sheet":"E)","index":13,"n_rows":26,"n_cols":8,"rows_kept":26,"cut":false,"hidden":false,"merged":[[9,1,9,5],[12,1,14,1],[12,2,14,2],[13,7,14,7],[12,3,14,3],[12,4,14,4],[12,5,12,7],[13,5,14,5],[13,6,14,6]]}
[]
[]
[]
[]
[]
[]
[]
[]
[null,"Formato: Trabajadores que Cobran con RFC / CURP con Formato Incorrecto"]
[null,{"$f":"IF('Caratula Resumen'!D22=\"Elige el Periodo…\",\"\",'Caratula Resumen'!D22)","v":"Fondo de Aportaciones para la Educación Tecnológica y de Adultos/Colegio Nacional de Educación Profesional Técnica (FAETA/CONALEP)"},null,null,null,null,null,{"$f":"IF('Caratula Resumen'!D23=\"Elige el Periodo…\",\"\",'Caratula Resumen'!D23)","v":"4to. Trimestre"}]
[]
[]
[null,"Entidad Federativa","RFC","CURP","NOMBRE TRABAJADOR","Motivo"]
[null,null,null,null,null,"Sin RFC o erroneo","RFC Sin Homoclave","Sin CURP o Erronea"]
[]
[]
[null,"Entidad Federativa","RFC","CURP","NOMBRE TRABAJADOR","Sin RFC o erroneo","RFC Sin Homoclave","Sin CURP o Erronea"]
[]
[]
[]
[]
[]
[null,"Total Personas : ",null,null,"Total Sin RFC o Erroneo:"]
[null,null,null,null,null,"Total RFC Sin Homoclave:"]
[null,null,null,null,null,null,"Total Sin CURP o Erroneo:"]
[null,"Fuente : Información proporcionada por las Entidades Federativas"]

{"sheet":"F) 1","index":14,"n_rows":26,"n_cols":19,"rows_kept":26,"cut":false,"hidden":false,"merged":[[9,1,9,6],[12,15,13,15],[12,16,13,16],[12,17,12,18],[12,1,13,1],[12,2,13,2],[12,3,13,3],[12,4,13,4],[12,5,13,5],[12,6,13,6],[12,7,13,7],[12,8,12,14]]}
[]
[]
[]
[]
[]
[]
[]
[]
[null,"Formato: Trabajadores con Doble Asignación Salarial en Municipios no Colindantes Geográficamente"]
[null,{"$f":"IF('Caratula Resumen'!D22=\"Elige el Periodo…\",\"\",'Caratula Resumen'!D22)","v":"Fondo de Aportaciones para la Educación Tecnológica y de Adultos/Colegio Nacional de Educación Profesional Técnica (FAETA/CONALEP)"},null,null,null,null,null,null,null,null,null,null,null,null,null,null,null,null,{"$f":"IF('Caratula Resumen'!D23=\"Elige el Periodo…\",\"\",'Caratula Resumen'!D23)","v":"4to. Trimestre"}]
[]
[]
[null,"Entidad Federativa","Municipio","Localidad","RFC","CURP","Nombre del Trabajador","Clave integrada","Clave Presupuestal",null,null,null,null,null,null,"Clave CT","Nombre CT","Periodo en el CT"]
[null,null,null,null,null,null,null,null,"Partida Presupuestal","Código de Pago","Clave de Unidad","Clave de Sub Unidad","Clave de Categoría","Horas Semana Mes ","Número de Plaza",null,null,"Desde","Hasta"]
[]
[null,"Entidad Federativa","Municipio","Localidad","RFC","CURP","Nombre del Trabajador","Clave integrada","Partida Presupuestal","Código de Pago","Clave de Unidad","Clave de Sub Unidad","Clave de Categoría","Horas semana mes","Número de Plaza","Clave CT","Nombre CT","Periodo en el CT\nDesde","Periodo en el CTH\nasta"]
[]
[]
[]
[]
[]
[null,"Total Personas : ",null,null,null,null,null,null,null,null,null,null,"Total Plazas : "]
[]
[]
[null,"Fuente : Información proporcionada por las Entidades Federativas"]
[null,"Importante: Listar Sólo los Municipios no Colindantes"]

{"sheet":"F) 2","index":15,"n_rows":26,"n_cols":20,"rows_kept":26,"cut":false,"hidden":false,"merged":[[13,3,14,3],[13,4,14,4],[13,5,14,5],[10,1,10,9],[13,19,14,19],[13,18,14,18],[13,6,13,12],[13,13,14,13],[13,14,14,14],[13,15,14,15],[13,16,13,17],[13,1,14,1],[13,2,14,2]]}
[]
[]
[]
[]
[]
[]
[]
[]
[]
[null,"Formato: Trabajadores Ocupando Plazas que Superan el Número de Horas de Compatibilidad Autorizadas"]
[null,{"$f":"IF('Caratula Resumen'!D22=\"Elige el Periodo…\",\"\",'Caratula Resumen'!D22)","v":"Fondo de Aportaciones para la Educación Tecnológica y de Adultos/Colegio Nacional de Educación Profesional Técnica (FAETA/CONALEP)"},null,null,null,null,null,null,null,null,null,null,null,null,null,null,null,null,{"$f":"IF('Caratula Resumen'!D23=\"Elige el Periodo…\",\"\",'Caratula Resumen'!D23)","v":"4to. Trimestre"}]
[]
[]
[null,"Entidad Federativa","RFC","CURP","Nombre","Clave integrada","Clave Presupuestal",null,null,null,null,null,null,"CT","Nombre CT","Turno CT","Periodo",null,"Total de Horas en el CT","Horas de compatibilidad de la categoría"]
[null,null,null,null,null,null,"Partida Presupuestal","Código de Pago","Clave de Unidad","Clave de Sub Unidad","Clave de Categoría","Horas Semana Mes ","Número de Plaza",null,null,null,"Desde","Hasta"]
[]
[null,"Entidad Federativa","RFC","CURP","Nombre","Clave integrada","Partida Presupuestal","Código de Pago","Clave de Unidad","Clave de Sub Unidad","Clave de Categoría","Horas semana mes","Número de plaza","CT","Nombre CT","Turno CT","Periodo\nDesde","Periodo\nHasta","Total de Horas en el CT","Horas de compatibilidad de la categoría"]
[]
[]
[]
[]
[]
[null,"Total Personas : ",null,null,null,null,null,null,null,null,"Total Plazas : "]
[]
[]
[null,"Fuente : Información proporcionada por las Entidades Federativas"]

{"sheet":"G)","index":16,"n_rows":26,"n_cols":20,"rows_kept":26,"cut":false,"hidden":false,"merged":[[13,19,14,19],[13,13,14,13],[13,14,14,14],[13,15,13,16],[13,17,14,17],[13,18,14,18],[10,1,10,8],[12,5,12,11],[13,1,14,1],[13,2,14,2],[13,3,14,3],[13,4,14,4],[13,5,14,5],[13,6,13,12]]}
[]
[]
[]
[]
[]
[]
[]
[]
[]
[null,"Formato: Trabajadores Cuyo Salario Básico Supere los Ingresos Promedio de un Docente en la Categoría más Alta del Tabulador Salarial Correspondiente a Cada Entidad"]
[null,{"$f":"IF('Caratula Resumen'!D22=\"Elige el Periodo…\",\"\",'Caratula Resumen'!D22)","v":"Fondo de Aportaciones para la Educación Tecnológica y de Adultos/Colegio Nacional de Educación Profesional Técnica (FAETA/CONALEP)"},null,null,null,null,null,null,null,null,null,null,null,null,null,null,null,null,null,{"$f":"IF('Caratula Resumen'!D23=\"Elige el Periodo…\",\"\",'Caratula Resumen'!D23)","v":"4to. Trimestre"}]
[]
[]
[null,"Entidad Federativa","R.F.C.","CURP","Nombre","Clave integrada","Clave Presupuestal Integrada y Categoria aparte",null,null,null,null,null,null,"Clave CT Origen","Nombre CT","Periodo",null,"Monto de Remuneraciones Mensuales ","Monto de referencia","Diferencia\n(R-S)"]
[null,null,null,null,null,null,"Partida Presupuestal","Código de Pago","Clave de Unidad","Clave de Sub Unidad","Clave de Categoría","Horas Semana Mes ","Número de Plaza",null,null,"Desde","Hasta"]
[]
[null,"Entidad Federativa","R.F.C.","CURP","Nombre","Clave integrada","Partida Presupuestal","Código de Pago","Clave de Unidad","Clave de Sub Unidad","Clave de Categoría","Horas Semana Mes ","No. de plaza","CT","Nombre CT","Periodo\nDesde","Periodo\nHasta","Monto de Remuneraciones Mensuales ","Monto de referencia","Diferencia\n(R-S)"]
[]
[]
[]
[]
[null,"Total Personas : ",null,null,null,null,null,null,null,null,null,null,null,null,"Total Remuneraciones Mensuales:"]
[]
[null,null,null,null,null,null,null,null,null,null,null,null,null,null,null,null,null,"Total Diferencia:"]
[]
[null,"Fuente : Información proporcionada por las Entidades Federativas"]

{"sheet":"Listas","index":17,"n_rows":42,"n_cols":8,"rows_kept":42,"cut":false,"hidden":true,"merged":[]}
[]
[]
[]
[null,"Elige un Fondo…"]
[null,"Fondo de Aportaciones para la Educación Básica y Normal (FAEB)"]
[null,"Fondo de Aportaciones para la Educación Tecnológica y de Adultos/Colegio Nacional de Educación Profesional Técnica (FAETA/CONALEP)"]
[null,"Fondo de Aportaciones para la Educación Tecnológica y de Adultos/Instituto Nacional para la Educación de los Adultos (FAETA/INEA)"]
[]
[]
[null,null,null,null,null,null,null,"Elige la Entidad Federativa…"]
[null,"Elige el Periodo…",null,null,null,null,null,"AGUASCALIENTES"]
[null,"1er. Trimestre",null,null,null,null,null,"BAJA CALIFORNIA"]
[null,"2do. Trimestre",null,null,null,null,null,"BAJA CALIFORNIA SUR"]
[null,"3er. Trimestre",null,null,null,null,null,"CAMPECHE"]
[null,"4to. Trimestre",null,null,null,null,null,"COAHUILA "]
[null,null,null,"Elige el Año…",null,null,null,"COLIMA "]
[null,null,null,2013,null,null,null,"CHIAPAS "]
[null,null,null,2014,null,null,null,"CHIHUAHUA "]
[null,null,null,2015,null,null,null,"DISTRITO FEDERAL"]
[null,null,null,2016,null,null,null," DURANGO "]
[null,null,null,2017,null,null,null," GUANAJUATO "]
[null,null,null,2018,null,null,null," GUERRERO "]
[null,null,null,null,null,null,null," HIDALGO"]
[null,null,null,null,null,null,null," JALISCO "]
[null,null,null,null,null,null,null," MEXICO "]
[null,null,null,null,null,null,null," MICHOACAN "]
[null,null,null,null,null,null,null," MORELOS "]
[null,null,null,null,null,null,null," NAYARIT "]
[null,null,null,null,null,null,null," NUEVO LEON"]
[null,null,null,null,null,null,null," OAXACA "]
[null,null,null,null,null,null,null," PUEBLA "]
[null,null,null,null,null,null,null," QUERETARO "]
[null,null,null,null,null,null,null," QUINTANA ROO"]
[null,null,null,null,null,null,null," SAN LUIS"]
[null,null,null,null,null,null,null," SINALOA "]
[null,null,null,null,null,null,null," SONORA "]
[null,null,null,null,null,null,null," TABASCO "]
[null,null,null,null,null,null,null," TAMAULIPAS "]
[null,null,null,null,null,null,null," TLAXCALA "]
[null,null,null,null,null,null,null," VERACRUZ"]
[null,null,null,null,null,null,null," YUCATÁN "]
[null,null,null,null,null,null,null," ZACATECAS "]