{"text_format":"1","workbook":"xlsx","n_sheets":18,"sheets":["Caratula Resumen","A Y  II D3","A Y II D4","B)","II B) Y 1","II C y 1_","II D) 2","II D) 4","II D) 4 A","II D) 6","II D) 7 1","II D) 7 2 ","II D) 7 3","E)","G)","F) 1","F) 2","Listas"],"not_rendered":{"charts":0,"images":17,"macros":1,"external_links":0,"defined_names":17,"comments":16,"pivot_tables":0},"unopened":[],"bounds":{"document_bytes":16777216,"sheet_cells":100000,"rows_first":2000,"rows_last":500,"rows_between":2000,"halvings":0,"cell_chars":16384,"cell_head_chars":4096},"cells_cut":0,"cells_raw":0,"read":"whole","date_system":"1900"}

{"sheet":"Caratula Resumen","index":0,"n_rows":73,"n_cols":18,"rows_kept":73,"cut":false,"hidden":false,"merged":[[69,2,69,5],[71,2,71,5],[72,2,72,5],[73,2,73,5],[20,3,20,14],[21,3,21,14],[22,3,22,14],[49,3,49,6],[62,2,62,5],[63,2,63,5],[65,2,65,5],[66,2,66,5],[68,2,68,5],[43,3,43,6],[44,3,44,6],[45,3,45,6],[46,3,46,6],[47,3,47,6],[48,3,48,6],[37,3,37,6],[38,3,38,6],[39,3,39,6],[40,3,40,6],[41,3,41,6],[42,3,42,6],[36,3,36,6],[10,3,10,18],[11,3,11,18],[12,3,12,18],[34,3,34,6],[35,3,35,6]]}
[]
[]
[]
[]
[]
[]
[]
[]
[]
[]
[]
[null,null,null,"FORMATOS ENTREGADOS PARA DAR CUMPLIMIENTO AL ARTICULO 73 DE \"LA LEY GENERAL DE CONTABILIDAD GUBERNAMENTAL\""]
[]
[]
[]
[]
[]
[]
[]
[]
[null,null,"Entidad Federativa :"," GUANAJUATO "]
[null,null,"Fondo :","Fondo de Aportaciones para la Educación Tecnológica y de Adultos/Colegio Nacional de Educación Profesional Técnica (FAETA/CONALEP)"]
[null,null,"Periodo :","3er. Trimestre"]
[]
[]
[]
[]
[]
[]
[]
[]
[null,null,null,null,null,null,null,"TOTAL REGISTROS ",null,"Num. de Paginas",null,"TOTAL PERSONAS",null,"TOTAL PLAZAS",null,"Total Pto. Federal",null,"Total Ppto. Otras Fuentes"]
[]
[]
[null,1,"A Y II D3","Personal Comisionado",null,null,null,42,null,2,null,42,null,42,null,3156482.91,null,0]
[null,2,"A Y II D4","Personal con Licencia",null,null,null,23,null,1,null,23,null,23,null,314257.32,null,0]
[null,3,"B)   ","Registro Federal de Contribuyentes de Trabajadores con Pagos Retroactivos con un Periodo Mayor a 45 días",null,null,null,0,null,1,null,0,null,0,null,"N/A",null,"N/A"]
[null,4,"II B) Y 1","Plaza / Función",null,null,null,919,null,20,null,919,null,"N/A",null,"N/A",null,"N/A"]
[null,5,"II C y 1_","Personal Federalizado por Registro Federal de Contribuyentes",null,null,null,919,null,20,null,919,null,919,null,{"$f":"'II C y 1_'!U935","v":44568149.409999974},null,0]
[null,6,"II D) 2","Movimientos de Plazas",null,null,null,0,null,1,null,0,0,0,null,"N/A",null,"N/A"]
[null,7,"II D) 4","Trabajadores Jubilados en el Periodo",null,null,null,1,null,1,null,1,6,1,null,"N/A",null,"N/A"]
[null,8,"II D) 4 A","Trabajadores que Tramitaron Licencia Prejubilatoria en el Periodo",null,null,null,0,null,1,null,0,null,0,null,{"$f":"'II D) 4 A'!P21","v":0},null,0]
[null,9,"II D) 6","Trabajadores Contratados por Honorarios en el Periodo",null,null,null,0,null,1,null,0,null,"N/A",null,"N/A",null,"N/A"]
[null,10,"II D) 7 1 ","Analítico de Categorías / Plazas Autorizadas con su Tabulador",null,null,null,30,null,1,null,"N/A",null,"N/A",null,"N/A",null,"N/A"]
[null,11,"II D) 7 2 ","Catálogo de Categorías y Tabuladores",null,null,null,30,null,1,null,"N/A",null,"N/A",null,"N/A",null,"N/A"]
[null,12,"II D) 7 3 ","Catálogo de Percepciones y Deducciones",null,null,null,68,null,3,null,"N/A",null,"N/A",null,"N/A",null,"N/A"]
[null,13,"E)","Trabajadores que Cobran con RFC / CURP con Formato Incorrecto",null,null,null,0,null,1,null,0,null,"N/A",null,"N/A",null,"N/A"]
[null,14,"F) 1","Trabajadores con Doble Asignación Salarial en Municipios no Colindantes Geográficamente",null,null,null,0,null,1,null,0,null,"N/A",null,"N/A",null,"N/A"]
[null,15,"F) 2","Trabajadores Ocupando Plazas que Superan el Número de Horas de Compatibilidad Autorizadas",null,null,null,0,null,1,null,0,null,0,null,"N/A",null,"N/A"]
[null,16,"G)","Trabajadores Cuyo Salario Básico Supere los Ingresos Promedio de un Docente en la Categoría más Alta del Tabulador Salarial Correspondiente a Cada Entidad",null,null,null,0,null,1,null,0,null,"N/A",null,"N/A",null,"N/A"]
[]
[]
[]
[]
[]
[]
[]
[]
[]
[]
[]
[]
[null,null,"LIC. LUCIA GONZALEZ MUÑOZ"]
[null,null,"Nombre del  Responsable"]
[]
[null,null,"DIRECTORA DE ADMINISTRACION"]
[null,null,"Cargo"]
[]
[]
[null,null,"Firma"]
[]
[null,null,"2016-10-14"]
[null,null,"Fecha"]

{"sheet":"A Y  II D3","index":1,"n_rows":64,"n_cols":25,"rows_kept":64,"cut":false,"hidden":false,"merged":[[9,1,9,7],[12,6,12,12],[12,1,13,1],[12,2,13,2],[12,3,13,3],[12,4,13,4],[12,5,13,5],[60,12,60,14],[12,24,13,24],[12,13,12,14],[12,15,13,15],[12,16,13,16],[12,17,13,17],[12,18,12,19],[12,20,13,20],[58,13,58,14],[12,21,13,21],[12,22,13,22],[12,23,13,23]]}
[]
[]
[]
[]
[]
[]
[]
[]
[null,"Formato: Personal Comisionado"]
[null,{"$f":"IF('Caratula Resumen'!D22=\"Elige el Periodo…\",\"\",'Caratula Resumen'!D22)","v":"Fondo de Aportaciones para la Educación Tecnológica y de Adultos/Colegio Nacional de Educación Profesional Técnica (FAETA/CONALEP)"}]
[null,null,null,null,null,null,null,null,null,null,null,null,null,null,null,null,null,null,null,null,null,null,null,"3er. Trimestre 2016"]
[]
[null,"Entidad Federativa","R.F.C.","CURP","Nombre","Clave integrada","Clave Presupuestal",null,null,null,null,null,null,"Fecha Comisión",null,"Percepciones pagadas en el Periodo de Comisión con Presupuesto Federal*","Percepciones pagadas en el Periodo de Comisión con Presupuesto de otra fuente*","Clave CT Origen","CT Destino dentro del sector",null,"Lugar de la comisión fuera del sector educativo","Tipo de Comisión","Función Específica","Objeto de la comision","No. Oficio"]
[null,null,null,null,null,null,"Partida Presupuestal","Código de Pago","Clave de Unidad","Clave de Sub Unidad","Clave de Categoría","Horas Semana Mes ","Número de Plaza","Inicio","Conclusión",null,null,null,"Clave","Turno"]
[]
[null,"Entidad Federativa","R.F.C.","CURP","Nombre","Clave integrada","Partida Presupuestal","Código de Pago","Clave de Unidad","Clave de Sub Unidad","Clave de Categoría","Horas Semana Mes ","Número de Plaza","Fecha Comisión\nInicio","Fecha Comisión\nConclusión","Percepciones pagadas en el Periodo de Comisión con Presupuesto Federal*","Percepciones pagadas en el Periodo de Comisión con Presupuesto de otra fuente*","Clave CT Origen","Clave","Turno","Lugar de la comisión fuera del sector educativo","Tipo de Comisión","Función Específica","Objeto de la comision","No. Oficio"]
[null,"GUANAJUATO","AECL710621SE4","AECL710621HGTRRS02","JOSE LUIS ARELLANO CRUZ","113010030000A0320200.010301",1130,"1003","00","00","A03202","00.0",10301,20141117,20161231,35472.89,0,"11APT0001T","11DPT0010Y",120,"-------------------------------------------------------------","C","APOYO AL AREA DE CAPACITACION","APOYO AL AREA POR FALTA DE PERSONAL","976/2014"]
[null,"GUANAJUATO","CAHG600308UU9","CAHG600308HDFDRL06","GUILLERMO CAUDILLO HERRERA","113010030000CF0210500.014598",1130,"1003","00","00","CF02105","00.0",14598,20160701,20160831,52344.800000000003,0,"11APT0001T","11DPT0007K",100,"-------------------------------------------------------------","C","JEFE DE SERVICIOS ADMINISTRATIVOS","JEFE DE SERVICIOS ADMINISTRATIVOS","S/N"]
[null,"GUANAJUATO","BACJ850923PQ8","BACJ850923HGTRRS05","JESUS OMAR BARCENAS CORNEJO","113010030000CF0210500.014598",1130,"1003","00","00","CF02105","00.0",14598,20160921,20160930,12017.11,0,"11APT0001T","11DPT0007K",100,"-------------------------------------------------------------","C","JEFE DE SERVICIOS ADMINISTRATIVOS","JEFE DE SERVICIOS ADMINISTRATIVOS","S/N"]
[null,"GUANAJUATO","EIPA861113S53","EIPA861113HGTSRB08","JOSE ABRAHAM ESPINOZA PORRAS","113010030705CF3420200.05581",1130,"1003","07","05","CF34202","00.0",5581,20080601,20161231,32327.68,0,"11APT0001T","11APT0001T",100,"-------------------------------------------------------------","C","AREA DE ACADEMICOS","APOYO AL AREA POR FALTA DE PERSONAL","S/N"]
[null,"GUANAJUATO","GAGV930611G79","GAGV930611HGTRMC04","VICTOR HUGO GARCIA GOMEZ","113010030513S0120100.02502",1130,"1003","05",13,"S01201","00.0",2502,20160316,20161231,26729.229999999996,0,"11APT0001T","11DPT0003O",120,"-------------------------------------------------------------","C","ASISTENTE DE SERVICIOS BASICOS","APOYO ADMINISTRATIVO","0645/2016"]
[null,"GUANAJUATO","GUJE870107661","GUJE870107MGTTRL01","ELIZABETH VERONICA GUTIERREZ JUAREZ","113010030705CF3320400.02546",1130,"1003","07","05","CF33204","00.0",2546,20090601,20161231,59015.62,0,"11APT0001T","11APT0001T",100,"-------------------------------------------------------------","C","AREA DE PLANEACION","APOYO AL AREA POR FALTA DE PERSONAL","S/N"]
[null,"GUANAJUATO","MABM8602122N2","MABM860212MGTRRL21","MELISSA MARISELA MARTINEZ BARRIOS","113010030705S0120100.02647",1130,"1003","07","05","S01201","00.0",2647,20141116,20161231,29819.200000000001,0,"11APT0001T","11APT0001T",100,"-------------------------------------------------------------","C","APOYO EN EL AREA DE JURIDICO","APOYO AL AREA POR FALTA DE PERSONAL","S/N"]
[null,"GUANAJUATO","MANR8209073S1","MANR820907HGTCGT04","RITO MACIAS NEGRETE","113010030705CF0160100.011035",1130,"1003","07","05","CF01601","00.0",11035,20090901,20161231,90553.079999999987,0,"11APT0001T","11APT0001T",100,"-------------------------------------------------------------","C","APOYO AL AREA DE PLANEACION","APOYO AL AREA POR FALTA DE PERSONAL","S/N"]
[null,"GUANAJUATO","MOGM581228P96","MOGM581228MGTRNR09","MORENO GONZALEZ MARTHA DEL CARMEN","113010030000A0180100.018843",1130,"1003","00","00","A01801","00.0",18843,20080801,20161231,45841.68,0,"11APT0001T","11DPT0007K",120,"-------------------------------------------------------------","C","ADMINISTRATIVO TECNICO ESPECIALISTA","COLABORAR EN LAS ACTIVIDADES RELACIONADAS CON EL DEPARTAMENTO DE RECURSOS HUMANOS DEL PLANTEL","7292008"]
[null,"GUANAJUATO","OISI790511DD8","OISI790511HHGLNS14","ISAMEL OLIVO SANCHEZ","113010030705S0120100.02653",1130,"1003","07","05","S01201","00.0",2653,20160316,20161231,27569.52,0,"11APT0001T","11DPT0003O",120,"-------------------------------------------------------------","C","ASISTENTE DE SERVICIOS BASICOS","APOYO DE TALLERES Y LABORATORIOS","S/N"]
[null,"GUANAJUATO","PELI680925LM6","PELI680925MGTDPV03","IVONNE YOLANDA PEDROZA LOPEZ            ","113010030000CF3320600.010303",1130,"1003","00","00","CF33206","00.0",10303,20140829,20161231,118773.06,0,"11APT0001T","11DPT0013V",120,"-------------------------------------------------------------","C","JEFE DE PROYECTO DE FORMACION TÉCNICA","POR FALTA DE PERSONAL REALIZA LABORES RELACIONADAS CON EL DEPARTAMENTO DE FORMACIÓN TÉCNICA","1206/2014"]
[null,"GUANAJUATO","PESE6410262J8","PESE641026HTSRNR02","ERNESTO PEREZ SANCHEZ","113010030705CF0160100.011098",1130,"1003","07","05","CF01601","00.0",11098,20130108,20161231,90553.079999999987,0,"11APT0001T","11APT0001T",100,"-------------------------------------------------------------","C","APOYO AL AREA DE PLANEACION","APOYO AL AREA POR FALTA DE PERSONAL","S/N"]
[null,"GUANAJUATO","VARG660927MXA","VARG660927MDFLSL01","GLORIA  GUADALUPE VALENZUELA RIOS","113010030705CF0160100.013322",1130,"1003","07","05","CF01601","00.0",13322,20130201,20161231,90553.079999999987,0,"11APT0001T","11APT0001T",100,"-------------------------------------------------------------","C","EN EL AREA DE PROMOCION Y VINCULACION","APOYO AL AREA POR FALTA DE PERSONAL","S/N"]
[null,"GUANAJUATO","CAGX680903LH5","CXGA680903HGTHNL08","CHAO GONZALEZ ALBERTO","113010030029CF0210300.02103",1130,"1003","00",29,"CF02103","00.0","2103",20160101,20161231,92369.4,0,"11DPT0002P","11DPT0009I",100,"-------------------------------------------------------------","C","DIRECTOR DE PLANTEL \"B\" Y \"C\" II","CUBRIR LA DIRECCION DEL PLANTEL","S/N"]
[null,"GUANAJUATO","GATG451128UX1","GATG451128HDFYRS05","GUSTAVO GAYTAN TORRES","113010030029CF3320600.013248",1130,"1003","00","29","CF33206","00.0",13248,20120716,20161231,77908.990000000005,0,"11DPT0002P","11DPT0008J",120,"-------------------------------------------------------------","C","COORDINADOR EJECUTIVO","CUBRIR LA COORDINACION EJECUTIVA DEL PLANTEL CORTAZAR",16262012]
[null,"GUANAJUATO","MOFD741006FM4","MOFD741006HGTSLV05","DAVID MOSQUEDA FLORES","113010030029CF1820300.011914",1130,"1003","00","29","CF18203","00.0",11914,20150916,20161231,40494.53,0,"11DPT0002P","11DPT0016S",100,"-------------------------------------------------------------","C","SUPERVISOR DE MANTENIMIENTO","ACTIVIDADES RELATIVAS AL NOMBRAMIENTO ","1409/2015"]
[null,"GUANAJUATO","AETA880105TQ0","AETA880105HGTCNN01","ANTONIO ACEVEDO TINAJERO","113010030030CF3320600.013322",1130,"1003","00","30","CF33206","00.0",13322,20130301,20161231,81235.69,0,"11DPT0003O","11DPT0010Y",120,"-------------------------------------------------------------","C","DESARROLLAR ACTIVIDADES EN EL PLANTEL SILAO","DESARROLLAR ACTIVIDADES EN EL PLANTEL SILAO",5512013]
[null,"GUANAJUATO","GOPR8103287J3","GOPR810328HDFMRB09","RUBEN GOMEZ PORTILLA","113010030030CF0210300.012664",1130,"1003","00",30,"CF02103","00.0",12664,20160301,20161231,92369.4,0,"11DPT0003O","11DPT0010Y",120,"-------------------------------------------------------------","C","DIRECTOR DE PLANTEL ","DIRECTOR DE PLANTEL ","S/N"]
[null,"GUANAJUATO","NIRA700123GK9","NIRA700123MGTTVN01","ANA LAURA NIETO RIVERA","113010030030CF3320600.014316",1130,"1003","00","30","CF33206","00.0",14316,20090816,20161231,123725.78,0,"11DPT0003O","11APT0001T",100,"-------------------------------------------------------------","C","MEJORAMIENTO DE LOS PROCESOS DEL CAST","MEJORAMIENTO DE LOS PROCESOS EN CAST",16082009]
[null,"GUANAJUATO","PAPA810618AR6","PAPA810618HGTLLB03","ABRAHAM PALACIOS PALACIOS","113010030030S0120200.011099",1130,"1003","00","30","S01202","00.0",11099,20150101,20161231,32931.31,0,"11DPT0003O","11APT0001T",100,"-------------------------------------------------------------","C","DESARROLLAR ACTIVIDADES EN DIRECCIÓN GENERAL","DESARROLLAR ACTIVIDADES EN DIRECCIÓN GENERAL","883/2015"]
[null,"GUANAJUATO","MORM731010QZ9","MORM731010MVZLZR03","MIRSA MOLGORA RAZO","113010030128CF0210400.012767",1130,"1003","01",28,"CF02104","00.0",12767,20140301,20161231,90482.46,0,"11DPT0004N","11DPT0005M",123,"-------------------------------------------------------------","C","DIRECTOR DE PLANTEL ","DIRECTOR DE PLANTEL ","S/N"]
[null,"GUANAJUATO","CARR771026IP3","CARR771026MDFRMS09","ROSANA CARRILLO RAMIREZ","113010030072CF0210500.014597",1130,"1003","00",72,"CF02105","00.0",14597,20160516,20170416,78517.2,0,"11DPT0005M","11DPT0011X",120,"_________________________________________","C","COORDINADOR EJECUTIVO","APOYO AL AREA POR FALTA DE PERSONAL","0804/2016"]
[null,"GUANAJUATO","TOCB650526UK9","TOCB650526MGTRBR04","BERTHA TORRES COVARRUBIAS","113010030072CF0210300.012617",1130,"1003","00",72,"CF02103","00.0",12617,20140201,20160930,92369.4,0,"11DPT0005M","11DPT0015T",100,"-------------------------------------------------------------","C","DIRECTOR DE PLANTEL ","DIRECTOR DE PLANTEL ","S/N"]
[null,"GUANAJUATO","JALS470121DUA","JALS470121HMNMPR04","SERGIO JAIMES LOPEZ","113010030163CF0210300.012618",1130,"1003","01",63,"CF02103","00.0",12618,20140701,20161231,92369.4,0,"11DPT0006L","11DPT0004N",120,"-------------------------------------------------------------","C","DIRECTOR DE PLANTEL ","DIRECTOR DE PLANTEL ","S/N"]
[null,"GUANAJUATO","MAZR720405LB8","MAZR720405HMNRTC01","RICARDO MARTINEZ ZETINA","113010030163CF3320400.07693",1130,"1003","01","63","CF33204","00.0",7693,20140216,20161231,63769.020000000004,0,"11DPT0006L","11DPT0008J",120,"-------------------------------------------------------------","C","AREA DE FORMACION TECNICA","APOYO AL AREA POR FALTA DE PERSONAL","976/2014"]
[null,"GUANAJUATO","CAPE530526869","CAPE530526MGTRRL07","M ELENA CARDIEL PEREZ","113010030203CF3320400.09174",1130,"1003","02","03","CF33204","00.0",9174,20080801,20161231,80905.33,0,"11DPT0007K","11APT0001T",120,"-------------------------------------------------------------","C","COLABORAR CON LOS PROYECTOS RELACIONADOS AL AREA DE ADMINISTRACIÓN Y FINANZAS","COLABORAR CON LOS PROYECTOS RELACIONADOS AL AREA DE ADMINISTRACIÓN Y FINANZAS","OPD-GTO730/2008"]
[null,"GUANAJUATO","ROGF800428M80","ROGF800428HGTDZD06","FIDEL RODRIGUEZ GUZMAN                  ","113010030203CF3320400.09201",1130,"1003","02","03","CF33204","00.0",9201,20160418,20161231,47942.39,0,"11DPT0007K","11APT0001T",120,"-------------------------------------------------------------","C","SUBJEFE TECNICO ESPECIALISTA","APOYO PARA CERTIFICACIONES","OPD-GTO0642/2016"]
[null,"GUANAJUATO","SACA791207U75","SACA791207MGTLSL02","MARIA ALEJANDRA SALAZAR CASTAÑEDA","1130100323CF0210500.012840",1130,"1003",2,3,"CF02105","00.0",12840,20160216,20161231,78895.989999999991,0,"11DPT0007K","11APT0001T",100,"_________________________________________","C","COORDINADOR DE SERVICIOS ESCOLARES","COORDINA LOS PROCESOS ESCOLARES Y EXTRACURRICULARES DE ALUMNOS.","OPD-GTO1786/2012"]
[null,"GUANAJUATO","RASJ781020U88","RASJ781020MGTZSS02","JOSEFINA RAZO SOSA                      ","113010030233CF3320600.014312",1130,"1003","02",33,"CF33206","00.0",14312,20160516,20161231,69102.94,0,"11DPT0008J","11DPT0006L",100,"-------------------------------------------------------------","C","JEFE DE PROYECTO","RESPONSABLE DE FORMACIÓN TÉCNICA","0803/2016"]
[null,"GUANAJUATO","ZUGJ521022BB6","ZUGJ521022HGTXRV02","JAVIER ZUÑIGA GARCIA","113010030174CF0210300.012663",1130,"1003","01",74,"CF02103","00.0",12663,19920216,20161231,92369.4,0,"11DPT0009I","11DPT0014U",100,"-------------------------------------------------------------","C","DIRECTOR DE PLANTEL ","DIRECTOR DE PLANTEL ","S/N"]
[null,"GUANAJUATO","GUPD810705I4A","GUPD810705HQTRDM04","DOMINGO DANIEL GUERRERO PADILLA","113010030204CF0210400.012744",1130,"1003","02","04","CF02104","00.0",12744,20130116,20161231,90482.46,0,"11DPT0010Y","11DPT0006L",100,"-------------------------------------------------------------","C","DIRECTOR DE PLANTEL ","DIRECTOR DE PLANTEL ","S/N"]
[null,"GUANAJUATO","MAVR700118TS6","MAVR700118HGTRRB08","RUBEN MARTINEZ VARELA ","113010030204CF3320600.013251","1130","1003","02","04","CF33206","00.0",13251,20160701,20161231,117992.03,0,"11DPT0010Y","11DPT0003O",120,"-------------------------------------------------------------","C","JEFE DE PROYECTO DE DIR. FORMACION TECNICA Y CAPACITACION","JEFE DE PROYECTO DE DIR. FORMACION TECNICA Y CAPACITACION","S/N"]
[null,"GUANAJUATO","RABR820601BH9","RABR820601HGTMND08","RODOLFO OSVALDO RAMIREZ BUENO ","113010030204CF3320600.0266022","1130","1003","02","04","CF33206","00.0",266022,20150204,20161231,95982.860000000015,0,"11DPT0010Y","11APT0001T",100,"-------------------------------------------------------------","C","JEFE DE PROYECTO DE NOMINA ","ACTIVIDADES RELATIVAS AL NOMBRAMIENTO ","520/2015"]
[null,"GUANAJUATO","GOLR590503HDA","GOLR590503HGTNDB04","ROBERTO GONZALEZ LEDESMA","113010030249CF3320600.014319",1130,"1003","02",49,"CF33206","00.0",14319,20160416,20170415,124199.33,0,"11DPT0011X","11DPT0005M",100,"-------------------------------------------------------------","C","JEFE DE PROYECTO","APOYO AL AREA DE FORMACION TECNICA","532/2016"]
[null,"GUANAJUATO","MAJG650413GMA","MAJG650413HGTLRS08","GUSTAVO MALAGON JUÁREZ","113010030249CF3320600.013689",1130,"1003","02",49,"CF33206","00.0",13689,20120816,20161231,113378.75,0,"11DPT0011X","11DPT0006L",100,"-------------------------------------------------------------","C","MEJORAR LOS PROCESOS ","MEJORAMIENTO DE LOS PROCESOS DEL PLANTEL AL QUE FUE COMISIONADO ","1388/2012"]
[null,"GUANAJUATO","GAGY700725MG2","GAGY700725MGTRNS04","YESENIA GRANADOS GONZALEZ               ","113010030402CF0210200.012518",1130,"1003","04","02","CF02102","00.0",12518,19940601,20161231,92519.75999999998,0,"11DPT0012W","11DPT0002P",120,"-------------------------------------------------------------","C","DIRECTOR DE PLANTEL ","DIRECTOR DE PLANTEL ","S/N"]
[null,"GUANAJUATO","GOML710913T66","GOML710913MGTNXC08","LUCIA GONZALEZ MUÑOZ","113010030302CF3320600.018851",1130,"1003","03","02","CF33206","00.0",18851,"20160502",20160930,71815.140000000014,0,"11DPT0013V","11APT0001T",100,"-------------------------------------------------------------","C","COLABORAR CON LOS PROYECTOS RELACIONADOS AL AREA DE ADMINISTRACIÓN Y FINANZAS","COLABORAR CON LOS PROYECTOS RELACIONADOS AL AREA DE ADMINISTRACIÓN Y FINANZAS","761/2016"]
[null,"GUANAJUATO","ROMR861218274","ROMR861218HGTDGC00","RICARDO RODRIGUEZ MAGDALENO","113010030302CF3320600.018849",1130,"1003","03","02","CF33206","00.0",18849,"20141117",20161231,83173.850000000006,0,"11DPT0013V","11APT0001T",100,"-------------------------------------------------------------","C","COLABORAR CON LOS PROYECTOS RELACIONADOS CON EL ÁREA DE FORMACIÓN TÉCNICA DE LA DIRECCIÓN GRAL.","COLABORAR CON LOS PROYECTOS RELACIONADOS CON EL ÁREA DE FORMACIÓN TÉCNICA DE LA DIRECCIÓN GRAL.","1618/2014"]
[null,"GUANAJUATO","RORA760321A25","RORA760321HGTDDL07","ALEXANDER DANIEL RODRIGUEZ RODRIGUEZ    ","113010030302CF0210400.018848",1130,"1003","03","02","CF02104","00.0",18848,20151201,20161231,90482.46,0,"11DPT0013V","11DPT0003O",120,"-------------------------------------------------------------","C","DIRECTOR DE PLANTEL ","DIRECTOR DE PLANTEL ","S/N"]
[null,"GUANAJUATO","GAAE770204JK3","GAAE770204MDFYLL06","ELIA GAYTAN ALCARAZ","113010030303CF0210400.018883",1130,"1003","03","03","CF02104","00.0",18883,20130301,20160930,90482.46,0,"11DPT0014U","11DPT0012W",120,"-------------------------------------------------------------","C","DIRECTORA DEL PLANTEL","DIRECTORA DEL PLANTEL","S/N"]
[null,"GUANAJUATO","OOCM7903122F9","OOCM790312MGTRRR03","MARCELA OROZCO CORNEJO","113010030303CF3320400.018865",1130,"1003","03","03","CF33204","00.0",18865,20130116,20160930,68630.97,null,"11DPT0014U","11DPT0003O",120,null,"C","OCUPACION PUESTO VACANTE ","OCUPACION PUESTO DE SUBJEFE TECNICO ESPECIALISTA DEL PLANTEL LEON 1","657/2013"]
[null,"GUANAJUATO","SECG740707K72","SECG740707MZSGML05","GUILLERMINA SEGURA CAMPOS","113010030303CF3320600.018864",1130,"1003","03","03","CF33206","00.0",18864,20160121,20160331,78014.180000000008,null,"11DPT0014U","11APT0001T",120,null,"C","OCUPACION PUESTO VACANTE ","OCUPACION PUESTO DE JEFE PROYECTO EN CAST LEON","0138/2016"]
[null,"Total Personas : ",42,null,null,null,null,null,null,null,"Total Plazas : ",null,46,"Total Pto. Federal",null,{"$f":"SUBTOTAL(109,Tabla1[Percepciones pagadas en el Periodo de Comisión con Presupuesto Federal*])","v":3156482.9099999997}]
[]
[null,null,null,null,null,null,null,null,null,null,null,null,"Total Ppto. Otras Fuentes",null,null,null,{"$f":"SUM(Q17:Q60)","v":0}]
[]
[null,"*Total de Percepciones reportadas por la Entidad Federativa como pagadas al trabajador durante la comisión."]
[null,"Fuente : Información proporcionada por las Entidades Federativas."]

{"sheet":"A Y II D4","index":2,"n_rows":45,"n_cols":21,"rows_kept":45,"cut":false,"hidden":false,"merged":[[9,1,9,6],[39,13,39,14],[12,16,13,16],[12,17,13,17],[12,20,13,20],[12,1,13,1],[12,3,13,3],[12,4,13,4],[12,5,13,5],[12,6,12,12],[12,13,12,14],[12,2,13,2],[12,18,12,19],[12,15,13,15]]}
[]
[]
[]
[]
[]
[]
[]
[]
[null,"Formato: Personal con Licencia"]
[null,{"$f":"IF('Caratula Resumen'!D22=\"Elige el Periodo…\",\"\",'Caratula Resumen'!D22)","v":"Fondo de Aportaciones para la Educación Tecnológica y de Adultos/Colegio Nacional de Educación Profesional Técnica (FAETA/CONALEP)"}]
[null,null,null,null,null,null,null,null,null,null,null,null,null,null,null,null,null,null,null,null,"3er. Trimestre 2016"]
[]
[null,"Entidad Federativa","R.F.C.","CURP","NOMBRE","Clave integrada","Clave Presupuestal",null,null,null,null,null,null,"Periodo Licencia",null,"Percepciones pagadas en el Periodo de la Licencia con Presupuesto Federal*","Percepciones pagadas en el Periodo de la Licencia con Presupuesto de otra fuente*","Clave CT Origen","Licencia",null,"Descripción de la Licencia"]
[null,null,null,null,null,null,"Partida Presupuestal","Código de Pago","Clave de Unidad","Clave de Sub Unidad","Clave de Categoría","Horas Semana Mes ","Número de Plaza","Inicio","Conclusión",null,null,null,"Clave","Tipo"]
[]
[null,"Entidad Federativa","R.F.C.","CURP","NOMBRE","Clave integrada","Partida Presupuestal","Código de Pago","Clave de Unidad","Clave de Sub Unidad","Clave de Categoría","Horas Semana Mes ","Número de Plaza","Periodo Licencia\nInicio","Periodo Licencia\nConclusión","Percepciones pagadas en el Periodo de la Licencia con Presupuesto Federal*","Percepciones pagadas en el Periodo de la Licencia con Presupuesto de otra fuente*","Clave CT Origen","Licencia\nClave","Licencia\nTipo","Descripción de la Licencia"]
[null,"GUANAJUATO","BAUR7105213K8","BAUR710521MDFRRT02","RITA BARCENAS URBINA","1130110030028A0320200.0280034",11301,1003,"00",28,"A03202","00.0",280034,20160810,20161006,{"$f":"12675.54*2","v":25351.08},null,"11DPT0001Q",22,"CON GOSE DE SUELDO","INCAPACIDAD MEDICA"]
[null,"GUANAJUATO","PAGJ820614HB3 ","PAGJ820614MGTLRN07","JUANA ADRIANA PALOALTO GARCIA","1130110030028PB20.0280034",11301,1003,"00",28,"PB","20.0",280034,20160801,20170201,23467.5,null,"11DPT0001Q",16,"SIN GOSE DE SUELDO","SIN GOSE DE SUELDO"]
[null,"GUANAJUATO","ROBI821220310","ROBI821220MDFDCT03","ITZEL RODRIGUEZ BECERRA","1130110030028PA25.0280034",11301,1003,"00",28,"PA","25.0",280034,20160801,20170201,25702.5,null,"11DPT0001Q",16,"SIN GOSE DE SUELDO","SIN GOSE DE SUELDO"]
[null,"GUANAJUATO","RONB7703042K6","RONB770304MGTDTT07","BEATRIZ RODRIGUEZ NIETO","1130110030028PC10.0280034",11301,1003,"00",28,"PC","10.0",280034,20160901,20170201,13558.5,null,"11DPT0001Q",16,"SIN GOSE DE SUELDO","SIN GOSE DE SUELDO"]
[null,"GUANAJUATO","TAFE821210JV8","TAFE821210MMNPLL03","TAPIA FLORES ELIDA","1130110030028PB25.0280034",11301,1003,"00",28,"PB","25.0",280034,20160716,20161013,29797.5,null,"11DPT0001Q",25,"CON GOSE DE SUELDO","POR GRAVIDEZ O SU REFRENDO"]
[null,"GUANAJUATO","ROGJ631018GD6","ROGJ631018HGTMRN04","JUAN JOSE ROMERO GARCIA","113010030030CF1920100.02620",1130,1003,"00",30,"CF19201","00.0",2620,20140701,20161231,50485.56,null,"11DPT00030",12,"CON GOSE DE SUELDO","COMISIÓN SINDICAL O SU REFRENDO"]
[null,"GUANAJUATO","SOGY851206464","SOGY851206MMNSZN01","YANET SOSA GUZMAN","113010010128PB30.0249017",1130,1001,"01",28,"PB","30.0",249017,20160721,20161018,18744.68,null,"11DPT0004N",22,"CON GOSE DE SUELDO","INCAPACIDAD MEDICA"]
[null,"GUANAJUATO","AULJ800815441","AULJ800815HGTGPS08","JOSE AGUILAR LOPEZ","1130110010163PA10.0630001",11301,1001,"01","63","PA","10.0",630001,20160801,20170131,null,null,"11DPT0006L",16,"SIN GOSE DE SUELDO","SIN GOSE DE SUELDO"]
[null,"GUANAJUATO","GUSG880306VD5","GUSG880306HGTLNR09","GERARDO GUILLEN SANCHEZ","1130110010163TA12.0630093",11301,1001,"01","63","TA","12.0",630093,20160901,20170131,null,null,"11DPT0006L",16,"SIN GOSE DE SUELDO","SIN GOSE DE SUELDO"]
[null,"GUANAJUATO","MASE831216GZ4","MASE831216MGTNTL05","ELIA MANDUJANO SOTO","1130110010163PA20.0630068",11301,1001,"01","63","PA","20.0",630068,20161001,20170131,null,null,"11DPT0006L",16,"SIN GOSE DE SUELDO","SIN GOSE DE SUELDO"]
[null,"GUANAJUATO","SOAE851129KH7","SOAE851129MGTTCS09","ESPERANZA SOTO ACEVEDO","1130110010163PB10.0630047",11301,1001,"01","63","PB","10.0",630047,20160801,20170131,null,null,"11DPT0006L",16,"SIN GOSE DE SUELDO","SIN GOSE DE SUELDO"]
[null,"GUANAJUATO","VAAE770920SD7","VAAE770920MOCZGR13","ERICA MARIZA VAZQUEZ AGUILERA","1130110010163PC05.0630051",11301,1001,"01",63,"PC","05.0",630051,20160801,20161231,null,null,"11DPT0006L",16,"SIN GOSE DE SUELDO","SIN GOSE DE SUELDO"]
[null,"GUANAJUATO","GOME811008E64","GOME811008MGTMNL03","ELIZABETH GOMEZ MENDOZA","1130110010203PA20.04","11301",1001,"02","03","PA","20.0",4,20160701,20160930,null,null,"11DPT0007K",16,"SIN GOSE DE SUELDO","SIN GOSE DE SUELDO"]
[null,"GUANAJUATO","HELU501011H62","HEXL501011HGTRXZ04","JOSE DE LA LUZ HERNANDEZ","1130110030000113000078964",1130,1003,"02","03","S01201","00.0",78964,20160701,20160930,38539.24,null,"11DPT0007K",14,"CON GOSE DE SUELDO","INCAPACIDAD MEDICA"]
[null,"GUANAJUATO","IAMJ7009132Z3","IAMJ700913HGTBLS01","JOSE DE JESUS IBARRA MELENDEZ","113010010203PC16.04","1130",1001,"02","03","PC","16.0",4,20160701,20160930,null,null,"11DPT0007K",16,"SIN GOSE DE SUELDO","SIN GOSE DE SUELDO"]
[null,"GUANAJUATO","ROZA8409121VA","ROZA840912MGTDXL02","ALMA ROSARIO RODRIGUEZ ZUÑIGA","113010010203PC26.04","1130",1001,"02","03","PC","26.0",4,20160701,20160930,null,null,"11DPT0007K",16,"SIN GOSE DE SUELDO","SIN GOSE DE SUELDO"]
[null,"GUANAJUATO","HEFJ700120711","HEFG700120HGTRSD12","J. GUADALUPE HERNANDEZ FISCAL","113010010233PC20.0233024",1130,1001,"02",33,"PC","20.0",233024,20160701,20160930,26952,null,"11DPT0008J",12,"CON GOSE DE SUELDO","COMISIÓN SINDICAL O SU REFRENDO"]
[null,"GUANAJUATO","BACA821115626","BACA821115MGTRRN05","BARRON CORONA MARIA DE LOS ANGELES","113010037428TA26.0740050",1130,1003,74,28,"TA","26.0",740050,20160916,20170131,6757.4,null,"11DPT0009I",10,"CON GOSE DE SUELDO","ASUNTOS PARTICULARES"]
[null,"GUANAJUATO"," EAMA860511UL8","EAMA860511MMNSRN08","ANA LUCIA ESCALANTE MARIN","113010010249PB25.0249017",1130,1001,"02",49,"PB","25.0",249017,20160901,20170131,null,null,"11DPT0011X",16,"SIN GOSE DE SUELDO","SIN GOSE DE SUELDO"]
[null,"GUANAJUATO","AAMR650620AB4","AAMR650620HGTLGB03","ROBERTO ALVARADO MAGAÑA","113010030249CF19201010606",1130,1003,"02",49,"CF19201","00.0",10606,20131016,20190930,42705,null,"11DPT0011X",12,"CON GOSE DE SUELDO","COMISIÓN SINDICAL O SU REFRENDO"]
[null,"GUANAJUATO","GAMB800204HK9","GAMB800204MGTRRR01","BERENICE ELENA MARIA GARCIA MARQUEZ","113010010249PC20.0490021",1130,1001,"02",49,"PC","20.0",490021,20160916,20170131,null,null,"11DPT0011X",16,"SIN GOSE DE SUELDO","SIN GOSE DE SUELDO"]
[null,"GUANAJUATO","SAJB8210296D0","SAJB821029HGTNMR03","BERNARDO SANCHEZ JIMENEZ ","113010010249PC20.0490050",1130,1001,"02",49,"PC","20.0",490050,20160201,20160731,null,null,"11DPT0011X",16,"SIN GOSE DE SUELDO","SIN GOSE DE SUELDO"]
[null,"GUANAJUATO","ROSJ840320PL5","ROSJ840320MMCMGL06","ROMERO SEGURA JULIA OYUKI","11301003030200A0180100.018877",1130,1003,"03","02","AO3202","00.0",18880,20160801,20161031,12196.36,null,"11DPT0013V",11,"SIN GOSE DE SUELDO","ASUNTOS PARTICULARES"]
[null,"Total Personas : ",23,null,null,null,null,null,null,null,"Total Plazas : ",null,23,"Total Pto. Federal",null,{"$f":"SUBTOTAL(109,Tabla3[Percepciones pagadas en el Periodo de la Licencia con Presupuesto Federal*])","v":314257.31999999995}]
[]
[null,null,null,null,null,null,null,null,null,null,null,null,null,"Total Ppto. Otras Fuentes",null,null,{"$f":"SUM(Q17:Q41)","v":0}]
[]
[null,"*Total de Percepciones reportadas por la Entidad Federativa como pagadas al trabajador durante la Licencia."]
[null,"Fuente : Información proporcionada por las Entidades Federativas."]

{"sheet":"B)","index":3,"n_rows":28,"n_cols":19,"rows_kept":28,"cut":false,"hidden":false,"merged":[[9,1,9,10],[12,1,13,1],[12,2,13,2],[12,3,13,3],[12,4,13,4],[12,5,12,11],[12,18,13,18],[12,12,13,12],[12,13,13,13],[12,14,13,14],[12,15,12,16],[12,17,13,17]]}
[]
[]
[]
[]
[]
[]
[]
[]
[null,"Formato: Registro Federal de Contribuyentes de Trabajadores con Pagos Retroactivos con un Periodo Mayor a 45 días"]
[null,{"$f":"IF('Caratula Resumen'!D22=\"Elige el Periodo…\",\"\",'Caratula Resumen'!D22)","v":"Fondo de Aportaciones para la Educación Tecnológica y de Adultos/Colegio Nacional de Educación Profesional Técnica (FAETA/CONALEP)"}]
[null,null,null,null,null,null,null,null,null,null,null,null,null,null,null,null,null,"3er. Trimestre 2016"]
[]
[null,"Entidad Federativa","RFC","CURP","Nombre","Clave Presupuestal",null,null,null,null,null,null,"Clave de Centro de Trabajo","Fecha de emisión de pago","Motivo del Pago Retroactivo","Periodo pagado",null,"Días transcurridos para el pago","Percepciones pagadas en el periodo reportado *"]
[null,null,null,null,null,"Partida Presupuestal","Código de Pago","Clave de Unidad","Clave de Sub Unidad","Clave de Categoría","Horas Semana Mes ","Número de Plaza",null,null,null,"Desde","Hasta"]
[]
[null,"Entidad Federativa","RFC","CURP","Nombre","Partida Presupuestal","Código de Pago","Clave de Unidad","Clave de Sub Unidad","Clave de Categoría","Horas semana mes","Número de plaza","Clave de Centro de Trabajo","Fecha de emisión de pago","Motivo del Pago Retroactivo","Periodo pagado\nDesde","Periodo pagado\nHasta","Días transcurridos para el pago","Percepciones pagadas en el periodo reportado *"]
[]
[]
[]
[]
[]
[]
[null,"Total Personas : ",null,null,null,null,null,null,null,null,"Total Plazas : ",null,null,null,null,"Total Percepciones Pagadas:"]
[]
[]
[]
[null,"*Total de Percepciones reportadas por la Entidad Federativa como pagadas en el periodo "]
[null,"Fuente : Información proporcionada por las Entidades Federativas"]

{"sheet":"II B) Y 1","index":4,"n_rows":939,"n_cols":25,"rows_kept":939,"cut":false,"hidden":false,"merged":[[12,24,14,24],[13,6,13,8],[13,9,13,11],[13,12,13,14],[13,15,13,17],[13,18,13,20],[12,6,12,20],[12,21,14,21],[12,22,14,22],[12,23,14,23],[12,4,14,4],[12,3,14,3],[12,2,14,2],[9,1,9,9],[936,21,936,23],[12,1,14,1],[12,5,14,5]]}
[]
[]
[]
[]
[]
[]
[]
[]
[null,"Formato: Plaza / Función"]
[null,{"$f":"IF('Caratula Resumen'!D22=\"Elige el Periodo…\",\"\",'Caratula Resumen'!D22)","v":"Fondo de Aportaciones para la Educación Tecnológica y de Adultos/Colegio Nacional de Educación Profesional Técnica (FAETA/CONALEP)"}]
[null,null,null,null,null,null,null,null,null,null,null,null,null,null,null,null,null,null,null,null,null,null,null,"3er. Trimestre 2016"]
[]
[null,"Entidad Federativa","RFC","CURP","Nombre","Centros de Trabajo","Plazas por tipo de función",null,null,null,null,null,null,null,null,null,null,null,null,null,null,"Total plazas Jornada","Total \nHSM","Total de Honorarios","Total de recursos presupuestales ejercidos en servicios personales en el periodo\n(2)"]
[null,null,null,null,null,null,"Apoyo a la labor educativa",null,null,"Administrativo y de servicio",null,null,"Docente y Apoyo Técnico Pedagógico",null,null,"Directivos y Supervisión",null,null,"Mandos medios y superiores"]
[null,null,null,null,null,null,"Jornada","HSM","Honorarios","Jornada","HSM","Honorarios","Jornada","HSM","Honorarios","Jornada","HSM","Honorarios","Jornada","HSM","Honorarios"]
[]
[null,"Entidad Federativa","RFC","CURP","Nombre","Centros de Trabajo","Jornada","HSM","Honorarios","Jornada2","HSM3","Honorarios4","Jornada5","HSM6","Honorarios7","Jornada8","HSM9","Honorarios10","Jornada11","HSM12","Honorarios13","Total plazas Jornada","Total \nHSM","Total de Honorarios","Total de recursos presupuestales ejercidos en servicios personales en el periodo\n(2)"]
[null,"GUANAJUATO","BACJ850923PQ8","BACJ850923HGTRS05","JESUS OMAR BARCENAS CORNEJO ",null,null,null,null,null,null,null,null,null,null,null,null,null,"X",null,null,null,null,null,12017.11]
[null,"GUANAJUATO","CAGX680903LH5","CXGA680903HGTHNL08","ALBERTO CHAO GONZALEZ                   ",null,null,null,null,null,null,null,null,null,null,null,null,null,"X",null,null,null,null,null,92369.4]
[null,"GUANAJUATO","CAHG600308UU9","CAHG600308HDFDRL06","GUILLERMO CAUDILLO HERRERA              ",null,null,null,null,null,null,null,null,null,null,null,null,null,"X",null,null,null,null,null,52344.800000000003]
[null,"GUANAJUATO","CARR771026IP3","CARR771026MDFRMS09","ROSANA CARRILLO RAMIREZ                 ",null,null,null,null,null,null,null,null,null,null,null,null,null,"X",null,null,null,null,null,78517.2]
[null,"GUANAJUATO","CUMG550523TM9","CUMG550523MDFRRL06","GLORIA ARACELI CRUZ MARTIN DEL CAMPO    ",null,null,null,null,null,null,null,null,null,null,null,null,null,"X",null,null,null,null,null,113531.28000000001]
[null,"GUANAJUATO","DIAL510311BH6","DIXA510311HGTSXL09","ALBERTO DE LA LU DIOSDADO               ",null,null,null,null,null,null,null,null,null,null,null,null,null,"X",null,null,null,null,null,241023.6]
[null,"GUANAJUATO","GAAE770204JK3","GAAE770204MDFYLL06","ELIA GAYTAN ALCARAZ                     ",null,null,null,null,null,null,null,null,null,null,null,null,null,"X",null,null,null,null,null,90482.46]
[null,"GUANAJUATO","GAGY700725MG2","GAGY700725MGTRNS04","YESENIA GRANADOS GONZALEZ               ",null,null,null,null,null,null,null,null,null,null,null,null,null,"X",null,null,null,null,null,92519.75999999998]
[null,"GUANAJUATO","GAPS690711PT2","GAPS690711MGTRRR00","SARA GISELA GARCIA PEREZ                ",null,null,null,null,null,null,null,null,null,null,null,null,null,"X",null,null,null,null,null,78517.2]
[null,"GUANAJUATO","GOPR8103287J3","GOPR810328HDFMRB09","RUBEN GOMEZ PORTILLA                    ",null,null,null,null,null,null,null,null,null,null,null,null,null,"X",null,null,null,null,null,92369.4]
[null,"GUANAJUATO","GUPD810705I4A","GUPD810705HQTRDM04","DOMINGO DANIEL GUERRERO PADILLA         ",null,null,null,null,null,null,null,null,null,null,null,null,null,"X",null,null,null,null,null,90482.46]
[null,"GUANAJUATO","HEPL670716M36","HEPL670716HGTRRS02","JOSE LUIS HERNANDEZ PEREZ               ",null,null,null,null,null,null,null,null,null,null,null,null,null,"X",null,null,null,null,null,90553.079999999987]
[null,"GUANAJUATO","JALS470121DUA","JALS470121HMNMPR04","SERGIO JAIMES LOPEZ                     ",null,null,null,null,null,null,null,null,null,null,null,null,null,"X",null,null,null,null,null,92369.4]
[null,"GUANAJUATO","JILD710426DB9","JILD710426HGTMPR06","DARIO DAMIAN JIMENEZ LOPEZ              ",null,null,null,null,null,null,null,null,null,null,null,null,null,"X",null,null,null,null,null,92369.4]
[null,"GUANAJUATO","LERD770827UM0","LERD770827HGTNDM00","JOSE DOMINGO DE LEON RODRIGUEZ          ",null,null,null,null,null,null,null,null,null,null,null,null,null,"X",null,null,null,null,null,90553.079999999987]
[null,"GUANAJUATO","LUCH751109S53","LUCH751109HGTVNG03","HUGO ENRIQUE LUEVANO CONTRERAS          ",null,null,null,null,null,null,null,null,null,null,null,null,null,"X",null,null,null,null,null,78517.2]
[null,"GUANAJUATO","MANR8209073S1","MANR820907HGTCGT04","RITO MACIAS NEGRETE                     ",null,null,null,null,null,null,null,null,null,null,null,null,null,"X",null,null,null,null,null,90553.079999999987]
[null,"GUANAJUATO","MORM731010QZ9","MORM731010MVZLZR03","MIRSA MARICELA MOLGORA RAZO             ",null,null,null,null,null,null,null,null,null,null,null,null,null,"X",null,null,null,null,null,90482.46]
[null,"GUANAJUATO","NIRG591215T84","NIRG591215MGTTVR06","GEORGINA DE LOURD NIETO RIVERA          ",null,null,null,null,null,null,null,null,null,null,null,null,null,"X",null,null,null,null,null,92369.4]
[null,"GUANAJUATO","OERL7305255H3","OERL730525HGTJDS00","LUIS ALBERTO OJEDA RODRIGUEZ            ",null,null,null,null,null,null,null,null,null,null,null,null,null,"X",null,null,null,null,null,114455.7]
[null,"GUANAJUATO","PESE6410262W2","PESE641026HTSRNR02","ERNESTO PEREZ SANCHEZ                   ",null,null,null,null,null,null,null,null,null,null,null,null,null,"X",null,null,null,null,null,90553.079999999987]
[null,"GUANAJUATO","RAFG691106392","RAFG691106HGTMRR04","GERARDO RAMIREZ FERNANDEZ               ",null,null,null,null,null,null,null,null,null,null,null,null,null,"X",null,null,null,null,null,90482.46]
[null,"GUANAJUATO","RALU580110A37","RAXL580110HGTMXS01","LUIS FERNANDO RAMOS                     ",null,null,null,null,null,null,null,null,null,null,null,null,null,"X",null,null,null,null,null,78517.2]
[null,"GUANAJUATO","RASJ781020U88","RASJ781020MGTZSS02","JOSEFINA RAZO SOSA                      ",null,null,null,null,null,null,null,null,null,null,null,null,null,"X",null,null,null,null,null,71496.060000000012]
[null,"GUANAJUATO","RESA730203TA5","RESA730203MGTYNN04","ANA CELIA REYNOSO SANCHEZ               ",null,null,null,null,null,null,null,null,null,null,null,null,null,"X",null,null,null,null,null,113531.28000000001]
[null,"GUANAJUATO","RIAA790529868","RIAA790529MMNSGN11","ANA KATHERINE RIOS AGUILAR              ",null,null,null,null,null,null,null,null,null,null,null,null,null,"X",null,null,null,null,null,78517.2]
[null,"GUANAJUATO","RORA760321A25","RORA760321HGTDDL07","ALEXANDER DANIEL RODRIGUEZ RODRIGUEZ    ",null,null,null,null,null,null,null,null,null,null,null,null,null,"X",null,null,null,null,null,90482.46]
[null,"GUANAJUATO","SAAK880407FL7","SAAK880407MJCNNR03","KARLA ANGELINA SANDOVAL DE ANDA         ",null,null,null,null,null,null,null,null,null,null,null,null,null,"X",null,null,null,null,null,78517.2]
[null,"GUANAJUATO","SACA791207U75","SACA791207MGTLSL02","MARIA ALEJANDRA SALAZAR CASTANEDA       ",null,null,null,null,null,null,null,null,null,null,null,null,null,"X",null,null,null,null,null,78895.989999999991]
[null,"GUANAJUATO","SAHE741012DCA","SAHE741012MGTNRS04","MA. ESTHER SANCHEZ HERNANDEZ            ",null,null,null,null,null,null,null,null,null,null,null,null,null,"X",null,null,null,null,null,90553.079999999987]
[null,"GUANAJUATO","TOCB650526UK9","TOCB650526MGTRBR04","BERTHA TORRES COVARRUBIAS               ",null,null,null,null,null,null,null,null,null,null,null,null,null,"X",null,null,null,null,null,92369.4]
[null,"GUANAJUATO","VACR780505180","VACR780505MGTRHS07","MARIA DEL ROSARI VARGAS CHAVEZ          ",null,null,null,null,null,null,null,null,null,null,null,null,null,"X",null,null,null,null,null,90553.079999999987]
[null,"GUANAJUATO","VARG660927MXA","VARG660927MDFLSL01","GLORIA GUADALUPE VALENZUELA RIOS        ",null,null,null,null,null,null,null,null,null,null,null,null,null,"X",null,null,null,null,null,90553.079999999987]
[null,"GUANAJUATO","ZUGJ521022BB6","ZUGJ521022HGTXRV02","JAVIER ZUÐIGA GARCIA                    ",null,null,null,null,null,null,null,null,null,null,null,null,null,"X",null,null,null,null,null,92369.4]
[null,"GUANAJUATO","CARM520206UK0","CARM520206HGTBCR09","MARIO CABRERA RICO                      ",null,null,null,null,null,null,null,null,null,null,null,null,null,"X",null,null,null,null,null,92369.4]
[null,"GUANAJUATO","COMI671203D76","COMI671203MGTNLR18","MA. IRAIS CONTRERAS MALDONADO           ",null,null,null,null,null,null,null,null,null,null,null,null,null,"X",null,null,null,null,null,78517.2]
[null,"GUANAJUATO","AABC680116196","AABC680116MMCBNL09","CLAUDIA CECILIA D ABDALA BUENDIA        ",null,null,null,null,"X",null,null,null,null,null,null,null,null,null,null,null,null,null,null,38536.050000000003]
[null,"GUANAJUATO","AABC720527RL6","AABC720527HGTLRR03","CARLOS ALVARADO BARRIOS                 ",null,null,null,null,"X",null,null,null,null,null,null,null,null,null,null,null,null,null,null,39411.42]
[null,"GUANAJUATO","AACG691218L13","AACG691218MMNLSR08","GRACIELA ALVAREZ CASTRO                 ",null,null,null,null,"X",null,null,null,null,null,null,null,null,null,null,null,null,null,null,45262.55999999999]
[null,"GUANAJUATO","AALA880119VB9","AALA880119MGTLPL06","ALESSA ALVARADO LOPEZ                   ",null,null,null,null,"X",null,null,null,null,null,null,null,null,null,null,null,null,null,null,40706.089999999997]
[null,"GUANAJUATO","AALS670904235","AALS670904MGTNPL09","SILVIA ANAYA LOPEZ                      ",null,null,null,null,"X",null,null,null,null,null,null,null,null,null,null,null,null,null,null,74980.5]
[null,"GUANAJUATO","AAMD810413AX8","AAMD810413MGTNRN03","DIANA LORENA ANAYA MARTINEZ             ",null,null,null,null,"X",null,null,null,null,null,null,null,null,null,null,null,null,null,null,40176.79]
[null,"GUANAJUATO","AAMR650620AB4","AAMR650620HGTLGB03","ROBERTO ALVARADO MAGAÐA                 ",null,null,null,null,"X",null,null,null,null,null,null,null,null,null,null,null,null,null,null,42622.3]
[null,"GUANAJUATO","AAMR671130JR0","AAMR671130HGTLGB00","RUBEN ALVARADO MAGANA                   ",null,null,null,null,"X",null,null,null,null,null,null,null,null,null,null,null,null,null,null,34489.46]
[null,"GUANAJUATO","AARL760126331","AARL760126HGTLMN14","LEONARDO ISRAEL ALVAREZ ROMO            ",null,null,null,null,"X",null,null,null,null,null,null,null,null,null,null,null,null,null,null,38499.020000000004]
[null,"GUANAJUATO","AARM7802157H4","AARM780215MGTLDY03","MYRIAM DEL ROSAR ALVARADO RODRIGUEZ     ",null,null,null,null,"X",null,null,null,null,null,null,null,null,null,null,null,null,null,null,29496.720000000001]
[null,"GUANAJUATO","AATE760606N24","AATE760606MGTLNV03","EVA ALMANZA TINOCO                      ",null,null,null,null,"X",null,null,null,null,null,null,null,null,null,null,null,null,null,null,35808.25]
[null,"GUANAJUATO","AEAC630530Q21","AEAC630530MGTLLN08","MA. CONCEPCION ALEJOS ALONSO            ",null,null,null,null,"X",null,null,null,null,null,null,null,null,null,null,null,null,null,null,77805.47]
[null,"GUANAJUATO","AECJ7908035L8","AECJ790803HGTLRS03","JOSE JESUS ALEJO CARRENO                ",null,null,null,null,"X",null,null,null,null,null,null,null,null,null,null,null,null,null,null,34110.689999999995]
[null,"GUANAJUATO","AECL710621SE4","AECL710621HGTRRS02","JOSE LUIS ARELLANO CRUZ                 ",null,null,null,null,"X",null,null,null,null,null,null,null,null,null,null,null,null,null,null,35472.89]
[null,"GUANAJUATO","AECM720103NB9","AECM720103MGTLRR09","MARCELA ALEJO CARREÐO                   ",null,null,null,null,"X",null,null,null,null,null,null,null,null,null,null,null,null,null,null,115172.13999999998]
[null,"GUANAJUATO","AEGJ5311191A4","AEGJ531119HGTSRR09","JORGE ASCENCIO GARCIA                   ",null,null,null,null,"X",null,null,null,null,null,null,null,null,null,null,null,null,null,null,41129.57]
[null,"GUANAJUATO","AERG571209NWA","AERG571209HGTRML09","GILBERTO ARREOLA ROMERO                 ",null,null,null,null,"X",null,null,null,null,null,null,null,null,null,null,null,null,null,null,36733.21]
[null,"GUANAJUATO","AETA880105TQ0","AETA880105HGTCNN01","ANTONIO ACEVEDO TINAJERO                ",null,null,null,null,"X",null,null,null,null,null,null,null,null,null,null,null,null,null,null,81171.360000000001]
[null,"GUANAJUATO","AIMK880805R10","AIMK880805MGTRXR05","KARLA GABRIELA ARIAS MUÐOZ              ",null,null,null,null,"X",null,null,null,null,null,null,null,null,null,null,null,null,null,null,79325.260000000009]
[null,"GUANAJUATO","AOFA670123A81","AOFA670123MGTBLD06","ADRIANA DEL CARM ABONCE FLORES          ",null,null,null,null,"X",null,null,null,null,null,null,null,null,null,null,null,null,null,null,91057.670000000013]
[null,"GUANAJUATO","AOGI790809G38","AOGI790809MGTLRM04","IMELDA SUSANA ALONSO GARCIA             ",null,null,null,null,"X",null,null,null,null,null,null,null,null,null,null,null,null,null,null,73645.680000000008]
[null,"GUANAJUATO","AOLJ820429DY4","AOLJ820429HGTCPL06","JOEL ADOLFO ACOSTA LOPEZ                ",null,null,null,null,"X",null,null,null,null,null,null,null,null,null,null,null,null,null,null,30948.15]
[null,"GUANAJUATO","AOVP751006KA9","AOVP751006MGTLLL04","MA. DEL PILAR ALMONACI VALADEZ          ",null,null,null,null,"X",null,null,null,null,null,null,null,null,null,null,null,null,null,null,83651.180000000008]
[null,"GUANAJUATO","AUDM660425P52","AUDM660425MGTGRR18","MIRIAM AGUILAR DURON                    ",null,null,null,null,"X",null,null,null,null,null,null,null,null,null,null,null,null,null,null,121876.91]
[null,"GUANAJUATO","AUPM640422KR2","AUPM640422HGTGLR03","MARTIN AGUIRRE PALMERIN                 ",null,null,null,null,"X",null,null,null,null,null,null,null,null,null,null,null,null,null,null,42266.479999999996]
[null,"GUANAJUATO","BACM8402274W0","BACM840227HGTRNG03","MIGUEL ANGEL BARRON CONEJO              ",null,null,null,null,"X",null,null,null,null,null,null,null,null,null,null,null,null,null,null,83173.850000000006]
[null,"GUANAJUATO","BAGJ5004309G9","BAGJ500430HGTRRR03","JORGE BARRERA GARCIA                    ",null,null,null,null,"X",null,null,null,null,null,null,null,null,null,null,null,null,null,null,40543.07]
[null,"GUANAJUATO","BAGS470901EG4","BAGS470901MGTRRL03","SILVIA BARRERA GARCIA                   ",null,null,null,null,"X",null,null,null,null,null,null,null,null,null,null,null,null,null,null,42865.62000000001]
[null,"GUANAJUATO","BAHC790225T34","BAHC790225HGTSRS06","CESAR ISRRAEL BASALDUA HERNANDEZ        ",null,null,null,null,"X",null,null,null,null,null,null,null,null,null,null,null,null,null,null,22421.64]
[null,"GUANAJUATO","BAJR800429CA7","BAJR800429MGTLRC00","ROCIO BALDERAS JUAREZ                   ",null,null,null,null,"X",null,null,null,null,null,null,null,null,null,null,null,null,null,null,46175.58]
[null,"GUANAJUATO","BAMJ651013MA3","BAMJ651013HGTRRN08","JUAN PEDRO BARBOSA MORALES              ",null,null,null,null,"X",null,null,null,null,null,null,null,null,null,null,null,null,null,null,83173.850000000006]
[null,"GUANAJUATO","BAPA711019KLA","BAPA711019MGTRRN03","ANA LOURDES BARAJAS PEREZ               ",null,null,null,null,"X",null,null,null,null,null,null,null,null,null,null,null,null,null,null,79548.92]
[null,"GUANAJUATO","BAQL620315PN5","BAQL620315HGTRRS00","LUIS MANUEL BRAVO QUIROZ                ",null,null,null,null,"X",null,null,null,null,null,null,null,null,null,null,null,null,null,null,115544.66999999998]
[null,"GUANAJUATO","BARJ8305267S1","BARJ830526HGTRYN02","JUAN ANGEL BRAVO REYES                  ",null,null,null,null,"X",null,null,null,null,null,null,null,null,null,null,null,null,null,null,82388.97]
[null,"GUANAJUATO","BASS600608U7A","BASS600608MGTRRL08","MARIA SOLEDAD ROS BRAVO SERRANO         ",null,null,null,null,"X",null,null,null,null,null,null,null,null,null,null,null,null,null,null,45148.36]
[null,"GUANAJUATO","BAUM780104T8A","BAUM780104MGTRRC01","MICAELA BARCENAS URBINA                 ",null,null,null,null,"X",null,null,null,null,null,null,null,null,null,null,null,null,null,null,43306.33]
[null,"GUANAJUATO","BAUR7105213K8","BAUR710521MDFRRT02","RITA BARCENAS URBINA                    ",null,null,null,null,"X",null,null,null,null,null,null,null,null,null,null,null,null,null,null,48839.169999999991]
[null,"GUANAJUATO","BEEJ790327230","BEEJ790327HGTLSN06","JUAN GUSTAVO BELMAN ESPINOSA            ",null,null,null,null,"X",null,null,null,null,null,null,null,null,null,null,null,null,null,null,33571.24]
[null,"GUANAJUATO","BERC880813NK7","BERC880813MGTLMN05","CINDIA ELIZABETH BELTRAN RAMOS          ",null,null,null,null,"X",null,null,null,null,null,null,null,null,null,null,null,null,null,null,41141.42]
[null,"GUANAJUATO","BUSG720302VE9","BUSG720302MGTLND02","MA. GUADALUPE BULLONS SANTIAGO          ",null,null,null,null,"X",null,null,null,null,null,null,null,null,null,null,null,null,null,null,38693.479999999996]
[null,"GUANAJUATO","CAAO740517PC6","CAAO740517HGTMRC05","OCTAVIANO CAMPOS ARRIAGA                ",null,null,null,null,"X",null,null,null,null,null,null,null,null,null,null,null,null,null,null,76902.860000000015]
[null,"GUANAJUATO","CACF600221UD2","CACF600221HSPMSR07","FORTUNATO CAMACHO CASTILLO              ",null,null,null,null,"X",null,null,null,null,null,null,null,null,null,null,null,null,null,null,31988.15]
[null,"GUANAJUATO","CACL650308V86","CACL650308MGTMLZ03","MA. DE LA LUZ CAMARILLO COLLAZO         ",null,null,null,null,"X",null,null,null,null,null,null,null,null,null,null,null,null,null,null,118403.6]
[null,"GUANAJUATO","CADG5812029W6","CADG581202MGTHLR09","GRACIELA CHAVEZ DELGADO                 ",null,null,null,null,"X",null,null,null,null,null,null,null,null,null,null,null,null,null,null,48380.15]
[null,"GUANAJUATO","CAGM670126RV9","CAGM670126MGTHNR09","MARTHA DELIA CHAVEZ GONZALEZ            ",null,null,null,null,"X",null,null,null,null,null,null,null,null,null,null,null,null,null,null,112773.62000000002]
[null,"GUANAJUATO","CAGN9001041L6","CAGN900104MGTSNN06","NANCY YARETH CASILLAS GONZALEZ          ",null,null,null,null,"X",null,null,null,null,null,null,null,null,null,null,null,null,null,null,14259.72]
[null,"GUANAJUATO","CAGR660928KD7","CAGR660928MGTSNB07","RUBICELIA CASTRO GONZALEZ               ",null,null,null,null,"X",null,null,null,null,null,null,null,null,null,null,null,null,null,null,93260.23]
[null,"GUANAJUATO","CAGT7903078F3","CAGT790307HGTMRM01","TOMAS ESTEBAN CAMACHO GARCIA            ",null,null,null,null,"X",null,null,null,null,null,null,null,null,null,null,null,null,null,null,31349.620000000003]
[null,"GUANAJUATO","CAJU780116N75","CAXJ780116HGTMXN05","JUAN JOSE CAMACHO                       ",null,null,null,null,"X",null,null,null,null,null,null,null,null,null,null,null,null,null,null,88398.360000000015]
[null,"GUANAJUATO","CALA611023U79","CALA611023MZSRZD15","ADRIANA CARDENAS LOZA                   ",null,null,null,null,"X",null,null,null,null,null,null,null,null,null,null,null,null,null,null,103409.27000000002]
[null,"GUANAJUATO","CALA7006204L0","CALA700620MGTMPL09","ALEJANDRA CAMACHO LOPEZ                 ",null,null,null,null,"X",null,null,null,null,null,null,null,null,null,null,null,null,null,null,72432.649999999994]
[null,"GUANAJUATO","CALA880830IGA","CALA880830MGTLPD08","ADRIANA CALDERON LOPEZ                  ",null,null,null,null,"X",null,null,null,null,null,null,null,null,null,null,null,null,null,null,38463.589999999997]
[null,"GUANAJUATO","CAML640420FH8","CAML640420HDFSRS06","JOSE LUIS CASILLAS MIRANDA              ",null,null,null,null,"X",null,null,null,null,null,null,null,null,null,null,null,null,null,null,43804.880000000005]
[null,"GUANAJUATO","CAML820820U36","CAML820820HGTNNS09","LUIS MIGUEL CANO MENDOZA                ",null,null,null,null,"X",null,null,null,null,null,null,null,null,null,null,null,null,null,null,72138.500000000015]
[null,"GUANAJUATO","CANS730714K3A","CANS730714MGTSTR04","SARA CASTILLO NIETO                     ",null,null,null,null,"X",null,null,null,null,null,null,null,null,null,null,null,null,null,null,48264.97]
[null,"GUANAJUATO","CAPE530526869","CAPE530526MGTRRL07"," M.ELENA CARDIEL PEREZ                  ",null,null,null,null,"X",null,null,null,null,null,null,null,null,null,null,null,null,null,null,80905.33]
[null,"GUANAJUATO","CAPR810416EKA","CAPR810416HGTLRB07","ROBERTO CALDERON PEREZ                  ",null,null,null,null,"X",null,null,null,null,null,null,null,null,null,null,null,null,null,null,64469.490000000005]
[null,"GUANAJUATO","CASI750121969","CASI750121HGTSNS13","ISAAC CASTRO SANTILLANES                ",null,null,null,null,"X",null,null,null,null,null,null,null,null,null,null,null,null,null,null,47753.670000000006]
[null,"GUANAJUATO","CAUF560705QGA","CAUF560705HGTHRL05","FILOMENO CHAGOYA URRUTIA                ",null,null,null,null,"X",null,null,null,null,null,null,null,null,null,null,null,null,null,null,39640.969999999994]
[null,"GUANAJUATO","CAVT730609CSA","CAVT730609MGTRRR12","MA. TERESA CARPIO VARGAS                ",null,null,null,null,"X",null,null,null,null,null,null,null,null,null,null,null,null,null,null,39051.99]
[null,"GUANAJUATO","CEFS680324L40","CEFS680324HJCRLL06","SAUL CERPA FLORES                       ",null,null,null,null,"X",null,null,null,null,null,null,null,null,null,null,null,null,null,null,36705.51]
[null,"GUANAJUATO","CELM960313G89","CELM960313MGTRPY09","MAYRA FRANCISCA CERVANTES LOPEZ         ",null,null,null,null,"X",null,null,null,null,null,null,null,null,null,null,null,null,null,null,31504.949999999997]
[null,"GUANAJUATO","CESA870418K76","CESA870418MGTRMN08","ANA GABRIELA CERVERA SAMANO             ",null,null,null,null,"X",null,null,null,null,null,null,null,null,null,null,null,null,null,null,36077.409999999996]
[null,"GUANAJUATO","CEVB731120C46","CEVB731120HGTDRR00","BERNARDO CEDILLO VERA                   ",null,null,null,null,"X",null,null,null,null,null,null,null,null,null,null,null,null,null,null,33371.769999999997]
[null,"GUANAJUATO","CIEE710907TK8","CIEE710907HDFSSD04","EDUARDO ALEJANDR CISNEROS ESPINOSA      ",null,null,null,null,"X",null,null,null,null,null,null,null,null,null,null,null,null,null,null,33957.57]
[null,"GUANAJUATO","CIGP680809983","CIGP680809HGTDRB07","PABLO MARTIN CID GARCIA                 ",null,null,null,null,"X",null,null,null,null,null,null,null,null,null,null,null,null,null,null,116494.32]
[null,"GUANAJUATO","COAD7908184B7","COAD790818MGTVRN00","DENY COVARRUBIAS ARREGUIN               ",null,null,null,null,"X",null,null,null,null,null,null,null,null,null,null,null,null,null,null,32531.480000000003]
[null,"GUANAJUATO","COCA760915JU4","COCA760915HGTRLL02","ALEJANDRO CORIA CALDERON                ",null,null,null,null,"X",null,null,null,null,null,null,null,null,null,null,null,null,null,null,33651.01]
[null,"GUANAJUATO","COCM710215JF9","COCM710215HMNBMR04","MARIO COBIAN CAMACHO                    ",null,null,null,null,"X",null,null,null,null,null,null,null,null,null,null,null,null,null,null,116494.32]
[null,"GUANAJUATO","COMP630327QN2","COMP630327HGTNRB00","PABLO GERARDO CONTRERAS MARTINEZ        ",null,null,null,null,"X",null,null,null,null,null,null,null,null,null,null,null,null,null,null,119951.73999999998]
[null,"GUANAJUATO","CORJ890525619","CORJ890525HGTRMR07","JORGE ARMANDO CORONA RAMIREZ            ",null,null,null,null,"X",null,null,null,null,null,null,null,null,null,null,null,null,null,null,35687.619999999995]
[null,"GUANAJUATO","COVA700831PW6","COVA700831MGRNRM03","AMADA CONDE VERA                        ",null,null,null,null,"X",null,null,null,null,null,null,null,null,null,null,null,null,null,null,46963.520000000004]
[null,"GUANAJUATO","COVF720114623","COVF720114HGTNRR02","FRANCISCO JAVIER CONDE VERA             ",null,null,null,null,"X",null,null,null,null,null,null,null,null,null,null,null,null,null,null,31326.15]
[null,"GUANAJUATO","CUHC5501119F9","CUHC550111HGTLNS08","CESAR CUELLAR HINOJOSA                  ",null,null,null,null,"X",null,null,null,null,null,null,null,null,null,null,null,null,null,null,45358.880000000005]
[null,"GUANAJUATO","CUTR610723JC8","CUTR610723MGTLTS06","ROSA MARIA CUELLAR TETUAN               ",null,null,null,null,"X",null,null,null,null,null,null,null,null,null,null,null,null,null,null,122610.16]
[null,"GUANAJUATO","CUVL741004T6A","CUVL741004MGTRRR08","LAURA CRUZ VARGAS                       ",null,null,null,null,"X",null,null,null,null,null,null,null,null,null,null,null,null,null,null,110648.72]
[null,"GUANAJUATO","CUVY830805JA3","CUVY830805MGTSRH00","YAHAIRA ALICIA E CUESTAS VARGAS         ",null,null,null,null,"X",null,null,null,null,null,null,null,null,null,null,null,null,null,null,29073.449999999997]
[null,"GUANAJUATO","DAFT8701278E1","DAFT870127MZSVLN04","TANIA LIZETH DAVILA FLORES              ",null,null,null,null,"X",null,null,null,null,null,null,null,null,null,null,null,null,null,null,33367.24]
[null,"GUANAJUATO","DEHM860518J96","DEHM860518HMCLRG02","MIGUEL ANGEL DELGADO HERNANDEZ          ",null,null,null,null,"X",null,null,null,null,null,null,null,null,null,null,null,null,null,null,35087.770000000004]
[null,"GUANAJUATO","DEJA790116B16","DEJA790116HMCLMN00","JOSE ANTONIO DELGADO JIMENEZ            ",null,null,null,null,"X",null,null,null,null,null,null,null,null,null,null,null,null,null,null,104706.09000000001]
[null,"GUANAJUATO","DIJL7203079A3","DIJL720307MGTGCR01","MA. DE LOURDES DIEGO JACOBO             ",null,null,null,null,"X",null,null,null,null,null,null,null,null,null,null,null,null,null,null,43765.24]
[null,"GUANAJUATO","DONA780620F80","DONA780620HGTMTL04","ALEJANDRO DOMINGUEZ NIETO               ",null,null,null,null,"X",null,null,null,null,null,null,null,null,null,null,null,null,null,null,29848.799999999996]
[null,"GUANAJUATO","DUAJ8704098Q4","DUAJ870409HGTRGR00","JORGE LUIS DURAN AGUILERA               ",null,null,null,null,"X",null,null,null,null,null,null,null,null,null,null,null,null,null,null,29874.720000000001]
[null,"GUANAJUATO","DUFC8505038R7","DUFC850503MGTRLR04","MARIA CRUZ DURAN FLORES                 ",null,null,null,null,"X",null,null,null,null,null,null,null,null,null,null,null,null,null,null,44189.55]
[null,"GUANAJUATO","EACA751029DJ3","EACA751029MGTSRN06","MA DE LOS ANGELE ESPARZA CORONA         ",null,null,null,null,"X",null,null,null,null,null,null,null,null,null,null,null,null,null,null,38702.9]
[null,"GUANAJUATO","EAFM570902GM4","EAFM570902HGTSLS06","MOISES ESTRADA FLORES                   ",null,null,null,null,"X",null,null,null,null,null,null,null,null,null,null,null,null,null,null,40089.829999999994]
[null,"GUANAJUATO","EAMG8704104G8","EAMG870410MGTSRR00","GRECIA ROXANNA ESPARZA MARES            ",null,null,null,null,"X",null,null,null,null,null,null,null,null,null,null,null,null,null,null,33407.919999999998]
[null,"GUANAJUATO","EAVG760111SA9","EAVG760111MGTSLD04","MA.GUADALUPE ESPARZA VALENCIA           ",null,null,null,null,"X",null,null,null,null,null,null,null,null,null,null,null,null,null,null,63688.55]
[null,"GUANAJUATO","EICA641219IS3","EICA641219MGTLRL01","ALTAGRACIA ELIZARRARAS CERVANTES        ",null,null,null,null,"X",null,null,null,null,null,null,null,null,null,null,null,null,null,null,48401.590000000004]
[null,"GUANAJUATO","EICA780130NQ1","EICA780130MGTSRN03","ANA MARIA ESPINOZA CERVANTES            ",null,null,null,null,"X",null,null,null,null,null,null,null,null,null,null,null,null,null,null,38875.81]
[null,"GUANAJUATO","EICC740626328","EICC740626MGTLRL02","CLAUDIA ELIZARRARAS CERVANTES           ",null,null,null,null,"X",null,null,null,null,null,null,null,null,null,null,null,null,null,null,3037.8599999999997]
[null,"GUANAJUATO","EICT8203073V8","EICT820307HGTSRM05","TOMAS ROGELIO ESPINOZA CERVANTES        ",null,null,null,null,"X",null,null,null,null,null,null,null,null,null,null,null,null,null,null,35458.54]
[null,"GUANAJUATO","EIMJ620524ID9","EIMJ620524HGTLRS02","JOSE ELIAS MORENO                       ",null,null,null,null,"X",null,null,null,null,null,null,null,null,null,null,null,null,null,null,82648.100000000006]
[null,"GUANAJUATO","EIMJ880812BK0","EIMJ880812MGTLRH07","JHOANA IVON ELIZALDE MARTINEZ           ",null,null,null,null,"X",null,null,null,null,null,null,null,null,null,null,null,null,null,null,30063.4]
[null,"GUANAJUATO","EIPA861113S53","EIPA861113HGTSRB08","JOSE ABRAHAM ESPINOZA PORRAS            ",null,null,null,null,"X",null,null,null,null,null,null,null,null,null,null,null,null,null,null,34111.439999999995]
[null,"GUANAJUATO","EIPM591011QG5","EIPM591011MGTSRR09","MARTHA ALICIA ESPINOSA PEREZ            ",null,null,null,null,"X",null,null,null,null,null,null,null,null,null,null,null,null,null,null,94700.77]
[null,"GUANAJUATO","EISB881118DD0","EISB881118MGTSPT05","BETSAIDA MAGDALE ESPINOZA SEPULVEDA     ",null,null,null,null,"X",null,null,null,null,null,null,null,null,null,null,null,null,null,null,35995.839999999997]
[null,"GUANAJUATO","EITG6112096F3","EITG611209MDFSBD05","MARIA GUADALUPE ESPINOSA TABLEROS       ",null,null,null,null,"X",null,null,null,null,null,null,null,null,null,null,null,null,null,null,76701.48]
[null,"GUANAJUATO","EIVC851005GF2","EIVC851005HGTLRR07","CARLOS ELIZARRARAS VARGAS               ",null,null,null,null,"X",null,null,null,null,null,null,null,null,null,null,null,null,null,null,45667.060000000005]
[null,"GUANAJUATO","EUVA760924363","EUVA760924HGTSLN02","ANTONIO ESQUEDA VILLALON                ",null,null,null,null,"X",null,null,null,null,null,null,null,null,null,null,null,null,null,null,70499.459999999992]
[null,"GUANAJUATO","FAAF540219KI2","FAAF540219MGTRGX06","MARIA FE FRAUSTO AGUILAR                ",null,null,null,null,"X",null,null,null,null,null,null,null,null,null,null,null,null,null,null,49274.76]
[null,"GUANAJUATO","FABC530210FR5","FABC530210MDFRRR00","MARIA DEL CARMEN FRANCO BOURET          ",null,null,null,null,"X",null,null,null,null,null,null,null,null,null,null,null,null,null,null,43355.25]
[null,"GUANAJUATO","FIGP640907QP7","FIGP640907HGTGRD01","PEDRO FIGUEROA GARCIA                   ",null,null,null,null,"X",null,null,null,null,null,null,null,null,null,null,null,null,null,null,44340.1]
[null,"GUANAJUATO","FIRG871015PB5","FIRG871015MGTGMB07","GABRIELA FIGUEROA RAMIREZ               ",null,null,null,null,"X",null,null,null,null,null,null,null,null,null,null,null,null,null,null,30710.050000000003]
[null,"GUANAJUATO","FOCJ7406233X9","FOCJ740623MGTLLS01","JOSEFINA FLORES CALVA                   ",null,null,null,null,"X",null,null,null,null,null,null,null,null,null,null,null,null,null,null,45392.11]
[null,"GUANAJUATO","FOGH740517223","FOGH740517HGTLTC07","HECTOR FLORES GUTIERREZ                 ",null,null,null,null,"X",null,null,null,null,null,null,null,null,null,null,null,null,null,null,45194.359999999993]
[null,"GUANAJUATO","FOJU6701074Z1","FOXJ670107HGTLXN09","JUAN ANTONIO FLORES                     ",null,null,null,null,"X",null,null,null,null,null,null,null,null,null,null,null,null,null,null,76922.810000000012]
[null,"GUANAJUATO","FOSA610902SG9","FOSA610902MGTLNL09","ALEJANDRA PATRICI FLORES SANDOVAL       ",null,null,null,null,"X",null,null,null,null,null,null,null,null,null,null,null,null,null,null,79047.090000000011]
[null,"GUANAJUATO","GAAR6310249B2","GAAR631024HGTLRF01","RAFAEL GALLEGOS ARELLANO                ",null,null,null,null,"X",null,null,null,null,null,null,null,null,null,null,null,null,null,null,43462.049999999996]
[null,"GUANAJUATO","GABI850102NDA","GABI850102MGTRRS03","MARIA ISABEL GARCIA BARRIENTOS          ",null,null,null,null,"X",null,null,null,null,null,null,null,null,null,null,null,null,null,null,92058.65]
[null,"GUANAJUATO","GACR6704153I2","GACR670415MGTRRT06","MARIA RITA GARCIA CERRATO               ",null,null,null,null,"X",null,null,null,null,null,null,null,null,null,null,null,null,null,null,44783.839999999997]
[null,"GUANAJUATO","GAFV6609298F9","GAFV660929MGTRRR06","VERONICA ROCIO GRANADOS FRIAS           ",null,null,null,null,"X",null,null,null,null,null,null,null,null,null,null,null,null,null,null,43938.770000000004]
[null,"GUANAJUATO","GAGA8610104P3","GAGA861010HGTSRM03","AMOS EDUARDO GASCA GARCIA               ",null,null,null,null,"X",null,null,null,null,null,null,null,null,null,null,null,null,null,null,21959.42]
[null,"GUANAJUATO","GAGV930611G79","GAGV930611HGTRMC04","VICTOR HUGO GARCIA GOMEZ                ",null,null,null,null,"X",null,null,null,null,null,null,null,null,null,null,null,null,null,null,26729.229999999996]
[null,"GUANAJUATO","GAHJ561230M55","GAHJ561230HGTRRN04","JUAN GRANADOS HERNANDEZ                 ",null,null,null,null,"X",null,null,null,null,null,null,null,null,null,null,null,null,null,null,108261.15999999999]
[null,"GUANAJUATO","GAJJ660505P94","GAJJ660505HGTRMN06","JUAN GARCIA JIMENEZ                     ",null,null,null,null,"X",null,null,null,null,null,null,null,null,null,null,null,null,null,null,43136.729999999996]
[null,"GUANAJUATO","GALE770303QD2","GALE770303HGTRSD04","EDUARDO GARCIA LESSO                    ",null,null,null,null,"X",null,null,null,null,null,null,null,null,null,null,null,null,null,null,57052.740000000005]
[null,"GUANAJUATO","GALJ930324KX8","GALJ930324HGTRPN06","JUAN CARLOS GARCIA LOPEZ                ",null,null,null,null,"X",null,null,null,null,null,null,null,null,null,null,null,null,null,null,31349.64]
[null,"GUANAJUATO","GAMM680220L32","GAMM680220MGTLRR01","MARTHA NORMA GALLEGOS MARISCAL          ",null,null,null,null,"X",null,null,null,null,null,null,null,null,null,null,null,null,null,null,47029.840000000004]
[null,"GUANAJUATO","GAOH8102061G0","GAOH810206HDFLLM04","HUMBERTO ISRAEL GALVAN OLVERA           ",null,null,null,null,"X",null,null,null,null,null,null,null,null,null,null,null,null,null,null,31727.64]
[null,"GUANAJUATO","GARG5704245R5","GARG570424HGTRZB08","GABRIEL GARCIA RAZO                     ",null,null,null,null,"X",null,null,null,null,null,null,null,null,null,null,null,null,null,null,43844.890000000007]
[null,"GUANAJUATO","GARJ690126G3A","GARJ690126HQTRVN01","JOSE JUAN GARCIA RIVERA                 ",null,null,null,null,"X",null,null,null,null,null,null,null,null,null,null,null,null,null,null,33437.449999999997]
[null,"GUANAJUATO","GARJ840526678","GARJ840526HGTRMV04","JAVIER ARTURO GARCIA ROMERO             ",null,null,null,null,"X",null,null,null,null,null,null,null,null,null,null,null,null,null,null,36073.89]
[null,"GUANAJUATO","GARL720427FX0","GARL720427MGTRMZ12","LUZ MA GARCIA ROMERO                    ",null,null,null,null,"X",null,null,null,null,null,null,null,null,null,null,null,null,null,null,43427.839999999997]
[null,"GUANAJUATO","GARS670416A54","GARS670416MGTRYL05","SILVIA GARCIA REYES                     ",null,null,null,null,"X",null,null,null,null,null,null,null,null,null,null,null,null,null,null,85405.849999999991]
[null,"GUANAJUATO","GASM690929112","GASM690929HDFRLR02","MARIO MIGUEL GARCIA SALINAS             ",null,null,null,null,"X",null,null,null,null,null,null,null,null,null,null,null,null,null,null,61997.250000000007]
[null,"GUANAJUATO","GATG451128UX1","GATG451128HDFYRS05","GUSTAVO GAYTAN TORRES                   ",null,null,null,null,"X",null,null,null,null,null,null,null,null,null,null,null,null,null,null,83173.850000000006]
[null,"GUANAJUATO","GAZE690718GX3","GAZE690718MGTRVL07","ELIZABETH GARCIA ZAVALA                 ",null,null,null,null,"X",null,null,null,null,null,null,null,null,null,null,null,null,null,null,45063.03]
[null,"GUANAJUATO","GIAJ670517N7A","GIAJ670517HGTRLN07","JUAN MANUEL GRIMALDO ALFARO             ",null,null,null,null,"X",null,null,null,null,null,null,null,null,null,null,null,null,null,null,48064.95]
[null,"GUANAJUATO","GOAA770911HT1","GOAA770911MGTMLN09","ANA ROSA GOMEZ ALBA                     ",null,null,null,null,"X",null,null,null,null,null,null,null,null,null,null,null,null,null,null,63888.66]
[null,"GUANAJUATO","GOAV860422EK6","GOAV860422HGTNLC02","VICTOR ISRAEL GONZALEZ ALCANTAR         ",null,null,null,null,"X",null,null,null,null,null,null,null,null,null,null,null,null,null,null,72134.23000000001]
[null,"GUANAJUATO","GOCH8410237R3","GOCH841023HGTNBC04","HECTOR HUGO GONZALEZ CABRERA            ",null,null,null,null,"X",null,null,null,null,null,null,null,null,null,null,null,null,null,null,30948.15]
[null,"GUANAJUATO","GOGD870617R99","GOGD870617HNLMRN00","JOSE DANIEL GOMEZ GARZA                 ",null,null,null,null,"X",null,null,null,null,null,null,null,null,null,null,null,null,null,null,88367.140000000014]
[null,"GUANAJUATO","GOGE730923ME8","GOGE730923MMNNNL00","ELIZABETH GONZALEZ GONZALEZ             ",null,null,null,null,"X",null,null,null,null,null,null,null,null,null,null,null,null,null,null,46476.19]
[null,"GUANAJUATO","GOGF910421775","GOGF910421MGTNLR03","MARIA FERNANDA GONZALEZ GALLARDO        ",null,null,null,null,"X",null,null,null,null,null,null,null,null,null,null,null,null,null,null,29392.239999999998]
[null,"GUANAJUATO","GOGI750427GM1","GOGI750427HMCMYS02","ISRAEL GOMEZ GAYTAN                     ",null,null,null,null,"X",null,null,null,null,null,null,null,null,null,null,null,null,null,null,110402.23000000001]
[null,"GUANAJUATO","GOGK890902JT3","GOGK890902MGTNLR04","KARLA RAFAELA GONZALEZ GALLARDO         ",null,null,null,null,"X",null,null,null,null,null,null,null,null,null,null,null,null,null,null,61055.91]
[null,"GUANAJUATO","GOGL6009014D1","GOGL600901MGTNLN08","LINA ENGRACIA GONZALEZ GALLARDO         ",null,null,null,null,"X",null,null,null,null,null,null,null,null,null,null,null,null,null,null,51427.33]
[null,"GUANAJUATO","GOLA7812182KA","GOLA781218MQTMPN05","ANA GLORIA GOMEZ LOPEZ                  ",null,null,null,null,"X",null,null,null,null,null,null,null,null,null,null,null,null,null,null,72429.510000000009]
[null,"GUANAJUATO","GOLR590503HDA","GOLR590503HGTNDB04","ROBERTO GONZALEZ LEDESMA                ",null,null,null,null,"X",null,null,null,null,null,null,null,null,null,null,null,null,null,null,124199.33]
[null,"GUANAJUATO","GOMG8812289D6","GOMG881228HQTMLB01","GABRIEL GOMEZ MOLINERO                  ",null,null,null,null,"X",null,null,null,null,null,null,null,null,null,null,null,null,null,null,57049.040000000008]
[null,"GUANAJUATO","GOML690426EW2","GOML690426MGTNDZ08","LUZ ESTELA GONZALEZ MEDINA              ",null,null,null,null,"X",null,null,null,null,null,null,null,null,null,null,null,null,null,null,84308.88]
[null,"GUANAJUATO","GOML710913T66","GOML710913MGTNXC08","LUCIA GONZALEZ MU±OZ                    ",null,null,null,null,"X",null,null,null,null,null,null,null,null,null,null,null,null,null,null,71815.140000000014]
[null,"GUANAJUATO","GONM790924B46","GONM790924HGTNVG00","MIGUEL ANGEL GONZALEZ NAVARRO           ",null,null,null,null,"X",null,null,null,null,null,null,null,null,null,null,null,null,null,null,72370.38]
[null,"GUANAJUATO","GOPP5010306G6","GOPP501030HGTNRD05","PEDRO GONZALEZ PORTILLO                 ",null,null,null,null,"X",null,null,null,null,null,null,null,null,null,null,null,null,null,null,71473.27]
[null,"GUANAJUATO","GOSA4507257Y0","GOXS450725HGTNXN07","SANTIAGO GONZALEZ                       ",null,null,null,null,"X",null,null,null,null,null,null,null,null,null,null,null,null,null,null,39912.649999999994]
[null,"GUANAJUATO","GOSL960615K94","GOSL960615MGTNPR02","LORENA GONZALEZ SEPULVEDA               ",null,null,null,null,"X",null,null,null,null,null,null,null,null,null,null,null,null,null,null,8729.84]
[null,"GUANAJUATO","GUAA600320L51","GUAA600320MGTTLL03","ALEJANDRA GUTIERREZ ALVAREZ             ",null,null,null,null,"X",null,null,null,null,null,null,null,null,null,null,null,null,null,null,42606.13]
[null,"GUANAJUATO","GUFO930509HR3","GUFO930509MGTVRL06","OLIVIA GUEVARA FARFAN                   ",null,null,null,null,"X",null,null,null,null,null,null,null,null,null,null,null,null,null,null,29874.720000000001]
[null,"GUANAJUATO","GUFV820306TSA","GUFV820306HGRZLC04","VICTOR MANUEL GUZMAN FLORES             ",null,null,null,null,"X",null,null,null,null,null,null,null,null,null,null,null,null,null,null,90797.680000000008]
[null,"GUANAJUATO","GUGA7312084M6","GUGA731208HGTTZL01","ALFREDO GUTIERREZ GUZMAN                ",null,null,null,null,"X",null,null,null,null,null,null,null,null,null,null,null,null,null,null,40336.209999999992]
[null,"GUANAJUATO","GUGE730901EC4","GUGE730901MGTTNS07","ESPERANZA GUTIERREZ GONZALEZ            ",null,null,null,null,"X",null,null,null,null,null,null,null,null,null,null,null,null,null,null,50129.54]
[null,"GUANAJUATO","GUGM650603GP3","GUGM650603MJCTZR08","MA. MARTINA GUTIERREZ GUZMAN            ",null,null,null,null,"X",null,null,null,null,null,null,null,null,null,null,null,null,null,null,126002.55]
[null,"GUANAJUATO","GUJE870107661","GUJE870107MGTTRL01","ELIZABETH VERONI GUTIERREZ JUAREZ       ",null,null,null,null,"X",null,null,null,null,null,null,null,null,null,null,null,null,null,null,62789.390000000014]
[null,"GUANAJUATO","GULH680121BP6","GULH680121HDFTPR01","HORACIO GUTIERREZ LOPEZ                 ",null,null,null,null,"X",null,null,null,null,null,null,null,null,null,null,null,null,null,null,32011.69]
[null,"GUANAJUATO","GULM790929U80","GULM790929HGTRGG04","MIGUEL ANGEL GUERRERO LAGUNA            ",null,null,null,null,"X",null,null,null,null,null,null,null,null,null,null,null,null,null,null,40207.430000000008]
[null,"GUANAJUATO","GUMB860612B77","GUMB860612MGTTRL01","BLANCA EDITH GUTIERREZ MORENO           ",null,null,null,null,"X",null,null,null,null,null,null,null,null,null,null,null,null,null,null,36904.11]
[null,"GUANAJUATO","GURG711212BH3","GURG711212MGTRXD01","MA GUADALUPE GUARDADO REA               ",null,null,null,null,"X",null,null,null,null,null,null,null,null,null,null,null,null,null,null,36363.17]
[null,"GUANAJUATO","GUTR690427DSA","GUTR690427MDFPRC02","ROCIO GUAPO TORRECILLAS                 ",null,null,null,null,"X",null,null,null,null,null,null,null,null,null,null,null,null,null,null,44152.7]
[null,"GUANAJUATO","GUZA720514FG4","GUZA720514MDFTVL06","ALEJANDRA GUTIERREZ ZAVALA              ",null,null,null,null,"X",null,null,null,null,null,null,null,null,null,null,null,null,null,null,45604.01]
[null,"GUANAJUATO","HEBL680226MH6","HEBL680226HDFRNS05","LUIS FELIPE HERRERA BUENDIA             ",null,null,null,null,"X",null,null,null,null,null,null,null,null,null,null,null,null,null,null,38932.28]
[null,"GUANAJUATO","HECH720907NC1","HECH720907MDFRNL01","HILDA HERNANDEZ CANCHOLA                ",null,null,null,null,"X",null,null,null,null,null,null,null,null,null,null,null,null,null,null,40464.81]
[null,"GUANAJUATO","HECL500618L95","HECL500618HGTRRS04","JOSE LUIS HERNANDEZ CORTES              ",null,null,null,null,"X",null,null,null,null,null,null,null,null,null,null,null,null,null,null,7188.42]
[null,"GUANAJUATO","HECL6401228X2","HECL640122MDFRLT03","LETICIA HERNANDEZ CALVILLO              ",null,null,null,null,"X",null,null,null,null,null,null,null,null,null,null,null,null,null,null,45931.140000000007]
[null,"GUANAJUATO","HECS621213HZ5","HECS621213HGTRLR02","SERGIO HERNANDEZ CALDERON               ",null,null,null,null,"X",null,null,null,null,null,null,null,null,null,null,null,null,null,null,50970.9]
[null,"GUANAJUATO","HEFM781229PE6","HEFM781229MGTRRL06","MARIA MILAGROS HERNANDEZ FRAUSTO        ",null,null,null,null,"X",null,null,null,null,null,null,null,null,null,null,null,null,null,null,32529.64]
[null,"GUANAJUATO","HEGC870427C96","HEGC870427HCSRNR00","CRISTOBAL DE JES HERNANDEZ GONZALEZ     ",null,null,null,null,"X",null,null,null,null,null,null,null,null,null,null,null,null,null,null,32073.739999999998]
[null,"GUANAJUATO","HEGN8708165Y4","HEGN870816MGTRRY05","NAYELI HERREJON GUERRERO                ",null,null,null,null,"X",null,null,null,null,null,null,null,null,null,null,null,null,null,null,29303.019999999997]
[null,"GUANAJUATO","HEHA830216PP3","HEHA830216MGTRRL04","ALMA DELIA HERNANDEZ HERNANDEZ          ",null,null,null,null,"X",null,null,null,null,null,null,null,null,null,null,null,null,null,null,38050.089999999997]
[null,"GUANAJUATO","HEHA900701UB1","HEHA900701MGTRRN03","ANA LETICIA HERNANDEZ HERRERA           ",null,null,null,null,"X",null,null,null,null,null,null,null,null,null,null,null,null,null,null,33709.64]
[null,"GUANAJUATO","HELB7109192T6","HELB710919MGTRNT04","BEATRIZ HERNANDEZ LONA                  ",null,null,null,null,"X",null,null,null,null,null,null,null,null,null,null,null,null,null,null,44019.770000000004]
[null,"GUANAJUATO","HELJ790519GT9","HELJ790519HGTRPN03","JUAN MANUEL HERNANDEZ LOPEZ             ",null,null,null,null,"X",null,null,null,null,null,null,null,null,null,null,null,null,null,null,45771.17]
[null,"GUANAJUATO","HELU501011H62","HEXL501011HGTRXZ04","DE LA LUZ HERNANDEZ JOSE",null,null,null,null,"X",null,null,null,null,null,null,null,null,null,null,null,null,null,null,40473.550000000003]
[null,"GUANAJUATO","HEMG620422565","HEMG620422MGTRRR08","GRACIELA HERNANDEZ MARTINEZ             ",null,null,null,null,"X",null,null,null,null,null,null,null,null,null,null,null,null,null,null,38933.520000000004]
[null,"GUANAJUATO","HEMM6706104M9","HEMM670610MGTRNR09","MA. MERCEDES HERRERA MANCERA            ",null,null,null,null,"X",null,null,null,null,null,null,null,null,null,null,null,null,null,null,122020.24000000002]
[null,"GUANAJUATO","HEOS630818TG4","HEOS630818MDFRRN00","SONIA GUADALUPE HERNANDEZ OROZCO        ",null,null,null,null,"X",null,null,null,null,null,null,null,null,null,null,null,null,null,null,112438.06]
[null,"GUANAJUATO","HEPU760412GG8","HEPU760412HPLRRZ03","UZIEL HERNANDEZ PEREZ                   ",null,null,null,null,"X",null,null,null,null,null,null,null,null,null,null,null,null,null,null,43637.93]
[null,"GUANAJUATO","HEVL6006012YA","HEVL600601HGTRLZ00","J LUZ HERNANDEZ VELAZQUEZ               ",null,null,null,null,"X",null,null,null,null,null,null,null,null,null,null,null,null,null,null,25197.98]
[null,"GUANAJUATO","HIMK800908LB0","HIMK800908HGTNNR04","KRISTIAN LUIS HINOJOSA MONROY           ",null,null,null,null,"X",null,null,null,null,null,null,null,null,null,null,null,null,null,null,34504.35]
[null,"GUANAJUATO","IAVC761114FE1","IAVC761114MNTBLL00","CLAUDIA ELIZABET IBARRA VILLANUEVA      ",null,null,null,null,"X",null,null,null,null,null,null,null,null,null,null,null,null,null,null,116727.46]
[null,"GUANAJUATO","JACF700609GI1","JACF700609HGTRML07","FELIPE JARAMILLO CAMPOS                 ",null,null,null,null,"X",null,null,null,null,null,null,null,null,null,null,null,null,null,null,32929.31]
[null,"GUANAJUATO","JAMC821119QK9","JAMC821119MGTMSL07","CLAUDIA MARCELA JAIME MOSQUEDA          ",null,null,null,null,"X",null,null,null,null,null,null,null,null,null,null,null,null,null,null,34312.31]
[null,"GUANAJUATO","JAMJ591122Q73","JAMJ591122HGTRNV07","JAVIER JARALEÐO MANCERA                 ",null,null,null,null,"X",null,null,null,null,null,null,null,null,null,null,null,null,null,null,41941.049999999996]
[null,"GUANAJUATO","JIOL8008248F7","JIOL800824MGTMRZ11","LIZETH ARIADNA JIMENEZ ORTEGA           ",null,null,null,null,"X",null,null,null,null,null,null,null,null,null,null,null,null,null,null,77335.37999999999]
[null,"GUANAJUATO","JOOM700802BM5","JOOM700802HGTYRG06","MIGUEL ANGEL JOYA ORTIZ                 ",null,null,null,null,"X",null,null,null,null,null,null,null,null,null,null,null,null,null,null,118183.25000000001]
[null,"GUANAJUATO","JUHF791105831","JUHF791105HDFRLR06","FERNANDO JUAREZ HELGUERA                ",null,null,null,null,"X",null,null,null,null,null,null,null,null,null,null,null,null,null,null,29874.720000000001]
[null,"GUANAJUATO","JUMH681213NW0","JUMH681213HGTRGL00","JOSE HILARIO JUAREZ MAGAÐA              ",null,null,null,null,"X",null,null,null,null,null,null,null,null,null,null,null,null,null,null,113689.35]
[null,"GUANAJUATO","JUPA730712HA3","JUPA730712MGTRRN04","ANA LAURA JUAREZ PEREZ                  ",null,null,null,null,"X",null,null,null,null,null,null,null,null,null,null,null,null,null,null,47486.080000000002]
[null,"GUANAJUATO","JUSD780922L87","JUSD780922MQTRRL03","DULCE MARIA JUAREZ SORIA                ",null,null,null,null,"X",null,null,null,null,null,null,null,null,null,null,null,null,null,null,41985.469999999994]
[null,"GUANAJUATO","LAMA800707D83","LAMA800707HGTRRL05","JOSE ALEJANDRO LARA MERCADO             ",null,null,null,null,"X",null,null,null,null,null,null,null,null,null,null,null,null,null,null,34103.369999999995]
[null,"GUANAJUATO","LAVA8108019Q9","LAVA810801MGTGRN09","MARIA DE LOS ANG LAGUNA VARGAS          ",null,null,null,null,"X",null,null,null,null,null,null,null,null,null,null,null,null,null,null,104399.08]
[null,"GUANAJUATO","LAVD841123J58","LAVD841123HGTGRN02","DANIEL LAGUNA VARGAS                    ",null,null,null,null,"X",null,null,null,null,null,null,null,null,null,null,null,null,null,null,32777.57]
[null,"GUANAJUATO","LELE610112FLA","LELE610112MGTMRL09","ELSA GUADALUPE LEMUS LIRA               ",null,null,null,null,"X",null,null,null,null,null,null,null,null,null,null,null,null,null,null,101354.41]
[null,"GUANAJUATO","LILB720207HV3","LILB720207MGTNML02","BLANCA ESTELA LINARES LOMELI            ",null,null,null,null,"X",null,null,null,null,null,null,null,null,null,null,null,null,null,null,48400.479999999996]
[null,"GUANAJUATO","LIRA890608KM8","LIRA890608MGTZZL06","ALMA ROSARIO LIZARRAGA RUIZ             ",null,null,null,null,"X",null,null,null,null,null,null,null,null,null,null,null,null,null,null,29551.22]
[null,"GUANAJUATO","LOAP6711257L7","LOAP671125HGTPGB09","JOSE PABLO LOPEZ AGUIRRE                ",null,null,null,null,"X",null,null,null,null,null,null,null,null,null,null,null,null,null,null,37936.960000000006]
[null,"GUANAJUATO","LOBM750809KY1","LOBM750809HGTPRG01","MIGUEL LOPEZ BARRAGAN                   ",null,null,null,null,"X",null,null,null,null,null,null,null,null,null,null,null,null,null,null,35237.5]
[null,"GUANAJUATO","LOCR480518KR8","LOCR480518HDFPRG01","ROGELIO LOPEZ CERVANTES                 ",null,null,null,null,"X",null,null,null,null,null,null,null,null,null,null,null,null,null,null,53142.05]
[null,"GUANAJUATO","LOCV8505084R9","LOCV850508MGTPRR07","VERONICA LOPEZ CARDOSO                  ",null,null,null,null,"X",null,null,null,null,null,null,null,null,null,null,null,null,null,null,34219.74]
[null,"GUANAJUATO","LOGM731124S65","LOGM731124MMNPZN04","MONICA IVETT LOPEZ GUZMAN               ",null,null,null,null,"X",null,null,null,null,null,null,null,null,null,null,null,null,null,null,97383.99000000002]
[null,"GUANAJUATO","LOGY890331RG1","LOGY890331MGTPZN04","YANNET LOPEZ GUZMAN                     ",null,null,null,null,"X",null,null,null,null,null,null,null,null,null,null,null,null,null,null,36362.89]
[null,"GUANAJUATO","LOLA590613UN8","LOLA590613HGTPPN00","ANTONIO LOPEZ LOPEZ                     ",null,null,null,null,"X",null,null,null,null,null,null,null,null,null,null,null,null,null,null,123198.92000000001]
[null,"GUANAJUATO","LOLA870110SJ9","LOLA870110MGTPPL02","ALMA ALEJANDRA LOPEZ LOPEZ              ",null,null,null,null,"X",null,null,null,null,null,null,null,null,null,null,null,null,null,null,61976.990000000005]
[null,"GUANAJUATO","LOMA701120ND4","LOXM701120HGTPXR04","MARTIN EDUARDO LOPEZ                    ",null,null,null,null,"X",null,null,null,null,null,null,null,null,null,null,null,null,null,null,115174.46000000002]
[null,"GUANAJUATO","LOSG55020446A","LOSG550204HGTPTL09","GUILLERMO LOPEZ SOTO                    ",null,null,null,null,"X",null,null,null,null,null,null,null,null,null,null,null,null,null,null,42089.820000000007]
[null,"GUANAJUATO","LOZE620109TAO","LOZE620109MGTPMV07","MA.EVERILDA LOPEZ ZAMORA                ",null,null,null,null,"X",null,null,null,null,null,null,null,null,null,null,null,null,null,null,40312.679999999993]
[null,"GUANAJUATO","LURR5303156L3","LURR530315HGTNMY04","RAYMUNDO LUNA RAMIREZ                   ",null,null,null,null,"X",null,null,null,null,null,null,null,null,null,null,null,null,null,null,111269.82]
[null,"GUANAJUATO","MABH800524BY7","MABH800524HMNRRG02","HUGO MARTINEZ BARRERA                   ",null,null,null,null,"X",null,null,null,null,null,null,null,null,null,null,null,null,null,null,88398.360000000015]
[null,"GUANAJUATO","MABM8602122N2","MABM860212MGTRRL21","MELISSA MARISELA MARTINEZ BARRIOS       ",null,null,null,null,"X",null,null,null,null,null,null,null,null,null,null,null,null,null,null,31348.309999999998]
[null,"GUANAJUATO","MACP790228577","MACP790228MGTRSL06","MARIA DEL PILAR MARTINEZ CASTRO         ",null,null,null,null,"X",null,null,null,null,null,null,null,null,null,null,null,null,null,null,31347.909999999996]
[null,"GUANAJUATO","MADB860405V48","MADB860405MGTLZL02","MARIA BLANCA MALAGON DIAZ               ",null,null,null,null,"X",null,null,null,null,null,null,null,null,null,null,null,null,null,null,51008.61]
[null,"GUANAJUATO","MADJ760413GFA","MADJ760413HGTTZQ01","JOAQUIN MATA DIAZ                       ",null,null,null,null,"X",null,null,null,null,null,null,null,null,null,null,null,null,null,null,43843.789999999994]
[null,"GUANAJUATO","MADM900319GN9","MADM900319HGTTZN05","JOSE MANUEL MATA DIAZ                   ",null,null,null,null,"X",null,null,null,null,null,null,null,null,null,null,null,null,null,null,31326.15]
[null,"GUANAJUATO","MAFJ5906036T8","MAFJ590603HGTRRN00","JUAN MANUEL MARTINEZ FRIAS              ",null,null,null,null,"X",null,null,null,null,null,null,null,null,null,null,null,null,null,null,45107.079999999994]
[null,"GUANAJUATO","MAGB8208194P2","MAGB820819MGTLRL08","BLANCA ELIA MALDONADO GARCIA            ",null,null,null,null,"X",null,null,null,null,null,null,null,null,null,null,null,null,null,null,61173.149999999994]
[null,"GUANAJUATO","MAGC661126AJ5","MAGC661126MGTLNR18","MA.CARMEN MALDONADO GONZALEZ            ",null,null,null,null,"X",null,null,null,null,null,null,null,null,null,null,null,null,null,null,105944.19]
[null,"GUANAJUATO","MAGF780719PC1","MAGF780719MGTRNT03","FATIMA MARTINEZ GONZALEZ                ",null,null,null,null,"X",null,null,null,null,null,null,null,null,null,null,null,null,null,null,30973.480000000003]
[null,"GUANAJUATO","MAHM7308144V2","MAHM730814MGTRRR07","MARCELA DEL PILA MARTINEZ HERNANDEZ     ",null,null,null,null,"X",null,null,null,null,null,null,null,null,null,null,null,null,null,null,99614.03]
[null,"GUANAJUATO","MAJG650413GMA","MAJG650413HGTLRS08","GUSTAVO MALAGON JUAREZ                  ",null,null,null,null,"X",null,null,null,null,null,null,null,null,null,null,null,null,null,null,113378.75]
[null,"GUANAJUATO","MALR690904B5A","MALR690904MGTRPS03","ROSA EUGENIA MARTINEZ LOPEZ             ",null,null,null,null,"X",null,null,null,null,null,null,null,null,null,null,null,null,null,null,43679.54]
[null,"GUANAJUATO","MAMJ620217DW9","MAMJ620217HGTRNN03","JUAN ANTONIO MARTINEZ MONCIBAIS         ",null,null,null,null,"X",null,null,null,null,null,null,null,null,null,null,null,null,null,null,84064.310000000012]
[null,"GUANAJUATO","MAMM8504029T1","MAMM850402MGTLLS09","MASSIEL MALDONADO MALDONADO             ",null,null,null,null,"X",null,null,null,null,null,null,null,null,null,null,null,null,null,null,35322.199999999997]
[null,"GUANAJUATO","MAOJ7405168FA","MAOJ740516MGTRCN05","JUANA MARTINEZ OCHOA                    ",null,null,null,null,"X",null,null,null,null,null,null,null,null,null,null,null,null,null,null,113945.69000000002]
[null,"GUANAJUATO","MARC9411088E1","MARC941108MGTYDC02","CECILIA IRAIS MAYORGA RODRIGUEZ         ",null,null,null,null,"X",null,null,null,null,null,null,null,null,null,null,null,null,null,null,16318.5]
[null,"GUANAJUATO","MARM6405079G7","MARM640507HGTGVR02","MARTIN MAGAÐA RIVERA                    ",null,null,null,null,"X",null,null,null,null,null,null,null,null,null,null,null,null,null,null,104774.68000000001]
[null,"GUANAJUATO","MATF6010095M3","MATF601009HGTGFR00","FRANCISCO MAGAÐA TAFOYA                 ",null,null,null,null,"X",null,null,null,null,null,null,null,null,null,null,null,null,null,null,46884.86]
[null,"GUANAJUATO","MATM660127FH7","MATM660127MGTGFN01","MONICA MAGAÐA TAFOYA                    ",null,null,null,null,"X",null,null,null,null,null,null,null,null,null,null,null,null,null,null,41618.130000000005]
[null,"GUANAJUATO","MAVR700118TS6","MAVR700118HGTRRB08","RUBEN MARTINEZ VARELA                   ",null,null,null,null,"X",null,null,null,null,null,null,null,null,null,null,null,null,null,null,117992.03]
[null,"GUANAJUATO","MAZC650708TU1","MAZC650708MGTQRR01","MARIA CARMEN MAQUEDA ZARATE             ",null,null,null,null,"X",null,null,null,null,null,null,null,null,null,null,null,null,null,null,41297.4]
[null,"GUANAJUATO","MAZC781203DS0","MAZC781203HGTQRR06","CARLOS MAQUEDA ZARATE                   ",null,null,null,null,"X",null,null,null,null,null,null,null,null,null,null,null,null,null,null,30941.050000000003]
[null,"GUANAJUATO","MAZR720405LB8","MAZR720405HMNRTC01","RICARDO MARTINEZ ZETINA                 ",null,null,null,null,"X",null,null,null,null,null,null,null,null,null,null,null,null,null,null,63769.020000000004]
[null,"GUANAJUATO","MEAE910606I30","MEAE910606HGTJGD01","EDGAR EMMANUEL MEJIA AGUILA             ",null,null,null,null,"X",null,null,null,null,null,null,null,null,null,null,null,null,null,null,29667.370000000003]
[null,"GUANAJUATO","MEES880125B67","MEES880125MGTZSN02","SANDRA MARGARITA MEZA ESTRADA           ",null,null,null,null,"X",null,null,null,null,null,null,null,null,null,null,null,null,null,null,31992.69]
[null,"GUANAJUATO","MEGG6410124T0","MEGG641012MGTDRL06","GLORIA MEDINA GARCIA                    ",null,null,null,null,"X",null,null,null,null,null,null,null,null,null,null,null,null,null,null,40518.370000000003]
[null,"GUANAJUATO","MEGM680209QU7","MEGM680209MGTDZR08","MARTHA SUSANA MEDEL GUZMAN              ",null,null,null,null,"X",null,null,null,null,null,null,null,null,null,null,null,null,null,null,29514.949999999997]
[null,"GUANAJUATO","MEGR631011V43","MEGR631011MGTNRS04","ROSA MENDEZ GARCIA                      ",null,null,null,null,"X",null,null,null,null,null,null,null,null,null,null,null,null,null,null,43702.75]
[null,"GUANAJUATO","MELJ7904219Z8","MELJ790421HGTLDN03","JUAN MAURICIO MELGOZA LEDESMA           ",null,null,null,null,"X",null,null,null,null,null,null,null,null,null,null,null,null,null,null,34133.97]
[null,"GUANAJUATO","MELN680719F21","MELN680719MGTLDR00","NORMA LETICIA MELGOZA LEDESMA           ",null,null,null,null,"X",null,null,null,null,null,null,null,null,null,null,null,null,null,null,42207.950000000004]
[null,"GUANAJUATO","MEME901101QT3","MEME901101MGTNRL08","MARIA ELENA MENDOZA MARTINEZ            ",null,null,null,null,"X",null,null,null,null,null,null,null,null,null,null,null,null,null,null,38701.800000000003]
[null,"GUANAJUATO","MEMM670521N64","MEMM670521MDFDJR03","MARTHA PATRICIA MEDEL MEJIA             ",null,null,null,null,"X",null,null,null,null,null,null,null,null,null,null,null,null,null,null,50815.48]
[null,"GUANAJUATO","MEMM740704297","MEMM740704MDFDRR03","MIRNA MEDINA MARIN                      ",null,null,null,null,"X",null,null,null,null,null,null,null,null,null,null,null,null,null,null,35587.619999999995]
[null,"GUANAJUATO","MERA680725T53","MERA680725MGTJML04","ALMA DELIA MEJIA RAMOS                  ",null,null,null,null,"X",null,null,null,null,null,null,null,null,null,null,null,null,null,null,45043.619999999995]
[null,"GUANAJUATO","MERG840929RZ5","MERG840929MGTNDB06","GABRIELA MENDEZ RODRIGUEZ               ",null,null,null,null,"X",null,null,null,null,null,null,null,null,null,null,null,null,null,null,22421.64]
[null,"GUANAJUATO","MESL860213877","MESL860213MGTNNR09","LOURDES PAULINA MENDOZA SANCHEZ         ",null,null,null,null,"X",null,null,null,null,null,null,null,null,null,null,null,null,null,null,59986.87000000001]
[null,"GUANAJUATO","MEVJ760816A58","MEVJ760816HGTJLL19","JULIO ENRIQUE MEJIA VILLANUEVA          ",null,null,null,null,"X",null,null,null,null,null,null,null,null,null,null,null,null,null,null,116606.84]
[null,"GUANAJUATO","MIAO8312189C2","MIAO831218HDFLPM04","OMAR MILLAN APUD                        ",null,null,null,null,"X",null,null,null,null,null,null,null,null,null,null,null,null,null,null,56685.990000000005]
[null,"GUANAJUATO","MIHG8606185P2","MIHG860618MDFRRB06","GABRIELA MIRAMONTES HERNANDEZ           ",null,null,null,null,"X",null,null,null,null,null,null,null,null,null,null,null,null,null,null,32267.139999999996]
[null,"GUANAJUATO","MOFD480314HT2","MOFD480314HGTRLL00","JOSE DOLORES MORALES FLORES             ",null,null,null,null,"X",null,null,null,null,null,null,null,null,null,null,null,null,null,null,42560.840000000004]
[null,"GUANAJUATO","MOFD741006FM4","MOFD741006HGTSLV05","DAVID MOSQUEDA FLORES                   ",null,null,null,null,"X",null,null,null,null,null,null,null,null,null,null,null,null,null,null,42731.87]
[null,"GUANAJUATO","MOFY680125UV7","MOFY680125MGTSLL00","YOLANDA MOSQUEDA FLORES                 ",null,null,null,null,"X",null,null,null,null,null,null,null,null,null,null,null,null,null,null,50059.99]
[null,"GUANAJUATO","MOGM581228P96","MOGM581228MGTRNR09","MARTHA DEL CARME MORENO GONZALEZ        ",null,null,null,null,"X",null,null,null,null,null,null,null,null,null,null,null,null,null,null,45841.68]
[null,"GUANAJUATO","MOHA6909151AA","MOHA690915MGTRRN03","ANDREA MORALES HERNANDEZ                ",null,null,null,null,"X",null,null,null,null,null,null,null,null,null,null,null,null,null,null,34278.5]
[null,"GUANAJUATO","MOJC851117J2A","MOJC851117MGTRST08","CITLALLI TONANCI MORA JASSO             ",null,null,null,null,"X",null,null,null,null,null,null,null,null,null,null,null,null,null,null,96335.77]
[null,"GUANAJUATO","MOLJ6908066K2","MOLJ690806HGTNRN01","JUAN ANTONIO MONTALVO LIRA              ",null,null,null,null,"X",null,null,null,null,null,null,null,null,null,null,null,null,null,null,72162.450000000012]
[null,"GUANAJUATO","MOMA590424218","MOMA590424HGTNLN04","JOSE ANTONIO MONCADA MALDONADO          ",null,null,null,null,"X",null,null,null,null,null,null,null,null,null,null,null,null,null,null,43674.38]
[null,"GUANAJUATO","MORA580316U78","MORA580316HGTJML06","ALEJANDRO MOJICA RAMIREZ                ",null,null,null,null,"X",null,null,null,null,null,null,null,null,null,null,null,null,null,null,47203.909999999996]
[null,"GUANAJUATO","MORM6501066X7","MORM650106HGTRSL00","MELCHOR BENITO MORENO ROSALES           ",null,null,null,null,"X",null,null,null,null,null,null,null,null,null,null,null,null,null,null,110997.87000000001]
[null,"GUANAJUATO","MORM8011214B7","MORM801121HDFRMN03","MANUEL EFRAIN MORENO ROMERO             ",null,null,null,null,"X",null,null,null,null,null,null,null,null,null,null,null,null,null,null,37497.57]
[null,"GUANAJUATO","MOSJ790615LD6","MOSJ790615HGTLNN00","JUAN MOLINA SANCHEZ                     ",null,null,null,null,"X",null,null,null,null,null,null,null,null,null,null,null,null,null,null,39983.44999999999]
[null,"GUANAJUATO","MOSP780508DF7","MOSP780508HGTLND02","PEDRO MOLINA SANCHEZ                    ",null,null,null,null,"X",null,null,null,null,null,null,null,null,null,null,null,null,null,null,45051.25]
[null,"GUANAJUATO","MUHA861028V94","MUHA861028HGTXRD02","JOSE ADAN MUÐOZ HERNANDEZ               ",null,null,null,null,"X",null,null,null,null,null,null,null,null,null,null,null,null,null,null,33036.720000000001]
[null,"GUANAJUATO","MUPT600105IQ9","MUPT600105MGTRRR07","MA TRINIDAD MURILLO PEREZ               ",null,null,null,null,"X",null,null,null,null,null,null,null,null,null,null,null,null,null,null,37975.149999999994]
[null,"GUANAJUATO","MUSF920131FC2","MUSF920131MGTXCR06","MARIA FERNANDA MUÐOZ SAUCILLO           ",null,null,null,null,"X",null,null,null,null,null,null,null,null,null,null,null,null,null,null,30963.1]
[null,"GUANAJUATO","NAME6411037H1","NAME641103MDFVDV03","EVA NAVARRO MADRIGAL                    ",null,null,null,null,"X",null,null,null,null,null,null,null,null,null,null,null,null,null,null,38045.14]
[null,"GUANAJUATO","NAQI780206S92","NAQI780206HDFVXV07","IVAN AGUSTIN NAVARRETE QUIÐONES         ",null,null,null,null,"X",null,null,null,null,null,null,null,null,null,null,null,null,null,null,44605.359999999993]
[null,"GUANAJUATO","NAVS621206356","NAVS621206MGTVLN00","SANDRA JUANA NAVA VELAZQUEZ             ",null,null,null,null,"X",null,null,null,null,null,null,null,null,null,null,null,null,null,null,76752.479999999996]
[null,"GUANAJUATO","NAZA870510IS9","NAZA870510HGTVVN07","JOSE ANTONIO NAVARRETE ZAVALA           ",null,null,null,null,"X",null,null,null,null,null,null,null,null,null,null,null,null,null,null,26891.450000000004]
[null,"GUANAJUATO","NIHE721201VC3","NIHE721201HGTTRS04","EUSEBIO MIGUEL A NIETO HERNANDEZ        ",null,null,null,null,"X",null,null,null,null,null,null,null,null,null,null,null,null,null,null,38244.910000000003]
[null,"GUANAJUATO","NIMA711025LJ1","NIMA711025MGTTRL07","ALICIA NIETO MARTINEZ                   ",null,null,null,null,"X",null,null,null,null,null,null,null,null,null,null,null,null,null,null,44456.03]
[null,"GUANAJUATO","NIMT691014GT1","NIMT691014MGTTRR05","TERESITA NIETO MARTINEZ                 ",null,null,null,null,"X",null,null,null,null,null,null,null,null,null,null,null,null,null,null,31019.719999999998]
[null,"GUANAJUATO","NIRA700123GK9","NIRA700123MGTTVN01","ANA LAURA NIETO RIVERA                  ",null,null,null,null,"X",null,null,null,null,null,null,null,null,null,null,null,null,null,null,123661.44]
[null,"GUANAJUATO","NUBS660923RQA","NUBS660923MGTXRL07","MA.SILVIA NUÐEZ BARRERA                 ",null,null,null,null,"X",null,null,null,null,null,null,null,null,null,null,null,null,null,null,45012.39]
[null,"GUANAJUATO","NUCS580811UI9","NUCS580811MGTXRS04","SUSANA NUÐEZ CERRITOS                   ",null,null,null,null,"X",null,null,null,null,null,null,null,null,null,null,null,null,null,null,44263.93]
[null,"GUANAJUATO","OAGS860412RP6","OAGS860412MGTRTR05","SARA DEL ROSARIO ORRANTI GUTIERREZ      ",null,null,null,null,"X",null,null,null,null,null,null,null,null,null,null,null,null,null,null,33896.289999999994]
[null,"GUANAJUATO","OAMC600520F43","OAMC600520HSLLLR01","CARLOS JAVIER OLAVEZ MELESIO            ",null,null,null,null,"X",null,null,null,null,null,null,null,null,null,null,null,null,null,null,46196.909999999996]
[null,"GUANAJUATO","OELW670610C88","OELW670610HGTLDN06","WENCESLAO OLVERA LEDESMA                ",null,null,null,null,"X",null,null,null,null,null,null,null,null,null,null,null,null,null,null,43089.22]
[null,"GUANAJUATO","OERM770419UD7","OERM770419HGTLSG03","MIGUEL ANGEL OLVERA RESENDIZ            ",null,null,null,null,"X",null,null,null,null,null,null,null,null,null,null,null,null,null,null,41962.29]
[null,"GUANAJUATO","OETL661122IZ6","OETL661122MGTRRZ06","LUZ CECILIA ORTEGA TORRES               ",null,null,null,null,"X",null,null,null,null,null,null,null,null,null,null,null,null,null,null,37377.109999999993]
[null,"GUANAJUATO","OEVL650213T59","OEVL650213MGTRLR01","LAURA INES ORTEGA VALADEZ               ",null,null,null,null,"X",null,null,null,null,null,null,null,null,null,null,null,null,null,null,127154.9]
[null,"GUANAJUATO","OILH810313JS5","OILH810313HGTVGC18","HECTOR GERARDO OVIEDO LUGO              ",null,null,null,null,"X",null,null,null,null,null,null,null,null,null,null,null,null,null,null,22105.439999999999]
[null,"GUANAJUATO","OILP6802156K9","OILP680215MDFVGL09","MARIA DEL PILAR OVIEDO LUGO             ",null,null,null,null,"X",null,null,null,null,null,null,null,null,null,null,null,null,null,null,41588.89]
[null,"GUANAJUATO","OING5906128T6","OING590612HGTRCS02","GUSTAVO ORTIZ NICASIO                   ",null,null,null,null,"X",null,null,null,null,null,null,null,null,null,null,null,null,null,null,47209.77]
[null,"GUANAJUATO","OIOM621117BE8","OIOM621117HGTLLN02","MANUEL MARTIN OLIVA OLIVA               ",null,null,null,null,"X",null,null,null,null,null,null,null,null,null,null,null,null,null,null,51160.05]
[null,"GUANAJUATO","OISI790511DD8","OISI790511HHGLNS14","ISMAEL OLIVO SANCHEZ                    ",null,null,null,null,"X",null,null,null,null,null,null,null,null,null,null,null,null,null,null,28709.229999999996]
[null,"GUANAJUATO","OOCM7903122F9","OOCM790312MGTRRR03","MARCELA OROZCO CORNEJO                  ",null,null,null,null,"X",null,null,null,null,null,null,null,null,null,null,null,null,null,null,68630.97]
[null,"GUANAJUATO","OUGM7012272G3","OUGM701227MGTRRN03","MONICA ORDUNA GARCIA                    ",null,null,null,null,"X",null,null,null,null,null,null,null,null,null,null,null,null,null,null,32958.910000000003]
[null,"GUANAJUATO","PACM840215MT1","PACM840215MGTLRR00","MAURA ANGELICA PALOMINO CARREÐO         ",null,null,null,null,"X",null,null,null,null,null,null,null,null,null,null,null,null,null,null,27156.58]
[null,"GUANAJUATO","PACM941015U40","PACM941015MGTLRR06","MARIANA PALOMINO CARRE±O                ",null,null,null,null,"X",null,null,null,null,null,null,null,null,null,null,null,null,null,null,29643.93]
[null,"GUANAJUATO","PACS8101228Y0","PACS810122MGTLRR02","SARA PALOMINO CARREÐO                   ",null,null,null,null,"X",null,null,null,null,null,null,null,null,null,null,null,null,null,null,29461.64]
[null,"GUANAJUATO","PAGM5802105H5","PAGM580210HNTLRT06","MATIAS PALOMARES GARCIA                 ",null,null,null,null,"X",null,null,null,null,null,null,null,null,null,null,null,null,null,null,34742.65]
[null,"GUANAJUATO","PAGR7307144R1","PAGR730714MGTNMF00","MARIA DEL REFUGIO PANTOJA GOMEZ         ",null,null,null,null,"X",null,null,null,null,null,null,null,null,null,null,null,null,null,null,49839.359999999993]
[null,"GUANAJUATO","PAHM630123LJ6","PAHM630123HGTNRN05","MANUEL PANTOJA HERRERA                  ",null,null,null,null,"X",null,null,null,null,null,null,null,null,null,null,null,null,null,null,119951.73999999998]
[null,"GUANAJUATO","PAJJ830708SK1","PAJJ830708HQTTMR06","JORGE ADALBERTO PATINO JIMENEZ          ",null,null,null,null,"X",null,null,null,null,null,null,null,null,null,null,null,null,null,null,35690.350000000006]
[null,"GUANAJUATO","PALM711130LV9","PALM711130HGTRGG02","MIGUEL ANGEL PARAMO LAGUNA              ",null,null,null,null,"X",null,null,null,null,null,null,null,null,null,null,null,null,null,null,41606.460000000006]
[null,"GUANAJUATO","PAPA810618AR6","PAPA810618HGTLLB03","ABRAHAM PALACIOS PALACIOS               ",null,null,null,null,"X",null,null,null,null,null,null,null,null,null,null,null,null,null,null,32931.31]
[null,"GUANAJUATO","PAZR620620HP0","PAZR620620MGTCPQ07","RAQUEL PACHECO ZAPIEN                   ",null,null,null,null,"X",null,null,null,null,null,null,null,null,null,null,null,null,null,null,84090.180000000008]
[null,"GUANAJUATO","PECE671111QE4","PECE671111HDFRSL09","ELOY MARTIN PEREZ CASTILLO              ",null,null,null,null,"X",null,null,null,null,null,null,null,null,null,null,null,null,null,null,119035.61000000002]
[null,"GUANAJUATO","PEGL590326TB4","PEGL590326MGTRMZ05","LUZ ELENA PERALES GOMEZ                 ",null,null,null,null,"X",null,null,null,null,null,null,null,null,null,null,null,null,null,null,40320.129999999997]
[null,"GUANAJUATO","PELI680925LM6","PELI680925MGTDPV03","IVONNE YOLANDA PEDROZA LOPEZ            ",null,null,null,null,"X",null,null,null,null,null,null,null,null,null,null,null,null,null,null,118773.06]
[null,"GUANAJUATO","PELL790204HW5","PELL790204MNTRRC05","LUCIA PEREZ LARA                        ",null,null,null,null,"X",null,null,null,null,null,null,null,null,null,null,null,null,null,null,35964.92]
[null,"GUANAJUATO","PIAR680730PSA","PIAR680730MGTRGG01","MARIA REGINA PRIETO AGUILAR             ",null,null,null,null,"X",null,null,null,null,null,null,null,null,null,null,null,null,null,null,83011.320000000007]
[null,"GUANAJUATO","PIOP550618BT2","PIOP550618HGTCLB08","PABLO PICHARDO OLVERA                   ",null,null,null,null,"X",null,null,null,null,null,null,null,null,null,null,null,null,null,null,45793.25]
[null,"GUANAJUATO","POGA790726B24","POGA790726MGTNZL05","ALMA DELIA PONCE GUZMAN                 ",null,null,null,null,"X",null,null,null,null,null,null,null,null,null,null,null,null,null,null,48590.82]
[null,"GUANAJUATO","POMR6708302N1","POMR670830MGTRNS05","ROSA MARIA PORRAS MANRIQUE              ",null,null,null,null,"X",null,null,null,null,null,null,null,null,null,null,null,null,null,null,77014.210000000006]
[null,"GUANAJUATO","PUAJ821120LU8","PUAJ821120MJCGLN05","JUANA PUGA ALDANA                       ",null,null,null,null,"X",null,null,null,null,null,null,null,null,null,null,null,null,null,null,34036.770000000004]
[null,"GUANAJUATO","QUDW870430HH4","QUDW870430MGTNMN07","WENDY YAZMIN QUINTANA DOMINGUEZ         ",null,null,null,null,"X",null,null,null,null,null,null,null,null,null,null,null,null,null,null,39292.46]
[null,"GUANAJUATO","QUGE620101NK4","QUGE620101HGTNRF01","EFRAIN QUINTANA GARCIA                  ",null,null,null,null,"X",null,null,null,null,null,null,null,null,null,null,null,null,null,null,34420.36]
[null,"GUANAJUATO","QUZJ6303282J5","QUZJ630328HSRLNN05","JUAN QUILES ZUNO                        ",null,null,null,null,"X",null,null,null,null,null,null,null,null,null,null,null,null,null,null,42808.079999999994]
[null,"GUANAJUATO","RAAE850827HM7","RAAE850827MGTMNL05","ELVIA RAMIREZ ANDRADE                   ",null,null,null,null,"X",null,null,null,null,null,null,null,null,null,null,null,null,null,null,33012.050000000003]
[null,"GUANAJUATO","RAAG5908278S6","RAAG590827HMNNBL08","GUILLERMO RANGEL ABURTO                 ",null,null,null,null,"X",null,null,null,null,null,null,null,null,null,null,null,null,null,null,52419.54]
[null,"GUANAJUATO","RAAI811229BW5","RAAI811229MMCMNS05","MARIA ISABEL RAMIREZ ANDRADE            ",null,null,null,null,"X",null,null,null,null,null,null,null,null,null,null,null,null,null,null,50265.299999999996]
[null,"GUANAJUATO","RABR820601BH9","RABR820601HGTMND08","RODOLFO OSVALDO RAMIREZ BUENO           ",null,null,null,null,"X",null,null,null,null,null,null,null,null,null,null,null,null,null,null,95982.860000000015]
[null,"GUANAJUATO","RACA8011159T0","RACA801115MGTMRD05","ADELA RAMIREZ CERRITOS                  ",null,null,null,null,"X",null,null,null,null,null,null,null,null,null,null,null,null,null,null,36780.350000000006]
[null,"GUANAJUATO","RACB5510265G3","RACB551026HGTMSN05","BENITO RAMIREZ CASTILLO                 ",null,null,null,null,"X",null,null,null,null,null,null,null,null,null,null,null,null,null,null,44769.430000000008]
[null,"GUANAJUATO","RAEL8409015U2","RAEL840901MGTMSR07","LAURA PATRICIA RAMOS ESTRADA            ",null,null,null,null,"X",null,null,null,null,null,null,null,null,null,null,null,null,null,null,91680.39]
[null,"GUANAJUATO","RAFA620326696","RAFA620326HGTMNN00","JOSE ANTONIO RAMIREZ FUENTES            ",null,null,null,null,"X",null,null,null,null,null,null,null,null,null,null,null,null,null,null,121092.41999999998]
[null,"GUANAJUATO","RAGJ8207054L2","RAGJ820705HGTNMN05","JUAN ANTONIO RANGEL GOMEZ               ",null,null,null,null,"X",null,null,null,null,null,null,null,null,null,null,null,null,null,null,43913.020000000004]
[null,"GUANAJUATO","RAGT730306AI0","RAGT730306HGTNRR07","JOSE TRINIDAD RANGEL GUERRERO           ",null,null,null,null,"X",null,null,null,null,null,null,null,null,null,null,null,null,null,null,46058.07]
[null,"GUANAJUATO","RAHJ6410105C3","RAHJ641010MGTMRS04","MA. DE JESUS RAMIREZ HORTA              ",null,null,null,null,"X",null,null,null,null,null,null,null,null,null,null,null,null,null,null,121941.6]
[null,"GUANAJUATO","RAHL900721A16","RAHL900721MGTNRL09","LILIANA BERENICE RANGEL HERNANDEZ       ",null,null,null,null,"X",null,null,null,null,null,null,null,null,null,null,null,null,null,null,26039.199999999997]
[null,"GUANAJUATO","RAMA640606AQ0","RAMA640606HGTNXL06","ALBERTO RANGEL MUÐOZ                    ",null,null,null,null,"X",null,null,null,null,null,null,null,null,null,null,null,null,null,null,42817.89]
[null,"GUANAJUATO","RAMD6103291R4","RAMD610329HGTMNV10","DAVID RAMIREZ MONJARAZ                  ",null,null,null,null,"X",null,null,null,null,null,null,null,null,null,null,null,null,null,null,40218.5]
[null,"GUANAJUATO","RARE590716V64","RARE590716MJCMMV05","EVELIA DEL CARMEN RAMIREZ RAMIREZ       ",null,null,null,null,"X",null,null,null,null,null,null,null,null,null,null,null,null,null,null,51410.860000000008]
[null,"GUANAJUATO","RARP630605NP2","RARP630605HJCMMD06","PEDRO RAMIREZ RAMIREZ                   ",null,null,null,null,"X",null,null,null,null,null,null,null,null,null,null,null,null,null,null,39910.269999999997]
[null,"GUANAJUATO","RARR701207IA9","RARR701207MDFMMT08","RITA RAMIREZ RAMIREZ                    ",null,null,null,null,"X",null,null,null,null,null,null,null,null,null,null,null,null,null,null,40880.229999999996]
[null,"GUANAJUATO","RARR710422AB6","RARR710422HGTMDM09","RAMON RAMIREZ RODRIGUEZ                 ",null,null,null,null,"X",null,null,null,null,null,null,null,null,null,null,null,null,null,null,80533.960000000006]
[null,"GUANAJUATO","RASE540830U28","RASE540830HGTYLL02","ELEAZAR RAYAS SILVA                     ",null,null,null,null,"X",null,null,null,null,null,null,null,null,null,null,null,null,null,null,49707.8]
[null,"GUANAJUATO","RELR6206286CA","RELR620628HGTYPG09","ROGELIO REYES LOPEZ                     ",null,null,null,null,"X",null,null,null,null,null,null,null,null,null,null,null,null,null,null,53671.32]
[null,"GUANAJUATO","RELS650704P63","RELS650704MGTXZL00","MA. SOLEDAD REA LOZANO                  ",null,null,null,null,"X",null,null,null,null,null,null,null,null,null,null,null,null,null,null,55539.229999999996]
[null,"GUANAJUATO","RERE8505068T2","RERE850506HMNYMD04","EDUARDO REYES RAMIREZ                   ",null,null,null,null,"X",null,null,null,null,null,null,null,null,null,null,null,null,null,null,30208.78]
[null,"GUANAJUATO","RESO730809AI4","RESO730809MGTYNF03","OFELIA REYES SANDOVAL                   ",null,null,null,null,"X",null,null,null,null,null,null,null,null,null,null,null,null,null,null,40073.700000000004]
[null,"GUANAJUATO","RIGA780625KX0","RIGA780625HGTVMG07","JOSE AUGUSTO RIVERA GOMEZ               ",null,null,null,null,"X",null,null,null,null,null,null,null,null,null,null,null,null,null,null,39490.089999999997]
[null,"GUANAJUATO","RIHR880331D30","RIHR880331HGTSRC09","RICARDO RIOS HERNANDEZ                  ",null,null,null,null,"X",null,null,null,null,null,null,null,null,null,null,null,null,null,null,60993.549999999988]
[null,"GUANAJUATO","RIOS5803272M4","RIOS580327MZSVLC03","MA. DEL SOCORRO RIVERA OLVERA           ",null,null,null,null,"X",null,null,null,null,null,null,null,null,null,null,null,null,null,null,75697.640000000014]
[null,"GUANAJUATO","ROBA710226BG0","RXBA710226MGTBRL07","ALMA ROBLES BRAVO                       ",null,null,null,null,"X",null,null,null,null,null,null,null,null,null,null,null,null,null,null,39673.770000000004]
[null,"GUANAJUATO","ROBB6412029G0","ROBB641202MGTBRL04","BLANCA ESTELA ROBLES BRAVO              ",null,null,null,null,"X",null,null,null,null,null,null,null,null,null,null,null,null,null,null,48401.590000000004]
[null,"GUANAJUATO","ROBY7612249Q3","ROBY761224MMCDCN00","YUNUEN RODRIGUEZ BECERRA                ",null,null,null,null,"X",null,null,null,null,null,null,null,null,null,null,null,null,null,null,38187.49]
[null,"GUANAJUATO","ROCS8704055G4","ROCS870405MMCDSL06","MARIA DEL SOL RODRIGUEZ CASTRO          ",null,null,null,null,"X",null,null,null,null,null,null,null,null,null,null,null,null,null,null,57921.87000000001]
[null,"GUANAJUATO","RODY660703MQ8","RODY660703MGTXLL07","YOLANDA ROA DELGADO                     ",null,null,null,null,"X",null,null,null,null,null,null,null,null,null,null,null,null,null,null,79333.86]
[null,"GUANAJUATO","ROEJ700824751","ROEJ700824HVZMSL05","JULIO CESAR ROMERO ESCOBAR              ",null,null,null,null,"X",null,null,null,null,null,null,null,null,null,null,null,null,null,null,32488.739999999998]
[null,"GUANAJUATO","ROFL910916ES9","ROFL910916MGTBNR05","LORENA ROBLEDO FONSECA                  ",null,null,null,null,"X",null,null,null,null,null,null,null,null,null,null,null,null,null,null,22421.64]
[null,"GUANAJUATO","ROGA640613DQ5","ROGA640613MDFJTN05","ANTONIA ESTELA ROJAS GUTIERREZ          ",null,null,null,null,"X",null,null,null,null,null,null,null,null,null,null,null,null,null,null,102324.61000000002]
[null,"GUANAJUATO","ROGF800428M80","ROGF800428HGTDZD06","FIDEL RODRIGUEZ GUZMAN                  ",null,null,null,null,"X",null,null,null,null,null,null,null,null,null,null,null,null,null,null,47942.39]
[null,"GUANAJUATO","ROGJ631018GD6","ROGJ631018HGTMRN04","JUAN JOSE ROMERO GARCIA                 ",null,null,null,null,"X",null,null,null,null,null,null,null,null,null,null,null,null,null,null,50402.100000000006]
[null,"GUANAJUATO","ROGJ720412CD2","ROGJ720412HGTCNL01","JULIO BERNARDO ROCHA GONZALEZ           ",null,null,null,null,"X",null,null,null,null,null,null,null,null,null,null,null,null,null,null,47338.37]
[null,"GUANAJUATO","ROGJ7905253Y5","ROGJ790525HPLJDN05","JOSE JUAN ROJAS GODOY                   ",null,null,null,null,"X",null,null,null,null,null,null,null,null,null,null,null,null,null,null,109131.6]
[null,"GUANAJUATO","ROGL591003DS4","ROGL591003MGTMNN05","MA.LINA TERESA ROMERO GONZALEZ          ",null,null,null,null,"X",null,null,null,null,null,null,null,null,null,null,null,null,null,null,38288.949999999997]
[null,"GUANAJUATO","ROHH851230UU9","ROHH851230HGTJRR04","HERNAN ROJAS HERNANDEZ                  ",null,null,null,null,"X",null,null,null,null,null,null,null,null,null,null,null,null,null,null,29583.550000000003]
[null,"GUANAJUATO","ROHR681221N53","ROHR681221MGTJRB00","RUBISELA ROJAS HUARACHA                 ",null,null,null,null,"X",null,null,null,null,null,null,null,null,null,null,null,null,null,null,85915.78]
[null,"GUANAJUATO","ROMI501119KW9","ROMI501119HGTCZS14","J. ISABEL ROCHA MEZA                    ",null,null,null,null,"X",null,null,null,null,null,null,null,null,null,null,null,null,null,null,38926.81]
[null,"GUANAJUATO","ROMR681004UF2","ROMR681004HGTDRM02","RAMIRO RODRIGUEZ MARTINEZ               ",null,null,null,null,"X",null,null,null,null,null,null,null,null,null,null,null,null,null,null,49580.479999999996]
[null,"GUANAJUATO","ROMR861218274","ROMR861218HGTDGC00","RICARDO RODRIGUEZ MAGDALENO             ",null,null,null,null,"X",null,null,null,null,null,null,null,null,null,null,null,null,null,null,83173.850000000006]
[null,"GUANAJUATO","ROPJ630922717","ROPJ630922MGTDRS08","JOSEFINA RODRIGUEZ PEREZ                ",null,null,null,null,"X",null,null,null,null,null,null,null,null,null,null,null,null,null,null,42599.26]
[null,"GUANAJUATO","ROPR4911033YA","ROPR491103HGTDTF04","RAFAEL RODRIGUEZ PATINO                 ",null,null,null,null,"X",null,null,null,null,null,null,null,null,null,null,null,null,null,null,36717.440000000002]
[null,"GUANAJUATO","ROPR8607125H9","ROPR860712MGTDNS08","ROSA AIDE RODRIGUEZ PANIAGUA            ",null,null,null,null,"X",null,null,null,null,null,null,null,null,null,null,null,null,null,null,83173.850000000006]
[null,"GUANAJUATO","RORC850223K78","RORC850223HGTDMR02","CARLOS ALBERTO RODRIGUEZ RAMIREZ        ",null,null,null,null,"X",null,null,null,null,null,null,null,null,null,null,null,null,null,null,40191.94]
[null,"GUANAJUATO","RORF650224FV1","RORF650224HDFDDR03","FERNANDO RODRIGUEZ RODRIGUEZ            ",null,null,null,null,"X",null,null,null,null,null,null,null,null,null,null,null,null,null,null,33652.11]
[null,"GUANAJUATO","RORJ800328CB1","RORJ800328HGTDMN01","JUAN PABLO RODRIGUEZ RAMIREZ            ",null,null,null,null,"X",null,null,null,null,null,null,null,null,null,null,null,null,null,null,42701.709999999992]
[null,"GUANAJUATO","ROSA621019UW4","ROSA621019HGTDNG01","AGAPITO RODRIGUEZ SANCHEZ               ",null,null,null,null,"X",null,null,null,null,null,null,null,null,null,null,null,null,null,null,44717.869999999995]
[null,"GUANAJUATO","ROSJ840320PL5","ROSJ840320MMCMGL06","JULIA OYUKI ROMERO SEGURA               ",null,null,null,null,"X",null,null,null,null,null,null,null,null,null,null,null,null,null,null,11259.48]
[null,"GUANAJUATO","ROTF640526L74","ROTF640526HGTDVL07","FELIPE RODRIGUEZ TOVAR                  ",null,null,null,null,"X",null,null,null,null,null,null,null,null,null,null,null,null,null,null,36509.74]
[null,"GUANAJUATO","ROVA500401GUA","ROVA500401HGTJLR05","ARTURO ROJAS VALENCIA                   ",null,null,null,null,"X",null,null,null,null,null,null,null,null,null,null,null,null,null,null,47248.759999999995]
[null,"GUANAJUATO","ROVL470314635","ROVL470314HGTXGS09","LUIS RUBEN ROA VEGA                     ",null,null,null,null,"X",null,null,null,null,null,null,null,null,null,null,null,null,null,null,37491.58]
[null,"GUANAJUATO","ROVR751027UW3","ROVR751027MGTBRS09","MARIA DEL ROSARI ROBLES VARGAS          ",null,null,null,null,"X",null,null,null,null,null,null,null,null,null,null,null,null,null,null,36495.08]
[null,"GUANAJUATO","ROVS5612313Z0","ROVS561231HGTBNL05","J. SILVESTRE ROBLEDO VENEGAS            ",null,null,null,null,"X",null,null,null,null,null,null,null,null,null,null,null,null,null,null,46730.369999999995]
[null,"GUANAJUATO","ROZA560516SE3","ROZA560516HGTJPB08","ABEL ROJAS ZAPATERO                     ",null,null,null,null,"X",null,null,null,null,null,null,null,null,null,null,null,null,null,null,50782.05]
[null,"GUANAJUATO","RUER840817TJ2","RUER840817HGTZSN07","RENE RUIZ ESPINOZA                      ",null,null,null,null,"X",null,null,null,null,null,null,null,null,null,null,null,null,null,null,43125.79]
[null,"GUANAJUATO","RURO710818A13","RURO710818MGTZFL04","OLGA AMALIA RUIZ RUFINO                 ",null,null,null,null,"X",null,null,null,null,null,null,null,null,null,null,null,null,null,null,49347.839999999997]
[null,"GUANAJUATO","SAAA790117M77","SAAA790117HGTNRL19","JOSE ALFREDO SANCHEZ ARREDONDO          ",null,null,null,null,"X",null,null,null,null,null,null,null,null,null,null,null,null,null,null,103323.38]
[null,"GUANAJUATO","SABA620417HF9","SABA620417HVZNTN05","ANICETO SANTIAGO BAUTISTA               ",null,null,null,null,"X",null,null,null,null,null,null,null,null,null,null,null,null,null,null,125168.38999999998]
[null,"GUANAJUATO","SABM631225F45","SABM631225HGTVRR06","MARTIN SALVADOR SAAVEDRA BRAVO          ",null,null,null,null,"X",null,null,null,null,null,null,null,null,null,null,null,null,null,null,31412.639999999999]
[null,"GUANAJUATO","SACM851223UV7","SACM851223MDFNSN01","MONSERRAT SANCHEZ CISNEROS              ",null,null,null,null,"X",null,null,null,null,null,null,null,null,null,null,null,null,null,null,32957.15]
[null,"GUANAJUATO","SAGG7304218VA","SAGG730421MGTNLL02","GLORIA SANCHEZ GALVAN                   ",null,null,null,null,"X",null,null,null,null,null,null,null,null,null,null,null,null,null,null,43946.01]
[null,"GUANAJUATO","SAGM730131V93","SAGM730131MDFNRR07","MARCELA SANCHEZ GARCIA                  ",null,null,null,null,"X",null,null,null,null,null,null,null,null,null,null,null,null,null,null,90004.62000000001]
[null,"GUANAJUATO","SAGN550328R1A","SAGN550328HGTNMC00","NICOLAS SANTOYO GOMEZ                   ",null,null,null,null,"X",null,null,null,null,null,null,null,null,null,null,null,null,null,null,7534.86]
[null,"GUANAJUATO","SAGS78112652A","SAGS781126HGTLTS16","SASHA EMMANUEL SALINAS GUTIERREZ        ",null,null,null,null,"X",null,null,null,null,null,null,null,null,null,null,null,null,null,null,33893.89]
[null,"GUANAJUATO","SAHA7408317B1","SAHA740831MDFNRR01","AURELIA SANDOVAL HERNANDEZ              ",null,null,null,null,"X",null,null,null,null,null,null,null,null,null,null,null,null,null,null,36317.439999999995]
[null,"GUANAJUATO","SAHI670121KQ3","SAHI670121MGTNRN07","MA. INES SANDOVAL HERNANDEZ             ",null,null,null,null,"X",null,null,null,null,null,null,null,null,null,null,null,null,null,null,45658.67]
[null,"GUANAJUATO","SAHL6309234X5","SAHL630923HGTNRS00","LUIS MIGUEL SANCHEZ HERNANDEZ           ",null,null,null,null,"X",null,null,null,null,null,null,null,null,null,null,null,null,null,null,83011.320000000007]
[null,"GUANAJUATO","SAHO620602LB0","SAHO620602HSRLRS06","OSMAN SALAZAR HERNANDEZ                 ",null,null,null,null,"X",null,null,null,null,null,null,null,null,null,null,null,null,null,null,29874.720000000001]
[null,"GUANAJUATO","SALM811102IP0","SALG811102MGTNGD00","MA. GUADALUPE SANCHEZ LAGUNA            ",null,null,null,null,"X",null,null,null,null,null,null,null,null,null,null,null,null,null,null,57052.740000000005]
[null,"GUANAJUATO","SALS651213I40","SALS651213MGTNNN03","SANJUANA SANCHEZ LUNA                   ",null,null,null,null,"X",null,null,null,null,null,null,null,null,null,null,null,null,null,null,57888.73]
[null,"GUANAJUATO","SAMG651113CLA","SAMG651113MGTVDD08","MARIA GUADALUPE SAAVEDRA MEDRANO        ",null,null,null,null,"X",null,null,null,null,null,null,null,null,null,null,null,null,null,null,42817.599999999999]
[null,"GUANAJUATO","SAML830406CC2","SAML830406HDFNNS01","LUIS ENRIQUE SANCHEZ MENDOZA            ",null,null,null,null,"X",null,null,null,null,null,null,null,null,null,null,null,null,null,null,59215.740000000005]
[null,"GUANAJUATO","SAMN650727TS7","SAMN650727MGTNJT03","MA. NATALIA SANCHEZ MOJICA              ",null,null,null,null,"X",null,null,null,null,null,null,null,null,null,null,null,null,null,null,32026.179999999997]
[null,"GUANAJUATO","SAOC521104BAA","SAOC521104HGTNLR02","CARLOS SANCHEZ OLIVA                    ",null,null,null,null,"X",null,null,null,null,null,null,null,null,null,null,null,null,null,null,43459.16]
[null,"GUANAJUATO","SARA881017KA5","SARA881017HGTNXL07","ALBERTO ALEXANDR SANTILLAN REA          ",null,null,null,null,"X",null,null,null,null,null,null,null,null,null,null,null,null,null,null,29873.129999999997]
[null,"GUANAJUATO","SARF810815QJ5","SARF810815MDFNCB12","MARIA FABIOLA SANCHEZ RICO              ",null,null,null,null,"X",null,null,null,null,null,null,null,null,null,null,null,null,null,null,34274.319999999992]
[null,"GUANAJUATO","SARO9410041H4","SARO941004HGNXL07","OLDAIR FERNANDO SANTILLAN REA           ",null,null,null,null,"X",null,null,null,null,null,null,null,null,null,null,null,null,null,null,30676.720000000001]
[null,"GUANAJUATO","SARR700714SU4","SARR700714MGTCMS06","MARIA DEL ROSARI SAUCILLO RAMIREZ       ",null,null,null,null,"X",null,null,null,null,null,null,null,null,null,null,null,null,null,null,62205.9]
[null,"GUANAJUATO","SASJ650121CF2","SAST650121HGTNMR00","J. TRINIDAD SANCHEZ SAMANO              ",null,null,null,null,"X",null,null,null,null,null,null,null,null,null,null,null,null,null,null,70218.11]
[null,"GUANAJUATO","SATR640529JN3","SATR640529HGTLRB08","RUBEN SALAZAR TORRES                    ",null,null,null,null,"X",null,null,null,null,null,null,null,null,null,null,null,null,null,null,48370.520000000004]
[null,"GUANAJUATO","SAVJ890118LK2","SAVJ890118HGTNZS05","JOSE DE JESUS SANCHEZ VAZQUEZ           ",null,null,null,null,"X",null,null,null,null,null,null,null,null,null,null,null,null,null,null,33816.410000000003]
[null,"GUANAJUATO","SECG740707K72","SECG740707MZSGML05","GUILLERMINA SEGURA CAMPOS               ",null,null,null,null,"X",null,null,null,null,null,null,null,null,null,null,null,null,null,null,78014.180000000008]
[null,"GUANAJUATO","SEES881205VA7","SEES881205MGTRSR08","SARA SERRANO ESTRADA                    ",null,null,null,null,"X",null,null,null,null,null,null,null,null,null,null,null,null,null,null,40053.700000000004]
[null,"GUANAJUATO","SETV690706LG3","SETV690706MDFRRR05","VERONICA SERRANO TORRES                 ",null,null,null,null,"X",null,null,null,null,null,null,null,null,null,null,null,null,null,null,85068.690000000017]
[null,"GUANAJUATO","SIFB790507EM8","SIFB790507HGTRRR00","BRAULIO ISAAC SIERRA FERREYRA           ",null,null,null,null,"X",null,null,null,null,null,null,null,null,null,null,null,null,null,null,93622.860000000015]
[null,"GUANAJUATO","SIRI830722KG2","SIRI830722HGTXCG04","IGNACIO MANUEL SIXTOS RICO              ",null,null,null,null,"X",null,null,null,null,null,null,null,null,null,null,null,null,null,null,61918.33]
[null,"GUANAJUATO","SIRO600318LE2","SIRO600318HGTRDC04","JOSE OCTAVIO SIERRA RODRIGUEZ           ",null,null,null,null,"X",null,null,null,null,null,null,null,null,null,null,null,null,null,null,76308.350000000006]
[null,"GUANAJUATO","SOMC8307243E3","SOMC830724HGTTNH06","CHRISTIAN SOTO MENDOZA                  ",null,null,null,null,"X",null,null,null,null,null,null,null,null,null,null,null,null,null,null,88419.47]
[null,"GUANAJUATO","SOMJ580901N40","SOMJ580901HMNLRS02","JESUS SOLIS MARIN                       ",null,null,null,null,"X",null,null,null,null,null,null,null,null,null,null,null,null,null,null,45426.560000000005]
[null,"GUANAJUATO","SOPA800206QN0","SOPA800206HMCRRB02","ABNER ISAI SORIA PEREZ                  ",null,null,null,null,"X",null,null,null,null,null,null,null,null,null,null,null,null,null,null,61997.250000000007]
[null,"GUANAJUATO","SOPL831024T56","SOPL831024MGTTRR09","LAURA ANGELICA SOTO PEREZ               ",null,null,null,null,"X",null,null,null,null,null,null,null,null,null,null,null,null,null,null,70969.31]
[null,"GUANAJUATO","SUFR660516C81","SUFR660516MDFRLQ08","RAQUEL SUAREZ FALCON                    ",null,null,null,null,"X",null,null,null,null,null,null,null,null,null,null,null,null,null,null,71675.23000000001]
[null,"GUANAJUATO","TAAS6205308FA","TAAS620530MJCPLR01","SARA TAPIA ALCANTARA                    ",null,null,null,null,"X",null,null,null,null,null,null,null,null,null,null,null,null,null,null,44715.56]
[null,"GUANAJUATO","TAPM7310026U1","TAPM731002HDFRSG06","MIGUEL ANGEL TAURINO PASTEN             ",null,null,null,null,"X",null,null,null,null,null,null,null,null,null,null,null,null,null,null,42766.80999999999]
[null,"GUANAJUATO","TEHM7408294G1","TEHM740829HGTLRR02","MARCO ANTONIO TELLEZ HERRERA            ",null,null,null,null,"X",null,null,null,null,null,null,null,null,null,null,null,null,null,null,30157.67]
[null,"GUANAJUATO","TIRA931025MA1","TIRA931025MGTRMN09","ANA CECILIA TIERRABLANCA ROMERO         ",null,null,null,null,"X",null,null,null,null,null,null,null,null,null,null,null,null,null,null,22332.989999999998]
[null,"GUANAJUATO","TOCF910415931","TOCF910415MGTRRT00","FATIMA DEL ROSAR TORRES CERVANTES       ",null,null,null,null,"X",null,null,null,null,null,null,null,null,null,null,null,null,null,null,30710.050000000003]
[null,"GUANAJUATO","TOMP701231IUA","TOMP701231MGTRJT08","PATRICIA TORRES MEJIA                   ",null,null,null,null,"X",null,null,null,null,null,null,null,null,null,null,null,null,null,null,43633.59]
[null,"GUANAJUATO","TOOC610522FW3","TOOC610522MGTRRL02","CELIA TORRES ORIGEL                     ",null,null,null,null,"X",null,null,null,null,null,null,null,null,null,null,null,null,null,null,72111.44]
[null,"GUANAJUATO","TORM8008155Q9","TORM800815HGTRVR02","MARIO TORRES RIVERA                     ",null,null,null,null,"X",null,null,null,null,null,null,null,null,null,null,null,null,null,null,37214.559999999998]
[null,"GUANAJUATO","TOSS530312KL6","TOSS530312HDFRMM05","SAMUEL TORRES SUMOZA                    ",null,null,null,null,"X",null,null,null,null,null,null,null,null,null,null,null,null,null,null,33639.07]
[null,"GUANAJUATO","VAAM631105TU4","VAAM631105HGTLYR06","MARTIN VALENTE AYALA                    ",null,null,null,null,"X",null,null,null,null,null,null,null,null,null,null,null,null,null,null,42737.17]
[null,"GUANAJUATO","VACM560124H46","VACM560124HGTZRR03","MAURILIO VAZQUEZ CERVANTES              ",null,null,null,null,"X",null,null,null,null,null,null,null,null,null,null,null,null,null,null,43941.74]
[null,"GUANAJUATO","VACY6607278R7","VACY660727MGTRSL08","YOLANDA VARGAS CASTILLO                 ",null,null,null,null,"X",null,null,null,null,null,null,null,null,null,null,null,null,null,null,87511.84]
[null,"GUANAJUATO","VAEA7904041V2","VAEA790404HGTLLL05","ALEJANDRO VALADEZ ELIAS                 ",null,null,null,null,"X",null,null,null,null,null,null,null,null,null,null,null,null,null,null,34512.99]
[null,"GUANAJUATO","VAGC6606185V3","VAGC660618MGTRRN09","CANDELARIA VARGAS GARCIA                ",null,null,null,null,"X",null,null,null,null,null,null,null,null,null,null,null,null,null,null,29900.050000000003]
[null,"GUANAJUATO","VAGS770812TH3","VAGS770812HGTLRM07","SAMUEL VALLEJO GUERRERO                 ",null,null,null,null,"X",null,null,null,null,null,null,null,null,null,null,null,null,null,null,63235.630000000005]
[null,"GUANAJUATO","VALN7508285U9","VALN750828MGTZMR00","NORMA ADRIANA VAZQUEZ LOMELI            ",null,null,null,null,"X",null,null,null,null,null,null,null,null,null,null,null,null,null,null,44368.29]
[null,"GUANAJUATO","VAMF590309CY5","VAMF590309HGTLNR07","FERNANDO VALDES MONTES                  ",null,null,null,null,"X",null,null,null,null,null,null,null,null,null,null,null,null,null,null,103150.37000000001]
[null,"GUANAJUATO","VASO730804UX2","VASO730804HGTRTC00","OCTAVIO VARGAS SOTO                     ",null,null,null,null,"X",null,null,null,null,null,null,null,null,null,null,null,null,null,null,102950.46]
[null,"GUANAJUATO","VASS860602N16","VASS860602MQTLNN00","SANDRA YANET VALTIERRA SANCHEZ          ",null,null,null,null,"X",null,null,null,null,null,null,null,null,null,null,null,null,null,null,83517.940000000017]
[null,"GUANAJUATO","VEGJ461124SB6","VEGJ461124HGTLLD01","J. GUADALUPE VELAZQUEZ GALLARDO         ",null,null,null,null,"X",null,null,null,null,null,null,null,null,null,null,null,null,null,null,44888.729999999996]
[null,"GUANAJUATO","VEGR631014AK5","VEGR631014HGTLRB01","RUBEN VELAZQUEZ GARCIA                  ",null,null,null,null,"X",null,null,null,null,null,null,null,null,null,null,null,null,null,null,36453.270000000004]
[null,"GUANAJUATO","VEMM86100222D","VEMM861022MGTRNR00","MIRIAM SOLEDAD VERA MENDIETA            ",null,null,null,null,"X",null,null,null,null,null,null,null,null,null,null,null,null,null,null,30711.360000000001]
[null,"GUANAJUATO","VIRS630902SUA","VIRS630902HMNLYL09","SALVADOR VILLANUEVA REYNOSO             ",null,null,null,null,"X",null,null,null,null,null,null,null,null,null,null,null,null,null,null,97809.180000000008]
[null,"GUANAJUATO","VIVM841025NR4","VIVM841025MGTLRL07","MELINA VILLARREAL VARGAS                ",null,null,null,null,"X",null,null,null,null,null,null,null,null,null,null,null,null,null,null,85769.89]
[null,"GUANAJUATO","YEGL891123ML2","YEGL891123MGTPRR08","LAURA VERONICA YEPEZ GARCIA             ",null,null,null,null,"X",null,null,null,null,null,null,null,null,null,null,null,null,null,null,30213.329999999998]
[null,"GUANAJUATO","ZAAF7902055E9","ZAAF790205HGTMLR09","FERNANDO ZAMARRIPA ALDAPE               ",null,null,null,null,"X",null,null,null,null,null,null,null,null,null,null,null,null,null,null,109012.45]
[null,"GUANAJUATO","ZABS740117LZ8","ZABS740117MGRMLS00","SUSY ROCIO ZAMUDIO BALVUENA             ",null,null,null,null,"X",null,null,null,null,null,null,null,null,null,null,null,null,null,null,76949.420000000013]
[null,"GUANAJUATO","ZABS850402N68","ZABS850402HGTMLR06","SERGIO LUIS ZAMUDIO BELTRAN             ",null,null,null,null,"X",null,null,null,null,null,null,null,null,null,null,null,null,null,null,40434.389999999992]
[null,"GUANAJUATO","ZAHE711130S69","ZAHE711130MDFMRR03","ERIKA DE LOS ANGE ZAMORA HERNANDEZ      ",null,null,null,null,"X",null,null,null,null,null,null,null,null,null,null,null,null,null,null,114044.25]
[null,"GUANAJUATO","ZALC5604237Q2","ZALC560423HGTVPR01","CARLOS ZAVALA LOPEZ                     ",null,null,null,null,"X",null,null,null,null,null,null,null,null,null,null,null,null,null,null,42170.57]
[null,"GUANAJUATO","ZALE620903MK9","ZALE620903HGTVND01","EDUARDO ZAVALA LEON                     ",null,null,null,null,"X",null,null,null,null,null,null,null,null,null,null,null,null,null,null,69243.360000000001]
[null,"GUANAJUATO","ZERV770303SS4","ZERV770303MGTNCN07","MARIA  VANESSA ZENDEJAS ROCHA           ",null,null,null,null,"X",null,null,null,null,null,null,null,null,null,null,null,null,null,null,48468.28]
[null,"GUANAJUATO","ZERY820116NN8","ZERY820116MGTNCD08","YADIRA BERENICE ZENDEJAS ROCHA          ",null,null,null,null,"X",null,null,null,null,null,null,null,null,null,null,null,null,null,null,48364.85]
[null,"GUANAJUATO","AABR750608IB4","AABR750608MGTYRS01","ROSA MARGARITA AYALA BARRERA",null,null,null,null,null,null,null,null,"X",null,null,null,null,null,null,null,null,null,null,20004.780000000002]
[null,"GUANAJUATO","AAFO86011729A","AAFO860117MGTRRL08","OLGA ELIZABETH ARAUJO FERNANDEZ",null,null,null,null,null,null,null,null,"X",null,null,null,null,null,null,null,null,null,null,13511.099999999999]
[null,"GUANAJUATO","AAGC731126M29","AAGC731126HDFLNN07","CONRRADO ARTURO ALVAREZ GONZALEZ",null,null,null,null,null,null,null,null,"X",null,null,null,null,null,null,null,null,null,null,28510.320000000007]
[null,"GUANAJUATO","AAGG8604281N4","AAGG860428MGTLRD04","MARIA GUADALUPE ALAMILLA GARCIA",null,null,null,null,null,null,null,null,"X",null,null,null,null,null,null,null,null,null,null,28786.800000000003]
[null,"GUANAJUATO","AAGR6807041Y2","AAGR680704MDFLRF04","MA DEL REFUGIO ANALLA GRANADOS",null,null,null,null,null,null,null,null,"X",null,null,null,null,null,null,null,null,null,null,25596.410000000003]
[null,"GUANAJUATO","AALJ72112271A","AALJ721122MGTLZN08","JUANA CECILIA ALVAREZ LOZANO",null,null,null,null,null,null,null,null,"X",null,null,null,null,null,null,null,null,null,null,88009.600000000006]
[null,"GUANAJUATO","AALJ750316LPA","AALJ750316HGTYLS05","JOSE  AYALA  LULE ",null,null,null,null,null,null,null,null,"X",null,null,null,null,null,null,null,null,null,null,51415.139999999985]
[null,"GUANAJUATO","AAMT550321C79","AAMT550321MGTLRR02","MARIA TERESA ALVAREZ MARES",null,null,null,null,null,null,null,null,"X",null,null,null,null,null,null,null,null,null,null,3081.2]
[null,"GUANAJUATO","AAVB660401UL2","AAVB660401MDFLVL01","BLANCA IVETTE ALVAREZ DEL CASTILLO VENTRE",null,null,null,null,null,null,null,null,"X",null,null,null,null,null,null,null,null,null,null,26953]
[null,"GUANAJUATO","AAVL730510P19","AAVL730510MGTYLR00","LAURA ELENA AYALA VALTIERRA",null,null,null,null,null,null,null,null,"X",null,null,null,null,null,null,null,null,null,null,55622]
[null,"GUANAJUATO","AEAJ830601BM3","AEAJ830601HGTRRN02","JUAN RAMON ARELLANO  ARIAS",null,null,null,null,null,null,null,null,"X",null,null,null,null,null,null,null,null,null,null,8858.4599999999991]
[null,"GUANAJUATO","AEDI770518OLA","AEDI770518HGTRRS01","ISRAEL ARMANDO ARREDONDO  DORANTES",null,null,null,null,null,null,null,null,"X",null,null,null,null,null,null,null,null,null,null,15117]
[null,"GUANAJUATO","AEGD640414KLA","AAPJ880904HGTRTN01","JUAN MIGUEL ARANDA PATLAN",null,null,null,null,null,null,null,null,"X",null,null,null,null,null,null,null,null,null,null,34270]
[null,"GUANAJUATO","AEPI820115AQ1","AEPI820115MDFRLS04","ISABEL ARREDONDO PLATA",null,null,null,null,null,null,null,null,"X",null,null,null,null,null,null,null,null,null,null,3535]
[null,"GUANAJUATO","AERA900121CW4","AERA900121MGTBDD04","ADNARA YESSICA ABREGO RODRIGUEZ",null,null,null,null,null,null,null,null,"X",null,null,null,null,null,null,null,null,null,null,1828.31]
[null,"GUANAJUATO","AERJ730331GZ5","AERJ730331HGTRMN05","JUAN CARLOS ARREOLA ROMERO",null,null,null,null,null,null,null,null,"X",null,null,null,null,null,null,null,null,null,null,9077.75]
[null,"GUANAJUATO","AETA681104M99","AETA681104MGTRPL00","ALEJANDRA ARREGUIN TAPIA",null,null,null,null,null,null,null,null,"X",null,null,null,null,null,null,null,null,null,null,5977.7]
[null,"GUANAJUATO","AICF790308Q83","AICF790308HGTMLR01","FERNANDO AMBRIZ COLIN",null,null,null,null,null,null,null,null,"X",null,null,null,null,null,null,null,null,null,null,60014.339999999982]
[null,"GUANAJUATO","AOML850714B93","AOML850714MMNLGR07","LAURA VENTURA ALBOR MAGAÑA",null,null,null,null,null,null,null,null,"X",null,null,null,null,null,null,null,null,null,null,19197.29]
[null,"GUANAJUATO","AOMR770309JR5","AOMR770309MGTCRS03","ROSAURA ACOSTA MORENO",null,null,null,null,null,null,null,null,"X",null,null,null,null,null,null,null,null,null,null,34663.560000000005]
[null,"GUANAJUATO","AOOC650822A32","AOOC650822MGTRJR02","MA CRISTINA ARROYO OJEDA",null,null,null,null,null,null,null,null,"X",null,null,null,null,null,null,null,null,null,null,81234.509999999995]
[null,"GUANAJUATO","AOOS720925113","AOOS720925MGTBRN08","SANDRA ABOYTES OROZCO",null,null,null,null,null,null,null,null,"X",null,null,null,null,null,null,null,null,null,null,71514]
[null,"GUANAJUATO","AORS650107KK2","AORS650107MGTRML00","MA SOLEDAD ARROYO RAMIREZ",null,null,null,null,null,null,null,null,"X",null,null,null,null,null,null,null,null,null,null,13865.4]
[null,"GUANAJUATO","AOVI670402NJA","AOVI670402HGTCZS07","ISMAEL ACOSTA VAZQUEZ",null,null,null,null,null,null,null,null,"X",null,null,null,null,null,null,null,null,null,null,28886.280000000002]
[null,"GUANAJUATO","AOZL870509M00","AOZL870509MGTLRC04","LUCIA ALONSO ZARAGOZA",null,null,null,null,null,null,null,null,"X",null,null,null,null,null,null,null,null,null,null,6989.18]
[null,"GUANAJUATO","AUCR760401U5A","AUCR760401HGTGRC06","RICARDO AGUILAR CORONA",null,null,null,null,null,null,null,null,"X",null,null,null,null,null,null,null,null,null,null,19852.859999999997]
[null,"GUANAJUATO","AUGJ550312251","AUJG550312HGTGTR07","JORGE AGUILERA GUTIERREZ",null,null,null,null,null,null,null,null,"X",null,null,null,null,null,null,null,null,null,null,53150.759999999995]
[null,"GUANAJUATO","AULG650807MX2","AULG650807MCLGPD08","MARIA GUADALUPE AGUILAR LOPEZ",null,null,null,null,null,null,null,null,"X",null,null,null,null,null,null,null,null,null,null,51568.800000000003]
[null,"GUANAJUATO","AUME740716A41","AUME740716HPLGDN13","ENRIQUE AGUILAR MEDRANO",null,null,null,null,null,null,null,null,"X",null,null,null,null,null,null,null,null,null,null,3255.65]
[null,"GUANAJUATO","AUMJ800706AM9","AUMJ800706HMCGRL14","JOEL AGUILLON MORALES",null,null,null,null,null,null,null,null,"X",null,null,null,null,null,null,null,null,null,null,33700.660000000003]
[null,"GUANAJUATO","AURJ751104NX7","AURJ751104HGTGDN09","JUAN CARLOS  AGUIRRE RODRÌGUEZ",null,null,null,null,null,null,null,null,"X",null,null,null,null,null,null,null,null,null,null,56617.120000000017]
[null,"GUANAJUATO","BACA821115M00","BACA821115MGTRRN05","MARIA DE LOS ANGELES BARRON  CORONA ",null,null,null,null,null,null,null,null,"X",null,null,null,null,null,null,null,null,null,null,19858.8]
[null,"GUANAJUATO","BACG700412ET2","BACG700412MGTRSD07","MA GUADALUPE BRAVO CASTRO",null,null,null,null,null,null,null,null,"X",null,null,null,null,null,null,null,null,null,null,7262.2]
[null,"GUANAJUATO","BACL660127PY3","BACL660127HGTRNS02","JOSE LUIS BRAVO CANO",null,null,null,null,null,null,null,null,"X",null,null,null,null,null,null,null,null,null,null,76562.28]
[null,"GUANAJUATO","BAEJ7111265C6","BAEJ711126HGTTSS04","JESUS MARIO  BAUTISTA  ESCAMILLA ",null,null,null,null,null,null,null,null,"X",null,null,null,null,null,null,null,null,null,null,46677.819999999992]
[null,"GUANAJUATO","BAFL750321MR1","BAFL730321HGTRLS09","LUIS EDUARDO BARRERA FLORES",null,null,null,null,null,null,null,null,"X",null,null,null,null,null,null,null,null,null,null,35322]
[null,"GUANAJUATO","BAGG740408RC0","BAGG740408MGTZRB07","GABRIELA BAEZA GARCIA",null,null,null,null,null,null,null,null,"X",null,null,null,null,null,null,null,null,null,null,65007.78]
[null,"GUANAJUATO","BAMV8801104X4","BAMV880110MGTRNR09","VERONICA GUADALUPE BRAVO MONTES",null,null,null,null,null,null,null,null,"X",null,null,null,null,null,null,null,null,null,null,7165.57]
[null,"GUANAJUATO","BAPA800509JH2","BAPA800509HDFRRL06","ALAN BAROJAS PEREZ",null,null,null,null,null,null,null,null,"X",null,null,null,null,null,null,null,null,null,null,29271.439999999999]
[null,"GUANAJUATO","BASC910503127","BASC910503MGTZNR03","MARIA CRUZ BAEZA SANCHEZ",null,null,null,null,null,null,null,null,"X",null,null,null,null,null,null,null,null,null,null,5314.87]
[null,"GUANAJUATO","BASM671211R18","BASM671211MGTCNR06","MARTHA PATRICIA BACA SANCHEZ",null,null,null,null,null,null,null,null,"X",null,null,null,null,null,null,null,null,null,null,63600.539999999972]
[null,"GUANAJUATO","BAVB810501LRA","BAVB810501MGTRLL01","BLANCA ELIZABETH BARAJAS VALLEJO",null,null,null,null,null,null,null,null,"X",null,null,null,null,null,null,null,null,null,null,70324.100000000006]
[null,"GUANAJUATO","BEGR700112IU3","BEGR700112MGTRRB08","MA REBECA BERNAL GORDILLO",null,null,null,null,null,null,null,null,"X",null,null,null,null,null,null,null,null,null,null,71117.499999999985]
[null,"GUANAJUATO","BEMG751210DE6","BEMG751210MDFLRD00","GUADALUPE KARINA BELTRAN MARTINEZ",null,null,null,null,null,null,null,null,"X",null,null,null,null,null,null,null,null,null,null,5007.88]
[null,"GUANAJUATO","BESJ810412R10","BESJ810412HGTLNS06","JESUS EDUARDO BELMAN SANTILLAN",null,null,null,null,null,null,null,null,"X",null,null,null,null,null,null,null,null,null,null,60163.6]
[null,"GUANAJUATO","BIEF750826Q65","BIEF750826HGTRSL05","FILIBERTO BRISEÑO ESPITIA",null,null,null,null,null,null,null,null,"X",null,null,null,null,null,null,null,null,null,null,56617.120000000017]
[null,"GUANAJUATO","BOSC820326R12","BOSC820326HGTLRR09","CARLOS MARTIN BOLAÑOS SERVIN",null,null,null,null,null,null,null,null,"X",null,null,null,null,null,null,null,null,null,null,81234.509999999995]
[null,"GUANAJUATO","CAAL690628AM6","CAAL690628MGTRLT08","MARIA LETICIA CARDENAS ALMANZA",null,null,null,null,null,null,null,null,"X",null,null,null,null,null,null,null,null,null,null,79886.45]
[null,"GUANAJUATO","CABA581007J13","CABA581007MMNRZN16","MARIA DE LOS ANGELES CARDENAS BAEZA",null,null,null,null,null,null,null,null,"X",null,null,null,null,null,null,null,null,null,null,68782.559999999983]
[null,"GUANAJUATO","CABD570205P26","CABD570205MMNRZL00","MARIA DE LOS DOLORES CARDENAS BAEZA",null,null,null,null,null,null,null,null,"X",null,null,null,null,null,null,null,null,null,null,47676]
[null,"GUANAJUATO","CABD840721MI3","CABD840721HGTSNN09","DANIEL CASIQUE BUENAVISTA",null,null,null,null,null,null,null,null,"X",null,null,null,null,null,null,null,null,null,null,3332.51]
[null,"GUANAJUATO","CACC741121MK3","CACC741121HGTSRR01","CARLOS ALBERTO CASTILLO CRUZ",null,null,null,null,null,null,null,null,"X",null,null,null,null,null,null,null,null,null,null,35210.28]
[null,"GUANAJUATO","CACR540413CR4","CACR540413HBCSSL00","RAUL CASTAÑEDA CASTRO",null,null,null,null,null,null,null,null,"X",null,null,null,null,null,null,null,null,null,null,103793.70000000003]
[null,"GUANAJUATO","CACV851205PW0","CACV851205MQTRRR00","VERA CABELLO  CORONA",null,null,null,null,null,null,null,null,"X",null,null,null,null,null,null,null,null,null,null,49831.38]
[null,"GUANAJUATO","CACX831109CP9","CXCA831109MGTMHM07","AMERICA CAMPOS CHAGOYA",null,null,null,null,null,null,null,null,"X",null,null,null,null,null,null,null,null,null,null,52255.979999999989]
[null,"GUANAJUATO","CADJ720202F14","CADJ720202HMNHRN03","JUAN CHAVEZ DURAN",null,null,null,null,null,null,null,null,"X",null,null,null,null,null,null,null,null,null,null,2259.75]
[null,"GUANAJUATO","CAEL691012SG8","CAEL691012MDFRST01","LETICIA CARMONA  ESPINOSA ",null,null,null,null,null,null,null,null,"X",null,null,null,null,null,null,null,null,null,null,43095.520000000004]
[null,"GUANAJUATO","CAEL721019IZ9","CAEL721019MGTSLL08","LILIA ISELA CASTILLO ELIZARRARAZ",null,null,null,null,null,null,null,null,"X",null,null,null,null,null,null,null,null,null,null,49697.579999999994]
[null,"GUANAJUATO","CAER830626JA4","CAER830626MGTRSY00","REYNA LILIANA  CARDOSO  ESCUTIA ",null,null,null,null,null,null,null,null,"X",null,null,null,null,null,null,null,null,null,null,10962.42]
[null,"GUANAJUATO","CAFJ650317IR5","CAFJ650317HGTRLR04","JORGE CARRANCO FLORES",null,null,null,null,null,null,null,null,"X",null,null,null,null,null,null,null,null,null,null,4980.13]
[null,"GUANAJUATO","CAGG711124NT7","CAGG711124MGTRTD19","MARIA GUADALUPE CARDENAS GUTIERREZ",null,null,null,null,null,null,null,null,"X",null,null,null,null,null,null,null,null,null,null,13839.180000000002]
[null,"GUANAJUATO","CAGG7503244Z4","CAGG750324MGTBTB00","GABRIELA DEL CARMEN CABRERA GUTIÉRREZ",null,null,null,null,null,null,null,null,"X",null,null,null,null,null,null,null,null,null,null,40596.36]
[null,"GUANAJUATO","CAGG841115NK6","CAGG841115MGTLNL08","GIULIANA CALDERON GONZALEZ",null,null,null,null,null,null,null,null,"X",null,null,null,null,null,null,null,null,null,null,23457.3]
[null,"GUANAJUATO","CAHJ750812FB7","CAHJ750812HGTHRR09","JORGE ALEJANDRO CHAGOYA HERNANDEZ",null,null,null,null,null,null,null,null,"X",null,null,null,null,null,null,null,null,null,null,13652.58]
[null,"GUANAJUATO","CAMA720409D58","CAMA720409HGTMRN04","JOSE ANTONIO CAMPOS MORENO",null,null,null,null,null,null,null,null,"X",null,null,null,null,null,null,null,null,null,null,21210]
[null,"GUANAJUATO","CAMH790325MK6","CAMH790325HGTSSC09","HECTOR CASTRO MOSQUEDA",null,null,null,null,null,null,null,null,"X",null,null,null,null,null,null,null,null,null,null,66208.320000000007]
[null,"GUANAJUATO","CAMJ670419324","CAMJ670419HGTRRS00","JOSE DE JESUS CARRILLO MARTINEZ",null,null,null,null,null,null,null,null,"X",null,null,null,null,null,null,null,null,null,null,24894.800000000003]
[null,"GUANAJUATO","CAMJ890730SG6","CAMJ890730MDFSDZ09","JAZMIN CASASOLA MEDINA",null,null,null,null,null,null,null,null,"X",null,null,null,null,null,null,null,null,null,null,5140.5]
[null,"GUANAJUATO","CAOL581027513","CAOL581027HGTMLS01","JOSE LUIS CAMPOS OLALDE",null,null,null,null,null,null,null,null,"X",null,null,null,null,null,null,null,null,null,null,5125.75]
[null,"GUANAJUATO","CAPD830504746","CAPD830504HGTRTG05","DIEGO FELIPE CARDENAS PATIÑO",null,null,null,null,null,null,null,null,"X",null,null,null,null,null,null,null,null,null,null,17696.25]
[null,"GUANAJUATO","CAPJ680119DJ7","CAPJ680119HGTZTN01","J. ANDRES CAZARES PATIÑO",null,null,null,null,null,null,null,null,"X",null,null,null,null,null,null,null,null,null,null,20220.410000000003]
[null,"GUANAJUATO","CARH670101MS3","CARH670101HGTRZC08","HECTOR  CARDENAS  RUIZ ",null,null,null,null,null,null,null,null,"X",null,null,null,null,null,null,null,null,null,null,68749.38]
[null,"GUANAJUATO","CARL560630141","CARL560630HGTSVS09","JOSE LUIS CASTRO RIVAS",null,null,null,null,null,null,null,null,"X",null,null,null,null,null,null,null,null,null,null,11990.08]
[null,"GUANAJUATO","CARS710511U36","CARS710511HGTMNR10","SERGIO ARTURO CAMPOS RANGEL",null,null,null,null,null,null,null,null,"X",null,null,null,null,null,null,null,null,null,null,31713.120000000003]
[null,"GUANAJUATO","CASC710716KT2","CASC710716MGTBRR00","MA CARMEN CABALLERO SIERRA",null,null,null,null,null,null,null,null,"X",null,null,null,null,null,null,null,null,null,null,21784.199999999997]
[null,"GUANAJUATO","CASM6003305D3","CASM600330HGTMTL02","MELCHOR CAMPOS SOTO",null,null,null,null,null,null,null,null,"X",null,null,null,null,null,null,null,null,null,null,57573.599999999999]
[null,"GUANAJUATO","CAVA820322S74","CAVA820322HDFHRB06","ABRAHAM CHAVEZ VARELA",null,null,null,null,null,null,null,null,"X",null,null,null,null,null,null,null,null,null,null,25612.51]
[null,"GUANAJUATO","CAVM6302079D4","CAVM630207MDFLLR04","MARIANA FEDERICA CALDERON VILLALOBOS",null,null,null,null,null,null,null,null,"X",null,null,null,null,null,null,null,null,null,null,16670.650000000001]
[null,"GUANAJUATO","CECE690308KZ9","CECE690308HGTRRL05","ELIAS CERVANTES CRUZ",null,null,null,null,null,null,null,null,"X",null,null,null,null,null,null,null,null,null,null,40032.900000000009]
[null,"GUANAJUATO","CECL851027UY4","CECL851027MGRRSL00","LILIANA CERRATO CUSTODIO",null,null,null,null,null,null,null,null,"X",null,null,null,null,null,null,null,null,null,null,21939.780000000002]
[null,"GUANAJUATO","CEGE7106304G8","CEGE710630MGTBML09","MA ELIZABETH CEBALLOS GOMEZ",null,null,null,null,null,null,null,null,"X",null,null,null,null,null,null,null,null,null,null,95709.880000000019]
[null,"GUANAJUATO","CIAV791109IT0","CIAV791109MGTRRR05","VERONICA CRISANTO ARRIAGA",null,null,null,null,null,null,null,null,"X",null,null,null,null,null,null,null,null,null,null,48528.899999999987]
[null,"GUANAJUATO","CIGM510313HX4","CIGM510313HVZSRG08","MIGUEL ANGEL CISNEROS GARCIA",null,null,null,null,null,null,null,null,"X",null,null,null,null,null,null,null,null,null,null,13723.25]
[null,"GUANAJUATO","CIHJ8210229R1","CIHJ821022HGTHRR04","JORGE LUIS CHIA HERNANDEZ",null,null,null,null,null,null,null,null,"X",null,null,null,null,null,null,null,null,null,null,10251.5]
[null,"GUANAJUATO","CILG720124JZ9","CILG720124MGTSPD05","MA GUADALUPE CISNEROS LOPEZ",null,null,null,null,null,null,null,null,"X",null,null,null,null,null,null,null,null,null,null,27730.799999999999]
[null,"GUANAJUATO","CILG730402N95","CILG730402MGTSPL08","BLANCA ESTELA GUILLERMINA CISNEROS LOPEZ",null,null,null,null,null,null,null,null,"X",null,null,null,null,null,null,null,null,null,null,58927.98]
[null,"GUANAJUATO","CIOR7805171L4","CIOR780517HGTNRB00","ROBERTO CINTORA JR.",null,null,null,null,null,null,null,null,"X",null,null,null,null,null,null,null,null,null,null,12798.169999999998]
[null,"GUANAJUATO","CIOV5211227Z3","CIOV521122HDFSRC01"," VICTOR SAMUEL CISNEROS ORTEGA",null,null,null,null,null,null,null,null,"X",null,null,null,null,null,null,null,null,null,null,53650.349999999984]
[null,"GUANAJUATO","COCF790524RG5","COCJ790524HGTNRR07","FRANCISCO JAVIER CONTRERAS CERVANTES",null,null,null,null,null,null,null,null,"X",null,null,null,null,null,null,null,null,null,null,80019.12]
[null,"GUANAJUATO","COCJ790301RG5","COCJ790301HGTRRN06","JOSE JUAN CORRALES CORONA",null,null,null,null,null,null,null,null,"X",null,null,null,null,null,null,null,null,null,null,36974.400000000001]
[null,"GUANAJUATO","COCJ840424II1","COCJ840424HTLCNR00","JAIRO COCOLETZI CONDE",null,null,null,null,null,null,null,null,"X",null,null,null,null,null,null,null,null,null,null,46821.67000000002]
[null,"GUANAJUATO","COGA610228CT2","COGA610228HDFRRL00"," ALFONSO CORONA GARCIA",null,null,null,null,null,null,null,null,"X",null,null,null,null,null,null,null,null,null,null,65572.650000000009]
[null,"GUANAJUATO","COGB581101LL6","COGB581101HGTRMN07","BENJAMIN CORONA GOMEZ",null,null,null,null,null,null,null,null,"X",null,null,null,null,null,null,null,null,null,null,27563.410000000003]
[null,"GUANAJUATO","COJR790910633","COJR790910MGTRMS08","ROSALVA CORNEJO JIMENEZ",null,null,null,null,null,null,null,null,"X",null,null,null,null,null,null,null,null,null,null,16454.82]
[null,"GUANAJUATO","COMI550105UFA","COMI550105MVZRRS01","MARIA ISABEL CORTES MARTINEZ",null,null,null,null,null,null,null,null,"X",null,null,null,null,null,null,null,null,null,null,18487.2]
[null,"GUANAJUATO","COMJ7702043T7","COMJ770204HGTRRL02","JOEL DE JESUS CORONA MORENO",null,null,null,null,null,null,null,null,"X",null,null,null,null,null,null,null,null,null,null,8910.2000000000007]
[null,"GUANAJUATO","COML571122DD6","COML571122MGTRRT18","LETICIA CORNEJO MARTINEZ",null,null,null,null,null,null,null,null,"X",null,null,null,null,null,null,null,null,null,null,3556.4]
[null,"GUANAJUATO","COMM610831NKA","COMM610831HDFRRG06","MIGUEL CORTES MORALES",null,null,null,null,null,null,null,null,"X",null,null,null,null,null,null,null,null,null,null,40325.949999999997]
[null,"GUANAJUATO","COMS721010P5A","COMS721010MGTRSL09","SILVIA CORDOBA  MOSQUEDA",null,null,null,null,null,null,null,null,"X",null,null,null,null,null,null,null,null,null,null,71029.84]
[null,"GUANAJUATO","COOA720302IP3","COOA720302MGTRRL01","ALMA ROSA CORTEZ ORTIZ",null,null,null,null,null,null,null,null,"X",null,null,null,null,null,null,null,null,null,null,2742.47]
[null,"GUANAJUATO","COPG691022N6A","COPG691022MGTNRD16","MA GUADALUPE CONTRERAS PEREZ",null,null,null,null,null,null,null,null,"X",null,null,null,null,null,null,null,null,null,null,53346.000000000015]
[null,"GUANAJUATO","COTR740102LT0","COTR740102MMCRRC00","ROCIO CORONA TIRADO",null,null,null,null,null,null,null,null,"X",null,null,null,null,null,null,null,null,null,null,35350]
[null,"GUANAJUATO","CUGV730427G51","CUGV730427HGTLMC00","VICTOR MANUEL CUELLAR GOMEZ",null,null,null,null,null,null,null,null,"X",null,null,null,null,null,null,null,null,null,null,80028.600000000006]
[null,"GUANAJUATO","CUMJ850922E29","CUMJ850922MGTVRV00","JAVIERA MARIANA CUEVAS MIRELES",null,null,null,null,null,null,null,null,"X",null,null,null,null,null,null,null,null,null,null,56044.1]
[null,"GUANAJUATO","CURP6903018I5","CURP690301MGTRYT08","PATRICIA DE LA CRUZ REYES",null,null,null,null,null,null,null,null,"X",null,null,null,null,null,null,null,null,null,null,54018]
[null,"GUANAJUATO","DABG810704HX9","DABG810704HGTMRR08","GERSON FALCAO DAMIAN BRAVO",null,null,null,null,null,null,null,null,"X",null,null,null,null,null,null,null,null,null,null,81402.77999999997]
[null,"GUANAJUATO","DARE870421E95","DARE870421MGTMDD0","EDUARDINA ESAIG DAMIAN  RODRIGUEZ",null,null,null,null,null,null,null,null,"X",null,null,null,null,null,null,null,null,null,null,28168.199999999997]
[null,"GUANAJUATO","DAZM801018IR0","DAZM801018MGTVMR04","MIRIAM TERESA DÁVALOS ZAMORA",null,null,null,null,null,null,null,null,"X",null,null,null,null,null,null,null,null,null,null,6285.08]
[null,"GUANAJUATO","DEBY851217D4A","DEBJ851217MGTLLS09","JUSELY GUADALUPE DELGADO BELTRAN",null,null,null,null,null,null,null,null,"X",null,null,null,null,null,null,null,null,null,null,15020.849999999999]
[null,"GUANAJUATO","DEGJ790106AH3","DEGJ790106HGTLRR08","JORGE ALBERTO DELGADO GUERRERO",null,null,null,null,null,null,null,null,"X",null,null,null,null,null,null,null,null,null,null,67888.94]
[null,"GUANAJUATO","DEPT800907TBA","DEPT800907MGTRDR04","MARIA TERESA DERRAMADERO PADILLA",null,null,null,null,null,null,null,null,"X",null,null,null,null,null,null,null,null,null,null,58136.61]
[null,"GUANAJUATO","DICI670401TA1","DICI670401MGTZMR00","IRENE DIAZ CAMPOS",null,null,null,null,null,null,null,null,"X",null,null,null,null,null,null,null,null,null,null,26673]
[null,"GUANAJUATO","DICJ590119T4A","DICJ590119HGTZCS01","JOSE  DIAZ  COCILION ",null,null,null,null,null,null,null,null,"X",null,null,null,null,null,null,null,null,null,null,35521.360000000001]
[null,"GUANAJUATO","DIEM790506MK2","DIEM790506MGTZSR04","MARTHA SOFIA DIAZ ESCUTIA",null,null,null,null,null,null,null,null,"X",null,null,null,null,null,null,null,null,null,null,18077.150000000001]
[null,"GUANAJUATO","DIGJ5805018S3","DIGJ580501HGTZTR09","JORGE DIAZ GUTIERREZ",null,null,null,null,null,null,null,null,"X",null,null,null,null,null,null,null,null,null,null,34663.560000000005]
[null,"GUANAJUATO","DIJT521003PE9","DIJT521003MVZZCR03","MARIA TERESITA DIAZ JACOME",null,null,null,null,null,null,null,null,"X",null,null,null,null,null,null,null,null,null,null,53346]
[null,"GUANAJUATO","DIVA711128CB2","DIVA711128MMCZGL03","ALEJANDRA DIAZ VEGA",null,null,null,null,null,null,null,null,"X",null,null,null,null,null,null,null,null,null,null,9548.44]
[null,"GUANAJUATO","DOMN670802UR9","DOMN670802MGTMNT03","NATALIA DE LOS ANGELES DOMINGUEZ MANZANO",null,null,null,null,null,null,null,null,"X",null,null,null,null,null,null,null,null,null,null,28886.280000000002]
[null,"GUANAJUATO","DUCC5804306T4","DUCC580430HGTXSR01","CARLOS VICTOR DUENAS CASTILLO",null,null,null,null,null,null,null,null,"X",null,null,null,null,null,null,null,null,null,null,4189.41]
[null,"GUANAJUATO","EAGA611030B76","EAGA611030HGTSTN01","ANTONIO MARTIN ESTRADA GUTIERREZ",null,null,null,null,null,null,null,null,"X",null,null,null,null,null,null,null,null,null,null,49867.19999999999]
[null,"GUANAJUATO","EAMA860511UL8","EAMA860511MMNSRN08","ANA LUCIA ESCALANTE MARIN",null,null,null,null,null,null,null,null,"X",null,null,null,null,null,null,null,null,null,null,40440.82]
[null,"GUANAJUATO","EANE770730ID6","EANE770730HMNSXD06","EDGAR CUAUHTEMOC ESTRADA NUÑEZ",null,null,null,null,null,null,null,null,"X",null,null,null,null,null,null,null,null,null,null,10969.859999999999]
[null,"GUANAJUATO","EASG800616J20","EASG800616HGTSSR09","GERARDO ESTRADA SESENTO",null,null,null,null,null,null,null,null,"X",null,null,null,null,null,null,null,null,null,null,31118.5]
[null,"GUANAJUATO","EICS7010205K2","EICS701020MMNNRR06","SERAFINA ENRIQUEZ CORDOVA",null,null,null,null,null,null,null,null,"X",null,null,null,null,null,null,null,null,null,null,93355.5]
[null,"GUANAJUATO","EIDR500307HY1","EIDR500307HGTNLN02","JOSE RENE ENRIQUEZ DELGADO",null,null,null,null,null,null,null,null,"X",null,null,null,null,null,null,null,null,null,null,68474.100000000006]
[null,"GUANAJUATO","EIEA830501N66","EIEA830501MGTSSN05","ANDREA ESPITIA ESPITIA",null,null,null,null,null,null,null,null,"X",null,null,null,null,null,null,null,null,null,null,79886.45]
[null,"GUANAJUATO","EIGG680608R24","EIGG680608HGTSNR01","GERARDO ESPITIA GONZALEZ",null,null,null,null,null,null,null,null,"X",null,null,null,null,null,null,null,null,null,null,94343.9]
[null,"GUANAJUATO","EIHA7010296Z8","EIHA701029HGTSRL01","ALEJANDRO ESPINOSA HERNANDEZ",null,null,null,null,null,null,null,null,"X",null,null,null,null,null,null,null,null,null,null,12013.32]
[null,"GUANAJUATO","EILO590921526","EILO590921MGTSNF06","OFELIA ESPINOSA LUNA",null,null,null,null,null,null,null,null,"X",null,null,null,null,null,null,null,null,null,null,45155]
[null,"GUANAJUATO","EIME671030L39","EIME671030HGTSRD00","EDUARDO ESPINO MIRANDA",null,null,null,null,null,null,null,null,"X",null,null,null,null,null,null,null,null,null,null,17782]
[null,"GUANAJUATO","EIVG610404DLA","EIVG610404HDFLLR08","JORGE ALBERTO ELIZARRARAS VILLALPANDO",null,null,null,null,null,null,null,null,"X",null,null,null,null,null,null,null,null,null,null,35564]
[null,"GUANAJUATO","EOTJ551129MU2","EOTS551129HGTSPT10"," J. SATURNINO ESCOTO TAPIA",null,null,null,null,null,null,null,null,"X",null,null,null,null,null,null,null,null,null,null,34674.899999999994]
[null,"GUANAJUATO","EUQJ600614JNA","EUQJ600614HDFSRN05","JUAN MIGUEL ESQUIVEL QUIROZ",null,null,null,null,null,null,null,null,"X",null,null,null,null,null,null,null,null,null,null,36974.400000000001]
[null,"GUANAJUATO","FABV830514ES9","FABV830514HGTRLC04","VICTOR ESTEBAN FRAUSTO BOLIO",null,null,null,null,null,null,null,null,"X",null,null,null,null,null,null,null,null,null,null,18669.46]
[null,"GUANAJUATO","FEHE800724TQ5","FEHE800724HGTRRD06","EDUARDO FERNANDEZ HERNANDEZ",null,null,null,null,null,null,null,null,"X",null,null,null,null,null,null,null,null,null,null,22877.479999999992]
[null,"GUANAJUATO","FEPD780323M00","FEPD780323MGTLRL01","DELIA FELIPE  PEREZ ",null,null,null,null,null,null,null,null,"X",null,null,null,null,null,null,null,null,null,null,26118.66]
[null,"GUANAJUATO","FIOM790619I13","FIOM790619HDFLRH07","MAHY ROLANDO FILOMENO ORTIZ",null,null,null,null,null,null,null,null,"X",null,null,null,null,null,null,null,null,null,null,12527.339999999997]
[null,"GUANAJUATO","FOBD780903IT3","FOBD780903HGTNDV05","DAVID FONSECA BEDOLLA",null,null,null,null,null,null,null,null,"X",null,null,null,null,null,null,null,null,null,null,10893.3]
[null,"GUANAJUATO","GABM731224PP4","GABM731224HGTRLG09","MIGUEL ANGEL GARCIA BELTRAN",null,null,null,null,null,null,null,null,"X",null,null,null,null,null,null,null,null,null,null,20004.780000000002]
[null,"GUANAJUATO","GACF650909JFA","GACF650909HGTRND07","FIDEL GARCIA CONEJO",null,null,null,null,null,null,null,null,"X",null,null,null,null,null,null,null,null,null,null,54186]
[null,"GUANAJUATO","GACM6402137QA","GACM640213MGTRNR05","MARICELA GARCIA CHAVEZ",null,null,null,null,null,null,null,null,"X",null,null,null,null,null,null,null,null,null,null,57791.5]
[null,"GUANAJUATO","GACP660324G26","GACP660324HGTLPD03","PEDRO GALVEZ CAPORAL",null,null,null,null,null,null,null,null,"X",null,null,null,null,null,null,null,null,null,null,25982.25]
[null,"GUANAJUATO","GACS730701E50","GACS730701MGTYDN08","SANDRA KARINA GAYTAN CADENA",null,null,null,null,null,null,null,null,"X",null,null,null,null,null,null,null,null,null,null,40123.159999999996]
[null,"GUANAJUATO","GAEA800524AAA","GAEA800524HGTRLL00","J. ALFREDO GRANADOS ELIZARRARAS",null,null,null,null,null,null,null,null,"X",null,null,null,null,null,null,null,null,null,null,21590.44]
[null,"GUANAJUATO","GAFR660603435","GAFR660603MGTRRS00","ROSAICELA CRISTINA GARCIA FRIAS",null,null,null,null,null,null,null,null,"X",null,null,null,null,null,null,null,null,null,null,31118.5]
[null,"GUANAJUATO","GAGA6703123EA","GAGA670312HGTSNL02","JOSE ALFREDO GASCA GONZALEZ",null,null,null,null,null,null,null,null,"X",null,null,null,null,null,null,null,null,null,null,132305.94000000003]
[null,"GUANAJUATO","GAGE660725EF1","GAGE660725MGTYNG09","MA. EUGENIA GAYTAN GONZALEZ",null,null,null,null,null,null,null,null,"X",null,null,null,null,null,null,null,null,null,null,107742.12000000002]
[null,"GUANAJUATO","GAGR770628PU1","GAGR770628HGTRYF06","RAFAEL GARCIA GAYTAN",null,null,null,null,null,null,null,null,"X",null,null,null,null,null,null,null,null,null,null,2742.47]
[null,"GUANAJUATO","GAMA5108287F5","GAMA510828HGTRR609","AGUSTIN  GARDIAZABAL  MORALES ",null,null,null,null,null,null,null,null,"X",null,null,null,null,null,null,null,null,null,null,5334.6]
[null,"GUANAJUATO","GAMC720506I97","GAMC720506MGTRRN08","CONSTANZA GARCIA  MARTINEZ",null,null,null,null,null,null,null,null,"X",null,null,null,null,null,null,null,null,null,null,52456.92]
[null,"GUANAJUATO","GAME651110B38","GAME651110HDFRRD00","EDUARDO GARCÍA MORALES",null,null,null,null,null,null,null,null,"X",null,null,null,null,null,null,null,null,null,null,24745]
[null,"GUANAJUATO","GAMM750120RB8","GANN750120MGTRSR08","MARTHA ELBA GARCIA MOSQUEDA",null,null,null,null,null,null,null,null,"X",null,null,null,null,null,null,null,null,null,null,58683.78]
[null,"GUANAJUATO","GAPA750814NW2","GAPA750814MDFMRN01","ANGIE GAMBOA PEREZ",null,null,null,null,null,null,null,null,"X",null,null,null,null,null,null,null,null,null,null,16129.68]
[null,"GUANAJUATO","GARB840625CP8","GARB840625MQTLDR08","BRENDA LIDIA GALLEGOS RODRIGUEZ",null,null,null,null,null,null,null,null,"X",null,null,null,null,null,null,null,null,null,null,23332.05]
[null,"GUANAJUATO","GARG881113FV7","GARG881113HGTRDL05","GUILLERMO GARCIA RODRIGUEZ",null,null,null,null,null,null,null,null,"X",null,null,null,null,null,null,null,null,null,null,10706.52]
[null,"GUANAJUATO","GASM760821854","GASS760821MGTRTC10","MA. DEL SOCORRO GARCIA SOTELO",null,null,null,null,null,null,null,null,"X",null,null,null,null,null,null,null,null,null,null,28886.300000000007]
[null,"GUANAJUATO","GASR730617EQ9","GASR730619MGTRLS03","ROSA MARIA GARCIA  SILVA",null,null,null,null,null,null,null,null,"X",null,null,null,null,null,null,null,null,null,null,51568.800000000003]
[null,"GUANAJUATO","GAUR8010189E2","GAUR801018MGTRRS03","MARIA DEL ROSARIO GRANADOS URIBE",null,null,null,null,null,null,null,null,"X",null,null,null,null,null,null,null,null,null,null,35564]
[null,"GUANAJUATO","GAVJ660521UR1","GAVJ660521HGTRGN08","JUAN CARLOS GARCIA VEGA",null,null,null,null,null,null,null,null,"X",null,null,null,null,null,null,null,null,null,null,5382.79]
[null,"GUANAJUATO","GAVJ851126FM4","GAVJ851126HGTRYV07","JAVIER GARCIA VIEYRA",null,null,null,null,null,null,null,null,"X",null,null,null,null,null,null,null,null,null,null,61299.07]
[null,"GUANAJUATO","GIPE8705187T7","GIPE870718MGTRDR06","ERIKA ELIZABETH GRIMALDO PADILLA",null,null,null,null,null,null,null,null,"X",null,null,null,null,null,null,null,null,null,null,17135]
[null,"GUANAJUATO","GOAJ880125GX4","GOAJ880125HGTNLS06","JOSUE ABRAHAM GONZALEZ ALCANTAR",null,null,null,null,null,null,null,null,"X",null,null,null,null,null,null,null,null,null,null,5164.9799999999996]
[null,"GUANAJUATO","GOCE620703SD6","GOCE620703HDFNRN08","ENRIQUE GONZALEZ CARDONA",null,null,null,null,null,null,null,null,"X",null,null,null,null,null,null,null,null,null,null,2742.47]
[null,"GUANAJUATO","GODA691116ALA","GODA691116HDFMZL07","ALEJANDRO GOMEZ DIAZ",null,null,null,null,null,null,null,null,"X",null,null,null,null,null,null,null,null,null,null,20562]
[null,"GUANAJUATO","GOGF7511182R7","GOGF751118HGTNSR05","FRANCISCO JAVIER GONZALEZ GASCA",null,null,null,null,null,null,null,null,"X",null,null,null,null,null,null,null,null,null,null,120327.20000000001]
[null,"GUANAJUATO","GOHJ740202PJ6","GOHJ740202MGTMRN01","MA JUANA GOMEZ HERNANDEZ",null,null,null,null,null,null,null,null,"X",null,null,null,null,null,null,null,null,null,null,2866.23]
[null,"GUANAJUATO","GOHM731017127","GOHM731017HGTMRG05","MIGUEL ANGEL GOMEZ HERNANDEZ",null,null,null,null,null,null,null,null,"X",null,null,null,null,null,null,null,null,null,null,28067.830000000005]
[null,"GUANAJUATO","GOHM880217IT0","GOHM880217HGTNRR05","MARCOS ELIAS GONZALEZ HERNANDEZ",null,null,null,null,null,null,null,null,"X",null,null,null,null,null,null,null,null,null,null,3947.32]
[null,"GUANAJUATO","GOHS8907177Z1","GOHS890717MQTMRN05","SANDRA IRAIS GOMEZ HERNANDEZ",null,null,null,null,null,null,null,null,"X",null,null,null,null,null,null,null,null,null,null,1390.84]
[null,"GUANAJUATO","GOLG8308137R7","GOLG830813HSPNPB08","GABRIEL HUMBERTO GONZALEZ LOPEZ",null,null,null,null,null,null,null,null,"X",null,null,null,null,null,null,null,null,null,null,44197.719999999994]
[null,"GUANAJUATO","GOMO860112AC6","GOMO860112HDFNRM01","OMAR FRANCISCO GONZALEZ MARTINEZ",null,null,null,null,null,null,null,null,"X",null,null,null,null,null,null,null,null,null,null,105073.70999999998]
[null,"GUANAJUATO","GONJ690921H46","GONJ690921HGTMTS00","JOSE JESUS GOMEZ NIETO",null,null,null,null,null,null,null,null,"X",null,null,null,null,null,null,null,null,null,null,35210.28]
[null,"GUANAJUATO","GONS740424640","GONS740424MGTNXS08","SUSANA MAGNOLIA GONZALEZ NU?Z",null,null,null,null,null,null,null,null,"X",null,null,null,null,null,null,null,null,null,null,65798.7]
[null,"GUANAJUATO","GOOC7007237B8","GOOC700123MGTMRR07","MA. DEL CARMEN GOMEZ OROPEZA",null,null,null,null,null,null,null,null,"X",null,null,null,null,null,null,null,null,null,null,103173.75]
[null,"GUANAJUATO","GOPA710319IB0","GOPA710319HGTNRD02","ADAN ALEJANDRO GONZALEZ PRESA",null,null,null,null,null,null,null,null,"X",null,null,null,null,null,null,null,null,null,null,46677.819999999992]
[null,"GUANAJUATO","GOPE721215MA1","GOPE721215HGTNSD00","EDISON OSWALDO GONZALEZ PESCADOR",null,null,null,null,null,null,null,null,"X",null,null,null,null,null,null,null,null,null,null,3851.5]
[null,"GUANAJUATO","GOPS6802087F1","GOPS680208HGTNDN00","SANTIAGO GONZALEZ PADILLA",null,null,null,null,null,null,null,null,"X",null,null,null,null,null,null,null,null,null,null,53650.349999999984]
[null,"GUANAJUATO","GORC820608RCA","GORC820608MGTLRT07","MA CONCEPCION GONZALEZ RAMIREZ",null,null,null,null,null,null,null,null,"X",null,null,null,null,null,null,null,null,null,null,16003.8]
[null,"GUANAJUATO","GUCA621009A88","GUCA621009MGTTHR00","ARACELI GUTIERREZ CHACON",null,null,null,null,null,null,null,null,"X",null,null,null,null,null,null,null,null,null,null,48031.41]
[null,"GUANAJUATO","GUCM630109EJ1","GUCM630109MGTTSR00","MARIA MARTINA MARGARITA GUTIERREZ CASTRO",null,null,null,null,null,null,null,null,"X",null,null,null,null,null,null,null,null,null,null,32674.459999999995]
[null,"GUANAJUATO","GUCT560830E19","GUCT560830MGTRSR17","MA TERESA GUERRERO CASTRO",null,null,null,null,null,null,null,null,"X",null,null,null,null,null,null,null,null,null,null,62237]
[null,"GUANAJUATO","GUHR661007QW0","GUHR661007MGTTRC18","ROCIO DEL ROSARIO GUTIERREZ HERNANDEZ",null,null,null,null,null,null,null,null,"X",null,null,null,null,null,null,null,null,null,null,268571.03000000003]
[null,"GUANAJUATO","GUJE600723CI3","GUJE600723HGTZMR03","ERNESTO GUZMAN JIMENEZ",null,null,null,null,null,null,null,null,"X",null,null,null,null,null,null,null,null,null,null,117919.48000000003]
[null,"GUANAJUATO","GULA760327G74","GULA760327MCSLPN05","ANA CELIA GUILLEN LOPEZ",null,null,null,null,null,null,null,null,"X",null,null,null,null,null,null,null,null,null,null,16176.32]
[null,"GUANAJUATO","GULG780404F75","GULG780404HGTRGR06","JORGE GUADALUPE GUERRERO LAGUNA",null,null,null,null,null,null,null,null,"X",null,null,null,null,null,null,null,null,null,null,16062.120000000003]
[null,"GUANAJUATO","GUMR8110123U3","GUMR811012HCHZNM08","RAMIRO GUZMAN MONTES",null,null,null,null,null,null,null,null,"X",null,null,null,null,null,null,null,null,null,null,24058.140000000003]
[null,"GUANAJUATO","GUSG880306VD5","GUSG880306HGTLNR09","GERARDO GUILLEN SANCHEZ",null,null,null,null,null,null,null,null,"X",null,null,null,null,null,null,null,null,null,null,2299.67]
[null,"GUANAJUATO","GUSS851005CT6","GUSS851005MGTLNN08","SANDRA GUILLEN SANCHEZ",null,null,null,null,null,null,null,null,"X",null,null,null,null,null,null,null,null,null,null,21210]
[null,"GUANAJUATO","GUVG640807PZ4","GUVG640807MDFZRB04","GABRIELA GUIZAR VARGAS",null,null,null,null,null,null,null,null,"X",null,null,null,null,null,null,null,null,null,null,44440.62000000001]
[null,"GUANAJUATO","GUVJ730410LD4","GUVJ730410MGTZRD08","JUDITH GUIZAR VARGAS",null,null,null,null,null,null,null,null,"X",null,null,null,null,null,null,null,null,null,null,13981.800000000001]
[null,"GUANAJUATO","HEAA581022HVA","HEAA581022HMCRTL07","JOSE ALBERTO HERRERA ATILANO",null,null,null,null,null,null,null,null,"X",null,null,null,null,null,null,null,null,null,null,34391.279999999999]
[null,"GUANAJUATO","HEAM5406144E9","HEAM540614MDFRRR09","MARISELA HERRERA ARVIZU",null,null,null,null,null,null,null,null,"X",null,null,null,null,null,null,null,null,null,null,24005.699999999997]
[null,"GUANAJUATO","HECM670422CC4","HECM670422MDFRBR02","MARIA MARCELA  HERRERA  CEBALLOS ",null,null,null,null,null,null,null,null,"X",null,null,null,null,null,null,null,null,null,null,71241.659999999989]
[null,"GUANAJUATO","HEDA800812DP2","HEDA800812HGTTZD09","ADRIAN HERNANDEZ DIAZ",null,null,null,null,null,null,null,null,"X",null,null,null,null,null,null,null,null,null,null,41645.030000000006]
[null,"GUANAJUATO","HEDT700419HG2","HEDT700419HGTRRR01","JOSÉ TERESO HERNÁNDEZ DURÁN",null,null,null,null,null,null,null,null,"X",null,null,null,null,null,null,null,null,null,null,43475.64]
[null,"GUANAJUATO","HEEF6801012R8","HEEF680101HHGRSL09","FELIPE HERNANDEZ ESTRADA",null,null,null,null,null,null,null,null,"X",null,null,null,null,null,null,null,null,null,null,40454.050000000003]
[null,"GUANAJUATO","HEFJ700120711","HEFG700120HGTRSD12","J. GUADALUPE HERNANDEZ FISCAL",null,null,null,null,null,null,null,null,"X",null,null,null,null,null,null,null,null,null,null,125450.5]
[null,"GUANAJUATO","HELM570929SP5","HELM570929HQTRRG04","MIGUEL HERNANDEZ LIRA",null,null,null,null,null,null,null,null,"X",null,null,null,null,null,null,null,null,null,null,6388.52]
[null,"GUANAJUATO","HEMB820716LV7","HEMB820716MGTRDR06","BRENDA HERNANDEZ MEDINA",null,null,null,null,null,null,null,null,"X",null,null,null,null,null,null,null,null,null,null,4112.3999999999996]
[null,"GUANAJUATO","HEMR760314HY6","HEMR760314HGTRRL06","RAUL HERNANDEZ MARTINEZ",null,null,null,null,null,null,null,null,"X",null,null,null,null,null,null,null,null,null,null,2781.1]
[null,"GUANAJUATO","HEMY820605MZ2","HEMY820605MGTRNL07","YOLANDA  HERNANDEZ  MONTOYA ",null,null,null,null,null,null,null,null,"X",null,null,null,null,null,null,null,null,null,null,20066.47]
[null,"GUANAJUATO","HEPM8111294E4","HEPM811129HGTRRG03","MIGUEL ANGEL HERNANDEZ PEREZ",null,null,null,null,null,null,null,null,"X",null,null,null,null,null,null,null,null,null,null,35048.65]
[null,"GUANAJUATO","HERA4412086H0","HERA441208HGTRSL07","ALFREDO HERRERA ROSALES",null,null,null,null,null,null,null,null,"X",null,null,null,null,null,null,null,null,null,null,1820.51]
[null,"GUANAJUATO","HERA5904202S0","HERA590420HGTRSN04","JOSE ANTONIO HERRERA  ROSALES",null,null,null,null,null,null,null,null,"X",null,null,null,null,null,null,null,null,null,null,24026.640000000003]
[null,"GUANAJUATO","HERA790726J96","HERA790726MGTRMN07","ANA VERONICA HERNANDEZ RAMIREZ",null,null,null,null,null,null,null,null,"X",null,null,null,null,null,null,null,null,null,null,5140.5]
[null,"GUANAJUATO","HERD520203ADO","HERD520203MSLRSB04","DEBORA HERN RUSSEL",null,null,null,null,null,null,null,null,"X",null,null,null,null,null,null,null,null,null,null,30843]
[null,"GUANAJUATO","HERG630310IB0","HERG630310MGTRMB03","MARIA GABRIELA SUSANA HERRERA ZUBIETA ROMERO",null,null,null,null,null,null,null,null,"X",null,null,null,null,null,null,null,null,null,null,67732.559999999983]
[null,"GUANAJUATO","HERN811104FB8","HERN811104MMNRJB02","NUBIA VANNESA HERNANDEZ ROJAS",null,null,null,null,null,null,null,null,"X",null,null,null,null,null,null,null,null,null,null,7786.57]
[null,"GUANAJUATO","HERR700403DUO","HERR700403HGTRMC07","RICARDO MARTIN HERNANDEZ RAMIREZ",null,null,null,null,null,null,null,null,"X",null,null,null,null,null,null,null,null,null,null,65673.959999999977]
[null,"GUANAJUATO","IACC631023AI2","IACC631023HGTBNH06","CUAUHTEMOC IBARRA CANO",null,null,null,null,null,null,null,null,"X",null,null,null,null,null,null,null,null,null,null,98333.619999999981]
[null,"GUANAJUATO","IUMM800617VC2","IUMM800617MGTSRY06","MYRNA DENISSE ISUSQUIZA MARTÍNEZ",null,null,null,null,null,null,null,null,"X",null,null,null,null,null,null,null,null,null,null,2345.73]
[null,"GUANAJUATO","JAAM590516MH6","JAAM590516HGTMRN03","MANUEL JAIME ARELLANO",null,null,null,null,null,null,null,null,"X",null,null,null,null,null,null,null,null,null,null,10311.119999999999]
[null,"GUANAJUATO","JAMJ8502091S3","JAMJ850209HDFSRL04","JULIO CESAR JASSO MARTINEZ",null,null,null,null,null,null,null,null,"X",null,null,null,null,null,null,null,null,null,null,18871.75]
[null,"GUANAJUATO","JAOP740625985","JAOP740625MGTMLT05","PATRICIA JAIME  OLVERA",null,null,null,null,null,null,null,null,"X",null,null,null,null,null,null,null,null,null,null,39363.75]
[null,"GUANAJUATO","JAPM610407F53","JAPM610407HGTSRR00","MARCELINO JASSO PEREZ",null,null,null,null,null,null,null,null,"X",null,null,null,null,null,null,null,null,null,null,35350]
[null,"GUANAJUATO","JIEC831030A73","JIEC831030MGTMSR07","MARIA CRISTHIAN JIMENEZ ESQUEDA",null,null,null,null,null,null,null,null,"X",null,null,null,null,null,null,null,null,null,null,5140.5]
[null,"GUANAJUATO","JISS660630UT8","JISS660630HGTMNR01","SERGIO JIMENEZ SANCHEZ",null,null,null,null,null,null,null,null,"X",null,null,null,null,null,null,null,null,null,null,25982.25]
[null,"GUANAJUATO","JOSJ820529NC7","JOSJ820529HNTYNN07","JONATHAN JOYA DE LA SANCHA",null,null,null,null,null,null,null,null,"X",null,null,null,null,null,null,null,null,null,null,13336.5]
[null,"GUANAJUATO","JUBE7310241I6","JUBE731024MGTRLL05","ELIDUVINA JUAREZ BALANDRÁN",null,null,null,null,null,null,null,null,"X",null,null,null,null,null,null,null,null,null,null,13748.98]
[null,"GUANAJUATO","JULA7109296W5","JULA710929HGTRNL01","ALEJANDRO JUAREZ LEON",null,null,null,null,null,null,null,null,"X",null,null,null,null,null,null,null,null,null,null,81156.950000000012]
[null,"GUANAJUATO","JULB700329347","JULB700329HGTRNN09","BENITO JUAREZ LEON",null,null,null,null,null,null,null,null,"X",null,null,null,null,null,null,null,null,null,null,55622]
[null,"GUANAJUATO","LACD700106TJ4","LACD700106HMCGRV02","DAVID LAGUNA CARRANCO",null,null,null,null,null,null,null,null,"X",null,null,null,null,null,null,null,null,null,null,70016.729999999981]
[null,"GUANAJUATO","LAGG811206L76","LAGG811206MGTRND04","MARIA GUADALUPE LARA GONZALEZ",null,null,null,null,null,null,null,null,"X",null,null,null,null,null,null,null,null,null,null,20798.099999999999]
[null,"GUANAJUATO","LAML7310086Z6","LAML731008MGTRNR00","LAURA LARA MANCERA",null,null,null,null,null,null,null,null,"X",null,null,null,null,null,null,null,null,null,null,93355.5]
[null,"GUANAJUATO","LAMV790816C4A","LAMV790816MGTRNN04","VANESSA GEOVANNA LARIOS MINJARES",null,null,null,null,null,null,null,null,"X",null,null,null,null,null,null,null,null,null,null,18876]
[null,"GUANAJUATO","LARJ570720TF2","LARJ570720HGTGDR08","JORGE ARTURO LAGUNA RODIGUEZ",null,null,null,null,null,null,null,null,"X",null,null,null,null,null,null,null,null,null,null,21338.400000000001]
[null,"GUANAJUATO","LEGR710831DD0","LEGR710831HGTSNL02","RAUL LESSO GONZALEZ ",null,null,null,null,null,null,null,null,"X",null,null,null,null,null,null,null,null,null,null,32229.599999999991]
[null,"GUANAJUATO","LEHM650906984","LEHM650906HGTNRG07","MIGUEL ANGEL DE LEON HURTADO",null,null,null,null,null,null,null,null,"X",null,null,null,null,null,null,null,null,null,null,5500.16]
[null,"GUANAJUATO","LELJ740926PK3","LELJ740926HJCNPN01","JUAN ANTONIO LEON LOPEZ",null,null,null,null,null,null,null,null,"X",null,null,null,null,null,null,null,null,null,null,43663.099999999991]
[null,"GUANAJUATO","LOBA7910123P2","LOBA791012HJCPRL00","ALEJANDRO LOPEZ BRIONES",null,null,null,null,null,null,null,null,"X",null,null,null,null,null,null,null,null,null,null,60661.229999999981]
[null,"GUANAJUATO","LOBL610801UA2","LOBL610801HGTPDS05","LUIS LOPEZ BEDOLLA",null,null,null,null,null,null,null,null,"X",null,null,null,null,null,null,null,null,null,null,28067.830000000005]
[null,"GUANAJUATO","LOCJ790515Q78","LOCJ790515HGTPHN00","JUAN ANDRES LOPEZ CHAVEZ ",null,null,null,null,null,null,null,null,"X",null,null,null,null,null,null,null,null,null,null,26730.6]
[null,"GUANAJUATO","LOGG700109MF1","LOGG700109MGTPRD02","MA. GUADALUPE LOPEZ GARCIA",null,null,null,null,null,null,null,null,"X",null,null,null,null,null,null,null,null,null,null,20798.099999999999]
[null,"GUANAJUATO","LOGJ711211E25","LOGJ711211HGTMVN07","JUAN LOMAS GUEVARA",null,null,null,null,null,null,null,null,"X",null,null,null,null,null,null,null,null,null,null,48730.6]
[null,"GUANAJUATO","LOGS791206JH1","LOGS791206HGTPPR07","SERGIO LOPEZ GUAPO",null,null,null,null,null,null,null,null,"X",null,null,null,null,null,null,null,null,null,null,77494.13]
[null,"GUANAJUATO","LOHE8811064TA","LOHE881106MJCPRD00","EDITH LOPEZ HERNANDEZ",null,null,null,null,null,null,null,null,"X",null,null,null,null,null,null,null,null,null,null,16781.8]
[null,"GUANAJUATO","LOJR7312299QW","LOJR731229HGTPRC05","RICARDO LOPEZ JUAREZ",null,null,null,null,null,null,null,null,"X",null,null,null,null,null,null,null,null,null,null,8724.76]
[null,"GUANAJUATO","LOLB790114RE0","LOLB790114MGTPPR08","BERENICE LOPEZ LOPEZ",null,null,null,null,null,null,null,null,"X",null,null,null,null,null,null,null,null,null,null,2334.0100000000002]
[null,"GUANAJUATO","LOMA671109LL9","LOMA671109MGTPLL00","ALEJANDRA LOPEZ MELGAREJO",null,null,null,null,null,null,null,null,"X",null,null,null,null,null,null,null,null,null,null,38381.799999999996]
[null,"GUANAJUATO","LOOE660716UY7","LOOE660716HGTPJD01","EDUARDO LOPEZ OJEDA",null,null,null,null,null,null,null,null,"X",null,null,null,null,null,null,null,null,null,null,19197.29]
[null,"GUANAJUATO","LORC760609NB1","LORC760609MDFPVL08","CLAUDETTE LÓPEZ DE LA RIVA",null,null,null,null,null,null,null,null,"X",null,null,null,null,null,null,null,null,null,null,31097.5]
[null,"GUANAJUATO","LORF540804250","LORF540804HJCPLR09","FRANCISCO JAVIER LOPEZ RUELAS",null,null,null,null,null,null,null,null,"X",null,null,null,null,null,null,null,null,null,null,57791.5]
[null,"GUANAJUATO","LORM590406948","LORM590406MGTPDD05","MA GUADALUPE LOPEZ RODRIGUEZ",null,null,null,null,null,null,null,null,"X",null,null,null,null,null,null,null,null,null,null,5777.25]
[null,"GUANAJUATO","LOVJ660127MI1","LOVJ660127HGTPLN03","JUAN LÓPEZ VALENCIA",null,null,null,null,null,null,null,null,"X",null,null,null,null,null,null,null,null,null,null,40440.75]
[null,"GUANAJUATO","LOVT730719N69","LOVT730719MGTPLR04","MARIA TERESITA LOPEZ VILLAGOMEZ",null,null,null,null,null,null,null,null,"X",null,null,null,null,null,null,null,null,null,null,33700.660000000003]
[null,"GUANAJUATO","LOVV821208K16","LOVV821208HGTPZC03","VICTOR HUGO LOPEZ VAZQUEZ",null,null,null,null,null,null,null,null,"X",null,null,null,null,null,null,null,null,null,null,104362.29999999999]
[null,"GUANAJUATO","LUCF7002115Q9","LUCF700211HGTLND05","FIDEL  LULE  CONTRERAS ",null,null,null,null,null,null,null,null,"X",null,null,null,null,null,null,null,null,null,null,27292.979999999992]
[null,"GUANAJUATO","LUWR540208FX7","LUWR540208MDFNRB04","REBECA LUNA WIARCO",null,null,null,null,null,null,null,null,"X",null,null,null,null,null,null,null,null,null,null,60913.25]
[null,"GUANAJUATO","MAAJ840617R99","MAAJ840617HGTRLN05","JUAN GUILLERMO MARTIN DEL CAMPO ALMENDARIZ",null,null,null,null,null,null,null,null,"X",null,null,null,null,null,null,null,null,null,null,21210]
[null,"GUANAJUATO","MABG7804019Z5","MABG780401MGTCRL00","GLORIA ELENA MACIEL  BARAJAS",null,null,null,null,null,null,null,null,"X",null,null,null,null,null,null,null,null,null,null,69873.84]
[null,"GUANAJUATO","MACM811125AAA","MACM811125MGTSRR00","MARLENE SELENE MASCOTTE CRUZ",null,null,null,null,null,null,null,null,"X",null,null,null,null,null,null,null,null,null,null,40825.959999999992]
[null,"GUANAJUATO","MAGD5812285Y1","MAGD581228MGTRRL00","MARIA DOLORES MARTINEZ  GARCIA",null,null,null,null,null,null,null,null,"X",null,null,null,null,null,null,null,null,null,null,5101.9800000000005]
[null,"GUANAJUATO","MAGM780331EF7","MAGM780331MGTRZR08","MARIANA MARIN GUZMAN",null,null,null,null,null,null,null,null,"X",null,null,null,null,null,null,null,null,null,null,39410.5]
[null,"GUANAJUATO","MAHA821225TQ5","MAHA821225MGTRRL02","ALEJANDRA  MARTINEZ  HERNANDEZ ",null,null,null,null,null,null,null,null,"X",null,null,null,null,null,null,null,null,null,null,78357.02]
[null,"GUANAJUATO","MAHE740312EP4","MAHE740312MJCLRR09","ERIKA GUADALUPE MALDONADO HERNANDEZ",null,null,null,null,null,null,null,null,"X",null,null,null,null,null,null,null,null,null,null,107300.69999999995]
[null,"GUANAJUATO","MAHS851214LA6","MAHS851214MGTRRN01","SANDRA MARTINEZ HERNANDEZ",null,null,null,null,null,null,null,null,"X",null,null,null,null,null,null,null,null,null,null,34800.42]
[null,"GUANAJUATO","MAJT7906215T2","MAJT790621MGTNRR01","TERESA MANDUJANO JURADO",null,null,null,null,null,null,null,null,"X",null,null,null,null,null,null,null,null,null,null,33875.479999999996]
[null,"GUANAJUATO","MALS720215M37","MALS720215MGTRPR06","SARA MARTINEZ LOPEZ",null,null,null,null,null,null,null,null,"X",null,null,null,null,null,null,null,null,null,null,79886.45]
[null,"GUANAJUATO","MAMA660610965","MAMA660610HGTRLR00","ARMANDO MARTINEZ MALDONADO",null,null,null,null,null,null,null,null,"X",null,null,null,null,null,null,null,null,null,null,58771.499999999985]
[null,"GUANAJUATO","MAMA711017CPA","MAMA711017HGTRNR02","ARTURO MARTINEZ MONCADA",null,null,null,null,null,null,null,null,"X",null,null,null,null,null,null,null,null,null,null,22916.46]
[null,"GUANAJUATO","MAMA770820UT0","MAMA770820MGTRRN06","ANA LILIA MARTINEZ MARTINEZ",null,null,null,null,null,null,null,null,"X",null,null,null,null,null,null,null,null,null,null,31118.5]
[null,"GUANAJUATO","MAMG691216UYA","MAMG691216HGTRRD04","JOSE GUADALUPE RAUL MARTINEZ MORENO",null,null,null,null,null,null,null,null,"X",null,null,null,null,null,null,null,null,null,null,49490]
[null,"GUANAJUATO","MARJ690613N97","MARJ690613HGTGYN00","JUAN MIGUEL MAGAÑA  RAYA",null,null,null,null,null,null,null,null,"X",null,null,null,null,null,null,null,null,null,null,60537]
[null,"GUANAJUATO","MARM860927B16","MARM860927MGTRVN09","MARIA MONTSERRAT MARES RIVERA",null,null,null,null,null,null,null,null,"X",null,null,null,null,null,null,null,null,null,null,8122.99]
[null,"GUANAJUATO","MARR660925MG9","MARR660925MGTRDC04","ROCIO MARTINEZ RODRIGUEZ",null,null,null,null,null,null,null,null,"X",null,null,null,null,null,null,null,null,null,null,3273.78]
[null,"GUANAJUATO","MASE831216GZ4","MASE831216MGTNTL05","ELIA MANDUJANO SOTO",null,null,null,null,null,null,null,null,"X",null,null,null,null,null,null,null,null,null,null,28280]
[null,"GUANAJUATO","MASJ651012DZ4","MASJ651012HVZRNN09","JUAN CARLOS MARTINEZ SANTOS",null,null,null,null,null,null,null,null,"X",null,null,null,null,null,null,null,null,null,null,53921.069999999992]
[null,"GUANAJUATO","MASS590809U18","MASS590809HGTRTL08","SALVADOR MARTINEZ SOTO",null,null,null,null,null,null,null,null,"X",null,null,null,null,null,null,null,null,null,null,23431.38]
[null,"GUANAJUATO","MAST621028SCA","MAST621028MGTRTT12","MA TERESA MARTINEZ SOTO",null,null,null,null,null,null,null,null,"X",null,null,null,null,null,null,null,null,null,null,18487.2]
[null,"GUANAJUATO","MATG681016SW7","MATG681016HGTGFR08","GERARDO MAGAÑA TAFOYA",null,null,null,null,null,null,null,null,"X",null,null,null,null,null,null,null,null,null,null,85473.5]
[null,"GUANAJUATO","MATJ861103RG1","MATJ861103MGTRPZ09","JAZMIN MONSERRAT MARTINEZ TAPIA",null,null,null,null,null,null,null,null,"X",null,null,null,null,null,null,null,null,null,null,2742.47]
[null,"GUANAJUATO","MATM690314EG4","MATM690314MGTRRT12","MATILDE MARTINEZ TORRES",null,null,null,null,null,null,null,null,"X",null,null,null,null,null,null,null,null,null,null,65359.200000000019]
[null,"GUANAJUATO","MAVR720809AXA","MAVR720809MGTNZS05","ROSA BEATRIZ MANJARREZ VAZQUEZ",null,null,null,null,null,null,null,null,"X",null,null,null,null,null,null,null,null,null,null,7996.5]
[null,"GUANAJUATO","MEAA781114FWA","MEAA781114MGTDRD01","ADRIANA MEDEL ARROYO",null,null,null,null,null,null,null,null,"X",null,null,null,null,null,null,null,null,null,null,73479]
[null,"GUANAJUATO","MEGL640103827","MEGL640103MGTLTT08","MA. LETICIA MELENDEZ GUTIERREZ",null,null,null,null,null,null,null,null,"X",null,null,null,null,null,null,null,null,null,null,74891.05]
[null,"GUANAJUATO","MEGM731204L93","MEGM731204MGTNZR02","MARISA MENDEZ GUZMAN",null,null,null,null,null,null,null,null,"X",null,null,null,null,null,null,null,null,null,null,21568.400000000001]
[null,"GUANAJUATO","MEGR720113GQ8","MEGR720113HMNRNM02","RAMIRO MERCADO  GONZALEZ",null,null,null,null,null,null,null,null,"X",null,null,null,null,null,null,null,null,null,null,46218.079999999994]
[null,"GUANAJUATO","MEHE811224IH7","MEHE811224HGTNRM08","EMMANUEL MENDOZA HERNANDEZ",null,null,null,null,null,null,null,null,"X",null,null,null,null,null,null,null,null,null,null,7070]
[null,"GUANAJUATO","MERA6410168B4","MERA641016HGTDZL14","ALEJANDRO MEDINA REZA",null,null,null,null,null,null,null,null,"X",null,null,null,null,null,null,null,null,null,null,44937.899999999987]
[null,"GUANAJUATO","MESF820630A32","MESF820630HGTNLR02","FRANCISCO JAVIER MENDOZA SOLORZANO",null,null,null,null,null,null,null,null,"X",null,null,null,null,null,null,null,null,null,null,24017.200000000001]
[null,"GUANAJUATO","MESM670501FH5","MESM670501HDFNGR03","MARCO ALFREDO MENDOZA SEGURA",null,null,null,null,null,null,null,null,"X",null,null,null,null,null,null,null,null,null,null,215599.80000000005]
[null,"GUANAJUATO","MEZJ750302AC9","MEZJ750302HGTNPR00","JORGE MENDOZA ZAPATA",null,null,null,null,null,null,null,null,"X",null,null,null,null,null,null,null,null,null,null,8446.4599999999991]
[null,"GUANAJUATO","MOCM7012151Q9","MOCM701215MGTRNN01","MANUELA MORALES CENDEJAS",null,null,null,null,null,null,null,null,"X",null,null,null,null,null,null,null,null,null,null,27313.860000000004]
[null,"GUANAJUATO","MOHD5903208E0","MOHD590320HMCCRL05","JOSE DOLORES GUADALUPE MOCTEZUMA HERNANDEZ",null,null,null,null,null,null,null,null,"X",null,null,null,null,null,null,null,null,null,null,29656.550000000003]
[null,"GUANAJUATO","MOHS911002127","MOHS911002HMCNRR00","SERGIO MONTES DE OCA HURTADO",null,null,null,null,null,null,null,null,"X",null,null,null,null,null,null,null,null,null,null,2786.3199999999997]
[null,"GUANAJUATO","MOPL8106219G5","MOPL810621MGTRLD07","LIDIA MORENO PALOALTO",null,null,null,null,null,null,null,null,"X",null,null,null,null,null,null,null,null,null,null,72793.420000000013]
[null,"GUANAJUATO","MOQR840307NN2","MOQR840307HGTRRC01","RICARDO MORALES QUIROZ",null,null,null,null,null,null,null,null,"X",null,null,null,null,null,null,null,null,null,null,14140]
[null,"GUANAJUATO","MORA600920UJ0","MORA600920MGTSVN08","MARÍA DE LOS ÁNGELES MOSQUEDA RUVALCABA",null,null,null,null,null,null,null,null,"X",null,null,null,null,null,null,null,null,null,null,40426.75]
[null,"GUANAJUATO","MORB790906FV5","MORB790906MGTNSR05","BERTHA ALICIA MONJARAZ RIOS",null,null,null,null,null,null,null,null,"X",null,null,null,null,null,null,null,null,null,null,11232.76]
[null,"GUANAJUATO","MORJ631227S89","MORJ631227HGTTMN01","JUAN  MOTA RAMIREZ",null,null,null,null,null,null,null,null,"X",null,null,null,null,null,null,null,null,null,null,7913.86]
[null,"GUANAJUATO","MORR630513CT2","MORR630513HGTSVD06","RODOLFO MOSQUEDA RUVALCABA",null,null,null,null,null,null,null,null,"X",null,null,null,null,null,null,null,null,null,null,94293.5]
[null,"GUANAJUATO","MOSA681126R27","MOSA681126MGTNRN06","MA ANGELES  MONTERO  SIERRA ",null,null,null,null,null,null,null,null,"X",null,null,null,null,null,null,null,null,null,null,100755.20000000004]
[null,"GUANAJUATO","MOVJ75111289A","MOVJ751112HJCRRR01","JORGE ARMANDO MORALES VARGAS",null,null,null,null,null,null,null,null,"X",null,null,null,null,null,null,null,null,null,null,57791.5]
[null,"GUANAJUATO","MOVM841118881","MOVM841118MGTNRR09","MARIELA MONTIEL  VERA",null,null,null,null,null,null,null,null,"X",null,null,null,null,null,null,null,null,null,null,8891]
[null,"GUANAJUATO","MUCE6604088C8","MUCE660408HGTXRL04","ELIAS MUÑOZ CORTES",null,null,null,null,null,null,null,null,"X",null,null,null,null,null,null,null,null,null,null,30760.979999999992]
[null,"GUANAJUATO","MUCM5811195T2","MUCM580119HGTXMR09","JOSE MARIO MUÑOZ CAMPUSANO",null,null,null,null,null,null,null,null,"X",null,null,null,null,null,null,null,null,null,null,14029.859999999999]
[null,"GUANAJUATO","MUIM8412058X9","MUIM841205MQTXBR03","MARIANA MUÑOZ IBARRA",null,null,null,null,null,null,null,null,"X",null,null,null,null,null,null,null,null,null,null,175168.62]
[null,"GUANAJUATO","MUMJ581102LE9","MUMJ581102HGTXRM09","JAIME MUÑOZ MARTINEZ",null,null,null,null,null,null,null,null,"X",null,null,null,null,null,null,null,null,null,null,26673]
[null,"GUANAJUATO","NAFE720728918","NAFE720728MDFVRV08","EVANGELINA NAVARRETE FARFAN",null,null,null,null,null,null,null,null,"X",null,null,null,null,null,null,null,null,null,null,56386.89]
[null,"GUANAJUATO","NAGM7308014C0","NAGM730801MGTJZR05"," MARCELA NAJERA GUZMAN ",null,null,null,null,null,null,null,null,"X",null,null,null,null,null,null,null,null,null,null,215164.82000000004]
[null,"GUANAJUATO","NAJE70071623A","NAJE700716HGTVMN08","ENRIQUE NAVARRETE JIMENEZ",null,null,null,null,null,null,null,null,"X",null,null,null,null,null,null,null,null,null,null,74865.600000000006]
[null,"GUANAJUATO","OASF640805DW4","OASF640805HGTCTR00","FRANCISCO JAVIER OCAMPO SOTO",null,null,null,null,null,null,null,null,"X",null,null,null,null,null,null,null,null,null,null,13932.780000000002]
[null,"GUANAJUATO","OAVO8206077E6","OAVO820607HMNCZ08","OMAR ANTONIO  OCAMPO  VAZQUEZ",null,null,null,null,null,null,null,null,"X",null,null,null,null,null,null,null,null,null,null,27587.35]
[null,"GUANAJUATO","OEGR7911068I7","OEGR791106MGTRMS01"," ROSA MARIA ORNELAS  GOMEZ",null,null,null,null,null,null,null,null,"X",null,null,null,null,null,null,null,null,null,null,25339.380000000005]
[null,"GUANAJUATO","OELL840306742","OELL840306MGTRNR06","LAURA DEL ROCIO ORNELAS LUNA",null,null,null,null,null,null,null,null,"X",null,null,null,null,null,null,null,null,null,null,2474.5]
[null,"GUANAJUATO","OIAE780131HL9","OIAE780131HGTNLD06","EDGAR JIONEL ONTIVEROS ALCALA",null,null,null,null,null,null,null,null,"X",null,null,null,null,null,null,null,null,null,null,56020.240000000013]
[null,"GUANAJUATO","OIBM740215HY9","OIBM740215MGTRRR07","MIRIAM ORTIZ BARROSO",null,null,null,null,null,null,null,null,"X",null,null,null,null,null,null,null,null,null,null,71241.659999999989]
[null,"GUANAJUATO","OIGE810723LS4","OIGE810723MVZRRD02","EDITH ORTIZ GARCIA",null,null,null,null,null,null,null,null,"X",null,null,null,null,null,null,null,null,null,null,67865.939999999988]
[null,"GUANAJUATO","OIMG610814NA3","OIMG610814MGTRLD00","MA. GUADALUPE ORTIZ MELENDEZ",null,null,null,null,null,null,null,null,"X",null,null,null,null,null,null,null,null,null,null,124474]
[null,"GUANAJUATO","OINM651022J76","OINM651022HGTRVR07","MARTIN ORTIZ NAVARRO",null,null,null,null,null,null,null,null,"X",null,null,null,null,null,null,null,null,null,null,8913.24]
[null,"GUANAJUATO","OISA541015SQ0","OISA541015HGTRLL00","ALEJANDRO ORTIZ SILVA",null,null,null,null,null,null,null,null,"X",null,null,null,null,null,null,null,null,null,null,44724.480000000003]
[null,"GUANAJUATO","OIZG5306099RR","OIZG530609HGTRFL01","GUILLERMO ORTIZ ZAFRA",null,null,null,null,null,null,null,null,"X",null,null,null,null,null,null,null,null,null,null,12177.86]
[null,"GUANAJUATO","OOOC810927BA9","OOOC810927MGTRRL05","CLAUDIA KARINA OROZCO OROZCO",null,null,null,null,null,null,null,null,"X",null,null,null,null,null,null,null,null,null,null,41078.660000000003]
[null,"GUANAJUATO","OOSJ630117DK1","OOSJ630117HGTRNN00","JUAN MANUEL OROPEZA SANCHEZ",null,null,null,null,null,null,null,null,"X",null,null,null,null,null,null,null,null,null,null,41280.679999999993]
[null,"GUANAJUATO","PAAM820226JB0","PAAM820226HGTRGR02","MARTIN PRADO AGUILAR",null,null,null,null,null,null,null,null,"X",null,null,null,null,null,null,null,null,null,null,15421.5]
[null,"GUANAJUATO","PABJ671110D69","PABJ671110HJCLRS08","JOSE DE JESUS PLASCENCIA BARAJAS",null,null,null,null,null,null,null,null,"X",null,null,null,null,null,null,null,null,null,null,36913.310000000005]
[null,"GUANAJUATO","PACM790918HT8","PACM790918HGTNRR13","MAURICIO  PANIAGUA  CARRILLO ",null,null,null,null,null,null,null,null,"X",null,null,null,null,null,null,null,null,null,null,46677.819999999992]
[null,"GUANAJUATO","PAHF740428HK9","PAHF740428HGTDRR00","FRANCISCO JAVIER PADILLA HERNÁNDEZ",null,null,null,null,null,null,null,null,"X",null,null,null,null,null,null,null,null,null,null,11055.759999999998]
[null,"GUANAJUATO","PARA650525ER4","PARA650525HGTNYR08","ARMANDO PANTOJA REYES",null,null,null,null,null,null,null,null,"X",null,null,null,null,null,null,null,null,null,null,3656.63]
[null,"GUANAJUATO","PARH580204E82","PARH580204HDFDYC09","HECTOR PADILLA REYES",null,null,null,null,null,null,null,null,"X",null,null,null,null,null,null,null,null,null,null,24026.640000000003]
[null,"GUANAJUATO","PASM631104DP4","PASM631104MDFDNR08","MARTHA ROCIO PADILLA SANDOVAL",null,null,null,null,null,null,null,null,"X",null,null,null,null,null,null,null,null,null,null,66835.199999999983]
[null,"GUANAJUATO","PATF850801UJA","PATF850801HGTLPR02","FRANCISCO EVERARDO  PLAZA  TAPIA ",null,null,null,null,null,null,null,null,"X",null,null,null,null,null,null,null,null,null,null,42848.679999999986]
[null,"GUANAJUATO","PEAA590708RJ5","PEAA590708HDFRLD08","JOSE ADRIAN ARTURO PEREZ ALVAREZ",null,null,null,null,null,null,null,null,"X",null,null,null,null,null,null,null,null,null,null,10962.42]
[null,"GUANAJUATO","PEBG910930PM0","PEBG910930MQTRCD18","MARIA GUADALUPE PEREZ BECERRA",null,null,null,null,null,null,null,null,"X",null,null,null,null,null,null,null,null,null,null,5588.33]
[null,"GUANAJUATO","PEBJ680711PC1","PEBJ680711MGTRRN00","JUANA PEREZ BERNAL",null,null,null,null,null,null,null,null,"X",null,null,null,null,null,null,null,null,null,null,26673.040000000005]
[null,"GUANAJUATO","PEEJ780324IC1","PEEJ780324HMNRSN01","JUAN FERNANDO PEREZ ESPINO",null,null,null,null,null,null,null,null,"X",null,null,null,null,null,null,null,null,null,null,29562.609999999997]
[null,"GUANAJUATO","PEFD7301136V8","PEFD730113HGTRLV06","DAVID PEREZ FELIPE",null,null,null,null,null,null,null,null,"X",null,null,null,null,null,null,null,null,null,null,29744.609999999997]
[null,"GUANAJUATO","PEGA8608144V9","PEGA860814MGTRTD07","MARIA AIDA PEREZ  GUTIERREZ ",null,null,null,null,null,null,null,null,"X",null,null,null,null,null,null,null,null,null,null,86607.5]
[null,"GUANAJUATO","PEGR750725A34","PEGR750725HDFRTC00","RICARDO PEREZ GUTIERREZ",null,null,null,null,null,null,null,null,"X",null,null,null,null,null,null,null,null,null,null,3084.3]
[null,"GUANAJUATO","PEGR811217KS9","PEGR811217HGTRRC00","RICARDO PEREZ GARCIA",null,null,null,null,null,null,null,null,"X",null,null,null,null,null,null,null,null,null,null,58783.199999999997]
[null,"GUANAJUATO","PEHS851206000","PEHS851206HGTXRL09","JOSE SALUD PEÑA HERNANDEZ",null,null,null,null,null,null,null,null,"X",null,null,null,null,null,null,null,null,null,null,77645.470000000016]
[null,"GUANAJUATO","PEJE510902DF6","PEJE510902HOCRRS08","ESTEBAN PEREZ JUAREZ",null,null,null,null,null,null,null,null,"X",null,null,null,null,null,null,null,null,null,null,17782]
[null,"GUANAJUATO","PEQP6003137R3","PEQP600313MQTRNT01","PATRICIA ANTONIA PEREZ  QUINTERO ",null,null,null,null,null,null,null,null,"X",null,null,null,null,null,null,null,null,null,null,45121.86]
[null,"GUANAJUATO","PESA790927U25","PESA790927MGTRTN06","ANDREA MAGDALENA PEREZ SOTO",null,null,null,null,null,null,null,null,"X",null,null,null,null,null,null,null,null,null,null,118481.65]
[null,"GUANAJUATO","PIZM740723DV9","PIZM740723MGTZMR06","MIRYAM PIZANO ZAMORA",null,null,null,null,null,null,null,null,"X",null,null,null,null,null,null,null,null,null,null,2570.25]
[null,"GUANAJUATO","QUMN8108073JA","QUMN810807MGTNRR05","NEIRA JENNIFER QUINTERO MORENO",null,null,null,null,null,null,null,null,"X",null,null,null,null,null,null,null,null,null,null,75022.709999999992]
[null,"GUANAJUATO","RAAG811213NX5","RAAG811213MGTMGD09","MARIA GUADALUPE RAMIREZ AGUIRRE",null,null,null,null,null,null,null,null,"X",null,null,null,null,null,null,null,null,null,null,16946.599999999999]
[null,"GUANAJUATO","RAAL791208PR9","RAAL791208MGTZNL07","LILIA CONCEPCION RAZO ANGELES",null,null,null,null,null,null,null,null,"X",null,null,null,null,null,null,null,null,null,null,26673]
[null,"GUANAJUATO","RABS681021GFA","RABS681021MGTMRL03","MA SOLEDAD RAMIREZ BERMUDEZ",null,null,null,null,null,null,null,null,"X",null,null,null,null,null,null,null,null,null,null,19259.12]
[null,"GUANAJUATO","RACM561219L8A","RACM561219HGTMNR07","MARIO RAMÍREZ CONTRERAS",null,null,null,null,null,null,null,null,"X",null,null,null,null,null,null,null,null,null,null,18081.280000000002]
[null,"GUANAJUATO","RAFB620409PS9","RAFB620409MNLMNL08","BLANCA ESTHELA RAMOS FUENTES",null,null,null,null,null,null,null,null,"X",null,null,null,null,null,null,null,null,null,null,33699.75]
[null,"GUANAJUATO","RAGE851021JI8","RAGE851021MGTYML08","ELVIA SUSANA RAYA GOMEZ",null,null,null,null,null,null,null,null,"X",null,null,null,null,null,null,null,null,null,null,11353.75]
[null,"GUANAJUATO","RAGM860115N6A","RAGM860115HGTMRR00","MAURO RAMIREZ GARCIA",null,null,null,null,null,null,null,null,"X",null,null,null,null,null,null,null,null,null,null,31185.699999999997]
[null,"GUANAJUATO","RALG600418P69","RALG600418MGTMPD09","MARIA GUADALUPE RAMOS LOPEZ",null,null,null,null,null,null,null,null,"X",null,null,null,null,null,null,null,null,null,null,124474]
[null,"GUANAJUATO","RAMO6702175A0","RAMO670217MMNNJL07","OLGA OFELIA RANGEL MEJIA",null,null,null,null,null,null,null,null,"X",null,null,null,null,null,null,null,null,null,null,6265.8]
[null,"GUANAJUATO","RANS8002268Z7","RASN800226HGTNRS07","NESTOR  RANGEL  SUAREZ ",null,null,null,null,null,null,null,null,"X",null,null,null,null,null,null,null,null,null,null,27336.61]
[null,"GUANAJUATO","RAPA580921FZ2","RAPA580921HGTMDR04","AURELIO RAMIREZ PADRON",null,null,null,null,null,null,null,null,"X",null,null,null,null,null,null,null,null,null,null,18487.2]
[null,"GUANAJUATO","RARM6206207M6","RARM620620HGTMDN03","MANUEL RAMÍREZ RODRÍGUEZ",null,null,null,null,null,null,null,null,"X",null,null,null,null,null,null,null,null,null,null,12708.849999999999]
[null,"GUANAJUATO","RARM770914S13","RARM770914HGTNYR07","MAURICIO RANGEL REYES",null,null,null,null,null,null,null,null,"X",null,null,null,null,null,null,null,null,null,null,45579.100000000013]
[null,"GUANAJUATO","RASA6006139AA","RASA600613HGTMLN04","ANTONIO RAMÍREZ SOLÍS",null,null,null,null,null,null,null,null,"X",null,null,null,null,null,null,null,null,null,null,38987.199999999997]
[null,"GUANAJUATO","RAVM831112KP8","RAVM831112MGTMLN01","MONICA DE LA LUZ RAMIREZ VILLANUEVA",null,null,null,null,null,null,null,null,"X",null,null,null,null,null,null,null,null,null,null,6878.25]
[null,"GUANAJUATO","REDA870319HH9","REDA870319HGTGVR03","ARTURO REGALADO DAVILA",null,null,null,null,null,null,null,null,"X",null,null,null,null,null,null,null,null,null,null,2741.6]
[null,"GUANAJUATO","RERE660715NDA","RERE660715HGTYMN06","ENRIQUE REYES ROMERO",null,null,null,null,null,null,null,null,"X",null,null,null,null,null,null,null,null,null,null,95940.459999999992]
[null,"GUANAJUATO","RICE740107C14","RICE740107MGTVSR06","  ERIKA ADRIANA RIVERA CISNEROS   ",null,null,null,null,null,null,null,null,"X",null,null,null,null,null,null,null,null,null,null,221119.33999999988]
[null,"GUANAJUATO","RICM7009187Q5","RICM700918HGTVSG07","MIGUEL ANGEL RIVERA CISNEROS",null,null,null,null,null,null,null,null,"X",null,null,null,null,null,null,null,null,null,null,4126.95]
[null,"GUANAJUATO","RIMF850611721","RIMF850611MGTNJB09","FABIOLA RINCON  MOJICA",null,null,null,null,null,null,null,null,"X",null,null,null,null,null,null,null,null,null,null,10388.73]
[null,"GUANAJUATO","RIRG760502K16","RIRG760502MGTVDW04","GWENDOLYNE ERENDIRA RIVAS RODRIGUEZ",null,null,null,null,null,null,null,null,"X",null,null,null,null,null,null,null,null,null,null,19860.600000000002]
[null,"GUANAJUATO","RISA740722842","RISA740722MGTCNL08","ALEJANDRA  RICALDE  SANCHEZ ",null,null,null,null,null,null,null,null,"X",null,null,null,null,null,null,null,null,null,null,68411.489999999991]
[null,"GUANAJUATO","ROAA890923NX1","ROAA890923MGTMLR00","ARACELI ROMERO ALDERETE",null,null,null,null,null,null,null,null,"X",null,null,null,null,null,null,null,null,null,null,7090.8899999999994]
[null,"GUANAJUATO","ROCC7912019U3","ROCC791201HGTDHS03","CESAR ADRIAN RODRIGUEZ CHAVEZ",null,null,null,null,null,null,null,null,"X",null,null,null,null,null,null,null,null,null,null,43862.91]
[null,"GUANAJUATO","ROEL820326QF8","ROEL820326MGTCSZ05","MARIA DE LA LUZ ROCHA  ESCOBAR ",null,null,null,null,null,null,null,null,"X",null,null,null,null,null,null,null,null,null,null,95850.16]
[null,"GUANAJUATO","ROHO780227K98","ROXH780227MGTCXN02","HONORINA PAOLA * ROCHA",null,null,null,null,null,null,null,null,"X",null,null,null,null,null,null,null,null,null,null,7683.35]
[null,"GUANAJUATO","ROJL7510077S9","ROJL751007MGTJMR17","LAURA MARICELA ROJAS JIMENEZ",null,null,null,null,null,null,null,null,"X",null,null,null,null,null,null,null,null,null,null,37342.199999999997]
[null,"GUANAJUATO","ROLM821117536","ROLM821117HGTDPN05","MANUEL CHRISTIAN JARED RODRIGUEZ  LOPEZ",null,null,null,null,null,null,null,null,"X",null,null,null,null,null,null,null,null,null,null,74201.940000000031]
[null,"GUANAJUATO","ROMR620310CS2","ROMR620310MDFMNC01","ROCÍO ROMERO MENA",null,null,null,null,null,null,null,null,"X",null,null,null,null,null,null,null,null,null,null,62195]
[null,"GUANAJUATO","RONE740321QJ6","RONE740321MGTJTS01","MARIA ESTHER ROJAS NIETO",null,null,null,null,null,null,null,null,"X",null,null,null,null,null,null,null,null,null,null,31118.5]
[null,"GUANAJUATO","ROQJ571205C63","ROQJ571205HGTBNV03","JAVIER ROBLES QUINTANILLA",null,null,null,null,null,null,null,null,"X",null,null,null,null,null,null,null,null,null,null,49304.709999999992]
[null,"GUANAJUATO","RORE431022TB0","RORE431022HGTDMD08","EDILBERTO RODRIGUEZ ROMERO",null,null,null,null,null,null,null,null,"X",null,null,null,null,null,null,null,null,null,null,13336.5]
[null,"GUANAJUATO","RORJ620506HP8","RORJ620506HTLDMN05","JUAN RODRIGUEZ ROMERO",null,null,null,null,null,null,null,null,"X",null,null,null,null,null,null,null,null,null,null,24649.600000000002]
[null,"GUANAJUATO","RORL820606UU0","RORL820606HGTDBS06","LUIS FERNANDO RODRIGUEZ ROBLES",null,null,null,null,null,null,null,null,"X",null,null,null,null,null,null,null,null,null,null,4445.5]
[null,"GUANAJUATO","RORL860709G29","RORL860709MGTDML06","LILIA BERENICE RODRIGUEZ RAMIREZ",null,null,null,null,null,null,null,null,"X",null,null,null,null,null,null,null,null,null,null,3255.65]
[null,"GUANAJUATO","RORM440730KM9","RORM440730HGTDYR01","MARGARITO RODRIGUEZ REYES",null,null,null,null,null,null,null,null,"X",null,null,null,null,null,null,null,null,null,null,48102.48]
[null,"GUANAJUATO","RORM6503108B9","RORM650310MGTSDL03","MILAGROS ROSAS RODRIGUEZ",null,null,null,null,null,null,null,null,"X",null,null,null,null,null,null,null,null,null,null,28280]
[null,"GUANAJUATO","ROVA6201238U9","ROVA620123HGTDGL01","ALFONSO RODRIGUEZ VEGA",null,null,null,null,null,null,null,null,"X",null,null,null,null,null,null,null,null,null,null,79476.25]
[null,"GUANAJUATO","ROZA8409121VA","ROZA840912MGTDXL02","ALMA ROSARIO RODRIGUEZ ZUÑIGA",null,null,null,null,null,null,null,null,"X",null,null,null,null,null,null,null,null,null,null,2926.58]
[null,"GUANAJUATO","ROZS831101KUA","ROZS831101MMNSVN07","SANDRA ROSAS ZAVALA",null,null,null,null,null,null,null,null,"X",null,null,null,null,null,null,null,null,null,null,3656.63]
[null,"GUANAJUATO","RUBS800124TR0","RUBS800124HGTZRL06","SAUL RUIZ BERBENA",null,null,null,null,null,null,null,null,"X",null,null,null,null,null,null,null,null,null,null,17061.559999999998]
[null,"GUANAJUATO","RUDJ780213NV6","RUDJ780213HGTZZN04","JUAN CARLOS RUIZ DIAZ",null,null,null,null,null,null,null,null,"X",null,null,null,null,null,null,null,null,null,null,92388.73000000001]
[null,"GUANAJUATO","RURL700528JKA","RURL700528MGTZDZ03","LUZ MARIA RUIZ RODRIGUEZ",null,null,null,null,null,null,null,null,"X",null,null,null,null,null,null,null,null,null,null,58927.98]
[null,"GUANAJUATO","SACF740918BK7","SACF740918HJCNML11","FELIX SANCHEZ CAMPOS",null,null,null,null,null,null,null,null,"X",null,null,null,null,null,null,null,null,null,null,51990.119999999974]
[null,"GUANAJUATO","SACG751101985","SACG751101HDFNRR03","GERARDO JAVIER SANCHEZ CARRANZA",null,null,null,null,null,null,null,null,"X",null,null,null,null,null,null,null,null,null,null,11337.75]
[null,"GUANAJUATO","SACM860807000","SACM860807HGTMMN00","JOSE MANUEL SAMANO CAMARGO",null,null,null,null,null,null,null,null,"X",null,null,null,null,null,null,null,null,null,null,12952.95]
[null,"GUANAJUATO","SADF620323P95","SADF620323HDGNVD00","FIDEL SANCHEZ DAVILA",null,null,null,null,null,null,null,null,"X",null,null,null,null,null,null,null,null,null,null,29230.95]
[null,"GUANAJUATO","SAGJ781103MJ3","SAGJ781103HGTLRR06","JORGE ARMANDO SALAS GUARDADO",null,null,null,null,null,null,null,null,"X",null,null,null,null,null,null,null,null,null,null,20798.099999999999]
[null,"GUANAJUATO","SAMC7308072M6","SAMC730807MGTNRR25","MA. DEL CARMEN SANCHEZ MORENO",null,null,null,null,null,null,null,null,"X",null,null,null,null,null,null,null,null,null,null,18487.2]
[null,"GUANAJUATO","SAMJ8108157T3","SAMJ810815HGTNTR06","JORGE ADRIAN SANCHEZ MATEHUALA",null,null,null,null,null,null,null,null,"X",null,null,null,null,null,null,null,null,null,null,5342.65]
[null,"GUANAJUATO","SAMM791219U15","SAMM791219MGTVDG08","MARIA MAGDALENA SAAVEDRA MEDRANO",null,null,null,null,null,null,null,null,"X",null,null,null,null,null,null,null,null,null,null,7262.2]
[null,"GUANAJUATO","SAMR641029MF0","SAMR641029HGTMNB09","ROBERTO SANTOYO MENDOZA",null,null,null,null,null,null,null,null,"X",null,null,null,null,null,null,null,null,null,null,83544]
[null,"GUANAJUATO","SAPG841029F61","SAPG841029HGTNRD01","JOSE GUADALUPE SANDOVAL PEREZ",null,null,null,null,null,null,null,null,"X",null,null,null,null,null,null,null,null,null,null,11359.98]
[null,"GUANAJUATO","SAPJ7305052R5","SAPJ730505HGTNRN06","JUAN CARLOS SANCHEZ PEREZ",null,null,null,null,null,null,null,null,"X",null,null,null,null,null,null,null,null,null,null,4621.8]
[null,"GUANAJUATO","SAPR691204HS9","SAPR691204MGTNRS09","ROSA ELIA SANDOVAL PRADO",null,null,null,null,null,null,null,null,"X",null,null,null,null,null,null,null,null,null,null,70097.299999999988]
[null,"GUANAJUATO","SARP720603511","SARP720603HGTNMD03","PEDRO SANCHEZ RAMIREZ",null,null,null,null,null,null,null,null,"X",null,null,null,null,null,null,null,null,null,null,31784]
[null,"GUANAJUATO","SATE820405F51","SATE820405MGTNRV00","EVA MARIA DEL ROSARIO SANCHEZ TURRUBIARTES",null,null,null,null,null,null,null,null,"X",null,null,null,null,null,null,null,null,null,null,49490]
[null,"GUANAJUATO","SATJ701026RC3","SATJ701026HGTNFS09","JOSE SANCHEZ TAFOYA",null,null,null,null,null,null,null,null,"X",null,null,null,null,null,null,null,null,null,null,20004.780000000002]
[null,"GUANAJUATO","SAVE451129SN8","SAVE451129HGTLRL03","ELIGIO SALGADO VARGAS",null,null,null,null,null,null,null,null,"X",null,null,null,null,null,null,null,null,null,null,24302.099999999995]
[null,"GUANAJUATO","SIPH640527P81","SIPH640527HGTRRG09","HUGO EVERARDO  SIERRA  PARADA ",null,null,null,null,null,null,null,null,"X",null,null,null,null,null,null,null,null,null,null,73128.510000000009]
[null,"GUANAJUATO","SOAE851129KH7","SOAE851129MGTTCS09","ESPERANZA SOTO ACEVEDO",null,null,null,null,null,null,null,null,"X",null,null,null,null,null,null,null,null,null,null,15406]
[null,"GUANAJUATO","SOAO850607U46","SOAO850607HGGTGM04","OMAR DAVID SOTO AGUIRRE",null,null,null,null,null,null,null,null,"X",null,null,null,null,null,null,null,null,null,null,12396.9]
[null,"GUANAJUATO","SOGE770916E73","SOGE770916MDFLNL08","MARIA ELENA SOLIS GONZALEZ",null,null,null,null,null,null,null,null,"X",null,null,null,null,null,null,null,null,null,null,10224.66]
[null,"GUANAJUATO","SOGY851206464","SOGY851206MMNSZN01","YANETH SOSA GUZMÁN",null,null,null,null,null,null,null,null,"X",null,null,null,null,null,null,null,null,null,null,20220.410000000003]
[null,"GUANAJUATO","SOMJ5508087H2","SOMJ550808MGTTRN02","JUANA SOTO MORAN",null,null,null,null,null,null,null,null,"X",null,null,null,null,null,null,null,null,null,null,105146.08000000003]
[null,"GUANAJUATO","SOSP630208MC6","SOSP630208HGTTCD07","PEDRO SOTO SAUCEDO",null,null,null,null,null,null,null,null,"X",null,null,null,null,null,null,null,null,null,null,35131.109999999993]
[null,"GUANAJUATO","SUCG780821BZ7","SUCG780821HGTRSL03","GUILLERMO SUÁREZ CASTRO",null,null,null,null,null,null,null,null,"X",null,null,null,null,null,null,null,null,null,null,49756]
[null,"GUANAJUATO","TAGL820524R17","TAGL820524MGTPMZ06"," MARIA DE LA LUZ TAPIA GOMEZ     ",null,null,null,null,null,null,null,null,"X",null,null,null,null,null,null,null,null,null,null,75197.72]
[null,"GUANAJUATO","TEAC711130CQ2","TEAC711130MGTJDL00","CLAUDIA ELENA TEJEDA ADAME",null,null,null,null,null,null,null,null,"X",null,null,null,null,null,null,null,null,null,null,17115.210000000003]
[null,"GUANAJUATO","TEAR801024C6A","TEAR801024MGTJDS18","ROSA BEATRIZ TEJEDA ADAME",null,null,null,null,null,null,null,null,"X",null,null,null,null,null,null,null,null,null,null,40440.82]
[null,"GUANAJUATO","TIEA7005021TA","TIEA700502MDFHSN02"," ANGELICA THIRION ESCUDER  ",null,null,null,null,null,null,null,null,"X",null,null,null,null,null,null,null,null,null,null,143591.24]
[null,"GUANAJUATO","TITC671201BBA","TITC671201HMNNNR07","CRESCENCIANO TINOCO TINOCO",null,null,null,null,null,null,null,null,"X",null,null,null,null,null,null,null,null,null,null,17950]
[null,"GUANAJUATO","TOAB770225NZ9","TOAB770225MGTRRR00","BERENICE TORRES ARROYO",null,null,null,null,null,null,null,null,"X",null,null,null,null,null,null,null,null,null,null,30931.25]
[null,"GUANAJUATO","TOLJ711229Q89","TOLJ711229HGTRPV00","JAVIER TORRES LOPEZ",null,null,null,null,null,null,null,null,"X",null,null,null,null,null,null,null,null,null,null,31118.5]
[null,"GUANAJUATO","TOVJ770823IY6","TOVJ770823HGTRRM05","JUAN MANUEL TORRES  VERA",null,null,null,null,null,null,null,null,"X",null,null,null,null,null,null,null,null,null,null,73263]
[null,"GUANAJUATO","UIRA650703JZ5","UIRA650703MDFRML07"," MARIA ALEJANDRA URIBE RAMIREZ  ",null,null,null,null,null,null,null,null,"X",null,null,null,null,null,null,null,null,null,null,115583]
[null,"GUANAJUATO","VAAJ751004U60","VAAJ751004MGTLRN04","JUANA YANET VALDEZ ARGUELLO",null,null,null,null,null,null,null,null,"X",null,null,null,null,null,null,null,null,null,null,5007.88]
[null,"GUANAJUATO","VAFI6312015P7","VAFI631201MGTRLR02","IRMA VARGAS  FLORES",null,null,null,null,null,null,null,null,"X",null,null,null,null,null,null,null,null,null,null,46677.78]
[null,"GUANAJUATO","VAGC680720SK4","VAGC680720MDFZTL03","CLAUDIA IVONNE VAZQUEZ GUTIERREZ",null,null,null,null,null,null,null,null,"X",null,null,null,null,null,null,null,null,null,null,3656.63]
[null,"GUANAJUATO","VALS820325LX7","VALS820325MGTLNL09","SILVIA NANCY VALADEZ LEON",null,null,null,null,null,null,null,null,"X",null,null,null,null,null,null,null,null,null,null,114705.57]
[null,"GUANAJUATO","VAMG850109N64","VAMG850109MBSZNB01","GABRIELA VAZQUEZ MONJARAZ",null,null,null,null,null,null,null,null,"X",null,null,null,null,null,null,null,null,null,null,36396.71]
[null,"GUANAJUATO","VAMM770825UBA","VAMM770825HGTLLG05","JOSE MIGUEL VALDEZ MALDONADO",null,null,null,null,null,null,null,null,"X",null,null,null,null,null,null,null,null,null,null,55696]
[null,"GUANAJUATO","VASD820426CR9","VASD820426HGTRTV05","DAVID VARGAS SOTO",null,null,null,null,null,null,null,null,"X",null,null,null,null,null,null,null,null,null,null,27811]
[null,"GUANAJUATO","VASR930322QX5","VASR930322HGTLGL04","RAUL VALDIVIA SEGOVIANO",null,null,null,null,null,null,null,null,"X",null,null,null,null,null,null,null,null,null,null,1390.84]
[null,"GUANAJUATO","VASY830412F80","VASY830412MMMLNN08","YUNNUEN VALENZUELA SANCHEZ",null,null,null,null,null,null,null,null,"X",null,null,null,null,null,null,null,null,null,null,8002.1400000000012]
[null,"GUANAJUATO","VAWS480907T05","VAWS480907MDFRSY01","SILVIA VARGAS WASHINGTON",null,null,null,null,null,null,null,null,"X",null,null,null,null,null,null,null,null,null,null,13798.02]
[null,"GUANAJUATO","VEFF790430A24","VEFF790430MGTNLT05","FATIMA NOHEMI VENEGAS FLORES",null,null,null,null,null,null,null,null,"X",null,null,null,null,null,null,null,null,null,null,15582.18]
[null,"GUANAJUATO","VEMJ891002000","VEMJ891002HGTLÑN02","JUAN MANUEL VELAZQUEZ MUÑOZ",null,null,null,null,null,null,null,null,"X",null,null,null,null,null,null,null,null,null,null,2519.5]
[null,"GUANAJUATO","VESE620331G87","VESE620331HGTRLF03","EFREN VERA SALGADO",null,null,null,null,null,null,null,null,"X",null,null,null,null,null,null,null,null,null,null,19569.440000000002]
[null,"GUANAJUATO","VESJ58011884A","VESJ580118HGTGNN01","JUAN CARLOS VEGA SANCHEZ",null,null,null,null,null,null,null,null,"X",null,null,null,null,null,null,null,null,null,null,28280]
[null,"GUANAJUATO","VESX850703GKA","VESX850703MGTLLC16","XOCHITL TOMASA VELÁZQUEZ SILVA",null,null,null,null,null,null,null,null,"X",null,null,null,null,null,null,null,null,null,null,28786.800000000003]
[null,"GUANAJUATO","VEVS430308H18","VEVS430308MGTRLL04","MA SOLEDAD VERA VALTIERRA",null,null,null,null,null,null,null,null,"X",null,null,null,null,null,null,null,null,null,null,5112.33]
[null,"GUANAJUATO","VIBM750212ED8","VIBM750212MDFLRN06","MONICA VILCHIS BARCENAS",null,null,null,null,null,null,null,null,"X",null,null,null,null,null,null,null,null,null,null,4814.38]
[null,"GUANAJUATO","VIBM7702283A2","VIBM770228HDFLRR01","MAURICIO VILCHIS BARCENAS ",null,null,null,null,null,null,null,null,"X",null,null,null,null,null,null,null,null,null,null,186480.05999999982]
[null,"GUANAJUATO","VIMC900724PHA","VIMC900724MGTLNR08","MARIA CRISTINA VILLAGOMEZ MONTES",null,null,null,null,null,null,null,null,"X",null,null,null,null,null,null,null,null,null,null,2742.47]
[null,"GUANAJUATO","VIMU840526EL5","VIMU840526HDFLRR00","URIEL ALEJANDRO VILLÁGOMEZ MARTÍNEZ",null,null,null,null,null,null,null,null,"X",null,null,null,null,null,null,null,null,null,null,40440.75]
[null,"GUANAJUATO","VIRD850905EA2","VIRD850905MGTLDY04","DEYSI VILLANUEVA RODRIGUEZ",null,null,null,null,null,null,null,null,"X",null,null,null,null,null,null,null,null,null,null,54456.360000000008]
[null,"GUANAJUATO","VITF791111L77","VITF791111HGTLVR01","FRANCISCO VILLAFAÑA  TAVERA",null,null,null,null,null,null,null,null,"X",null,null,null,null,null,null,null,null,null,null,24682.230000000003]
[null,"GUANAJUATO","VIZM6610296H8","VIZM661029MMNLRN03","MONICA VILLAGOMEZ  ZARATE",null,null,null,null,null,null,null,null,"X",null,null,null,null,null,null,null,null,null,null,28605.599999999999]
[null,"GUANAJUATO","ZABA871015J40","ZABA871015HGTRCM04","AMANDO ZARAZUA BECERRA",null,null,null,null,null,null,null,null,"X",null,null,null,null,null,null,null,null,null,null,1972.44]
[null,"GUANAJUATO","ZAGG741211FF0","ZAGG741211MMNCND04","MARIA GUADALUPE ZACARIAS GONZALEZ",null,null,null,null,null,null,null,null,"X",null,null,null,null,null,null,null,null,null,null,29733.119999999995]
[null,"GUANAJUATO","ZAHR840210PN9","ZAHR840210HGTVRD05","RODOLFO ANTONIO ZAVALA HERNANDEZ",null,null,null,null,null,null,null,null,"X",null,null,null,null,null,null,null,null,null,null,44487.940000000017]
[null,"GUANAJUATO","ZAMD580804XH2","ZAMD580804HGTRRV01","DAVID ZARAGOZA MARTINEZ",null,null,null,null,null,null,null,null,"X",null,null,null,null,null,null,null,null,null,null,23838]
[null,"GUANAJUATO","ZAMJ740416EMO","ZAMJ740416HDFMXR00","JORGE ZAMORA MUÑIZ",null,null,null,null,null,null,null,null,"X",null,null,null,null,null,null,null,null,null,null,45832.849999999991]
[null,"GUANAJUATO","ZAPJ830703848","ZAPJ830703HGTMRN07","JUAN MARCIAL ZAMUDIO PEREZ",null,null,null,null,null,null,null,null,"X",null,null,null,null,null,null,null,null,null,null,42083.37000000001]
[null,"GUANAJUATO","ZARG760122LM0","ZARG760122MGTRDR05","  GRACIELA ZARAGOZA RODRIGUEZ ",null,null,null,null,null,null,null,null,"X",null,null,null,null,null,null,null,null,null,null,95368]
[null,"GUANAJUATO","ZARI821025R29","ZARI821025MGTRBG09","MARIA IGNACIA ZARAZUA  RUBIO ",null,null,null,null,null,null,null,null,"X",null,null,null,null,null,null,null,null,null,null,40440.82]
[null,"GUANAJUATO","ZASJ710817C96","ZASJ710817MGTVLL06","JULIA XIOMARA ZAVALA SALAS",null,null,null,null,null,null,null,null,"X",null,null,null,null,null,null,null,null,null,null,21338.399999999998]
[null,"GUANAJUATO","ZAVN851206BB5","ZAVN851206MGTMLR06","NORMA ANGELICA ZAMUDIO VILLALOBOS",null,null,null,null,null,null,null,null,"X",null,null,null,null,null,null,null,null,null,null,14870.239999999998]
[null,"GUANAJUATO","ZAZA820724CP3","ZAZA820724MGTVML06","ALMA CRISTINA ZAVALA ZAMUDIO",null,null,null,null,null,null,null,null,"X",null,null,null,null,null,null,null,null,null,null,1828.31]
[null,"Total Personas : ",919,null,null,null,null,null,null,null,null,null,null,null,null,null,null,null,null,null,null,"Total Recursos Ejercidos:",null,null,{"$f":"SUBTOTAL(109,Tabla11[Total de recursos presupuestales ejercidos en servicios personales en el periodo\n(2)])","v":44568149.409999989}]
[]
[null,"Fuente : Información proporcionada por las Entidades Federativas."]

{"sheet":"II C y 1_","index":5,"n_rows":940,"n_cols":22,"rows_kept":940,"cut":false,"hidden":false,"merged":[[934,18,934,19],[11,6,12,6],[11,7,12,7],[11,18,11,19],[11,3,12,3],[11,4,12,4],[8,1,8,8],[11,1,12,1],[11,2,12,2],[11,5,12,5],[11,20,12,20],[11,21,12,21],[11,8,12,8],[11,9,11,15],[11,16,12,16],[11,17,12,17]]}
[]
[]
[]
[]
[]
[]
[]
[null,"Formato: Personal Federalizado por Registro Federal de Contribuyentes"]
[null,{"$f":"IF('Caratula Resumen'!D22=\"Elige el Periodo…\",\"\",'Caratula Resumen'!D22)","v":"Fondo de Aportaciones para la Educación Tecnológica y de Adultos/Colegio Nacional de Educación Profesional Técnica (FAETA/CONALEP)"},null,null,null,null,null,null,null,null,null,null,null,null,null,null,null,null,null,null,{"$f":"IF('Caratula Resumen'!D23=\"Elige el Periodo…\",\"\",'Caratula Resumen'!D23)","v":"3er. Trimestre"}]
[null,null,null,null,null,null,null,null,null,null,null,null,null,null,null,null,null,null,null,null,"3er. Trimestre 2016"]
[]
[null,"Entidad Federativa","Clave CT","Turno","RFC","CURP","Nombre","Funcion Real","Horas que labora en el Centro de Trabajo","Clave Presupuestal",null,null,null,null,null,null,"Tipo de Categoría","Identificador de Contrato de Honorarios","Periodo de efecto de pago en el trimestre",null,"Percepciones pagadas en el Periodo de Comisión con Presupuesto Federal*","Percepciones pagadas en el Periodo de Comisión con Presupuesto de otra fuente*"]
[null,null,null,null,null,null,null,null,null,"Partida Presupuestal","Código de Pago","Clave de Unidad","Clave de Sub Unidad","Clave de Categoría","Horas Semana Mes ","Número de Plaza",null,null,"Inicial","Termino"]
[]
[null,"Entidad Federativa","Clave CT","Turno","RFC","CURP","Nombre","Funcion Real","Horas que labora en el Centro de Trabajo","Partida Presupuestal","Código de Pago","Clave de Unidad","Clave de Sub Unidad","Clave de Categoría","Horas semana mes","Número de plaza","Tipo de Categoría","Identificador de Contrato de Honorarios","Periodo de efecto de pago en el trimestre\nInicial","Periodo de efecto de pago en el trimestre\nTermino","Percepciones pagadas en el Periodo de Comisión con Presupuesto Federal*","Percepciones pagadas en el Periodo de Comisión con Presupuesto de otra fuente*"]
[null,"GUANAJUATO","11DPT0011X",120,"AABC680116196","AABC680116MMCBNL09","CLAUDIA CECILIA D ABDALA BUENDIA        ",null,0,1130,1003,2,49,"S01202",0,7692,null,null,20160701,20160930,38536.050000000003,0]
[null,"GUANAJUATO","11DPT0009I",120,"AABC720527RL6","AABC720527HGTLRR03","CARLOS ALVARADO BARRIOS                 ",null,0,1130,1003,1,74,"S01201",0,8081,null,null,20160701,20160930,39411.42,0]
[null,"GUANAJUATO","11DPT0004N",120,"AACG691218L13","AACG691218MMNLSR08","GRACIELA ALVAREZ CASTRO                 ",null,0,1130,1003,1,28,"A03202",0,6496,null,null,20160701,20160930,45262.55999999999,0]
[null,"GUANAJUATO","11DPT0014U",120,"AALA880119VB9","AALA880119MGTLPL06","ALESSA ALVARADO LOPEZ                   ",null,0,1130,1003,3,3,"A01801",0,18884,null,null,20160701,20160930,40706.089999999997,0]
[null,"GUANAJUATO","11DPT0006L",120,"AALS670904235","AALS670904MGTNPL09","SILVIA ANAYA LOPEZ                      ",null,0,1130,1003,1,63,"CF33204",0,7715,null,null,20160701,20160930,74980.5,0]
[null,"GUANAJUATO","11APT0001T",100,"AAMD810413AX8","AAMD810413MGTNRN03","DIANA LORENA ANAYA MARTINEZ             ",null,0,1130,1003,7,5,"CF04201",0,11092,null,null,20160701,20160930,40176.79,0]
[null,"GUANAJUATO","11DPT0011X",120,"AAMR650620AB4","AAMR650620HGTLGB03","ROBERTO ALVARADO MAGAÐA                 ",null,0,1130,1003,2,49,"CF19201",0,10606,null,null,20160701,20160930,42622.3,0]
[null,"GUANAJUATO","11DPT0011X",120,"AAMR671130JR0","AAMR671130HGTLGB00","RUBEN ALVARADO MAGANA                   ",null,0,1130,1003,2,49,"S01201",0,10613,null,null,20160701,20160930,34489.46,0]
[null,"GUANAJUATO","11DPT0006L",120,"AARL760126331","AARL760126HGTLMN14","LEONARDO ISRAEL ALVAREZ ROMO            ",null,0,1130,1003,1,63,"CF04201",0,7691,null,null,20160701,20160930,38499.020000000004,0]
[null,"GUANAJUATO","11DPT0002P",120,"AARM7802157H4","AARM780215MGTLDY03","MYRIAM DEL ROSAR ALVARADO RODRIGUEZ     ",null,0,1130,1003,0,29,"S01201",0,11909,null,null,20160701,20160930,29496.720000000001,0]
[null,"GUANAJUATO","11DPT0001Q",120,"AATE760606N24","AATE760606MGTLNV03","EVA ALMANZA TINOCO                      ",null,0,1130,1003,0,28,"S01202",0,9252,null,null,20160701,20160930,35808.25,0]
[null,"GUANAJUATO","11DPT0008J",120,"AEAC630530Q21","AEAC630530MGTLLN08","MA. CONCEPCION ALEJOS ALONSO            ",null,0,1130,1003,2,33,"CF33204",0,10196,null,null,20160701,20160930,77805.47,0]
[null,"GUANAJUATO","11DPT0011X",120,"AECJ7908035L8","AECJ790803HGTLRS03","JOSE JESUS ALEJO CARRENO                ",null,0,1130,1003,2,49,"S01201",0,10594,null,null,20160701,20160930,34110.689999999995,0]
[null,"GUANAJUATO","11APT0001T",100,"AECL710621SE4","AECL710621HGTRRS02","JOSE LUIS ARELLANO CRUZ                 ",null,0,1130,1003,5,13,"A03202",0,10301,null,null,20160701,20160930,35472.89,0]
[null,"GUANAJUATO","11DPT0011X",120,"AECM720103NB9","AECM720103MGTLRR09","MARCELA ALEJO CARREÐO                   ",null,0,1130,1003,2,49,"CF33206",0,14056,null,null,20160701,20160930,115172.13999999998,0]
[null,"GUANAJUATO","11DPT0003O",120,"AEGJ5311191A4","AEGJ531119HGTSRR09","JORGE ASCENCIO GARCIA                   ",null,0,1130,1003,0,30,"S01202",0,2650,null,null,20160701,20160930,41129.57,0]
[null,"GUANAJUATO","11DPT0006L",120,"AERG571209NWA","AERG571209HGTRML09","GILBERTO ARREOLA ROMERO                 ",null,0,1130,1003,1,63,"S01202",0,7707,null,null,20160701,20160930,36733.21,0]
[null,"GUANAJUATO","11DPT0003O",120,"AETA880105TQ0","AETA880105HGTCNN01","ANTONIO ACEVEDO TINAJERO                ",null,0,1130,1003,0,30,"CF33206",0,13322,null,null,20160701,20160930,81171.360000000001,0]
[null,"GUANAJUATO","11APT0001T",100,"AIMK880805R10","AIMK880805MGTRXR05","KARLA GABRIELA ARIAS MUÐOZ              ",null,0,1130,1003,5,13,"CF33206",0,14142,null,null,20160701,20160930,79325.260000000009,0]
[null,"GUANAJUATO","11DPT0011X",120,"AOFA670123A81","AOFA670123MGTBLD06","ADRIANA DEL CARM ABONCE FLORES          ",null,0,1130,1003,2,49,"CF33206",0,14057,null,null,20160701,20160930,91057.670000000013,0]
[null,"GUANAJUATO","11APT0001T",100,"AOGI790809G38","AOGI790809MGTLRM04","IMELDA SUSANA ALONSO GARCIA             ",null,0,1130,1003,5,13,"CF33204",0,4416,null,null,20160701,20160930,73645.680000000008,0]
[null,"GUANAJUATO","11DPT0007K",120,"AOLJ820429DY4","AOLJ820429HGTCPL06","JOEL ADOLFO ACOSTA LOPEZ                ",null,0,1130,1003,2,3,"S01201",0,9192,null,null,20160701,20160930,30948.15,0]
[null,"GUANAJUATO","11DPT0003O",120,"AOVP751006KA9","AOVP751006MGTLLL04","MA. DEL PILAR ALMONACI VALADEZ          ",null,0,1130,1003,0,30,"CF33204",0,2518,null,null,20160701,20160930,83651.180000000008,0]
[null,"GUANAJUATO","11DPT0001Q",120,"AUDM660425P52","AUDM660425MGTGRR18","MIRIAM AGUILAR DURON                    ",null,0,1130,1003,0,28,"CF33206",0,12913,null,null,20160701,20160930,121876.91,0]
[null,"GUANAJUATO","11DPT0004N",120,"AUPM640422KR2","AUPM640422HGTGLR03","MARTIN AGUIRRE PALMERIN                 ",null,0,1130,1003,1,28,"S01201",0,6502,null,null,20160701,20160930,42266.48,0]
[null,"GUANAJUATO","11APT0001T",100,"BACJ850923PQ8","BACJ850923HGTRS05","CORNEJO BARCENAS JESUS OMAR ",null,0,1130,1003,5,13,"CF02105",0,14598,null,null,20160701,20160930,12017.11,0]
[null,"GUANAJUATO","11DPT0001Q",120,"BACM8402274W0","BACM840227HGTRNG03","MIGUEL ANGEL BARRON CONEJO              ",null,0,1130,1003,0,28,"CF33206",0,12911,null,null,20160701,20160930,83173.850000000006,0]
[null,"GUANAJUATO","11DPT0011X",120,"BAGJ5004309G9","BAGJ500430HGTRRR03","JORGE BARRERA GARCIA                    ",null,0,1130,1003,2,49,"CF18201",0,10593,null,null,20160701,20160930,40543.07,0]
[null,"GUANAJUATO","11DPT0011X",120,"BAGS470901EG4","BAGS470901MGTRRL03","SILVIA BARRERA GARCIA                   ",null,0,1130,1003,2,49,"S01202",0,10616,null,null,20160701,20160930,42865.62000000001,0]
[null,"GUANAJUATO","11DPT0012W",120,"BAHC790225T34","BAHC790225HGTSRS06","CESAR ISRRAEL BASALDUA HERNANDEZ        ",null,0,1130,1003,4,2,"CF18201",0,9301,null,null,20160701,20160930,22421.64,0]
[null,"GUANAJUATO","11DPT0008J",120,"BAJR800429CA7","BAJR800429MGTLRC00","ROCIO BALDERAS JUAREZ                   ",null,0,1130,1003,2,33,"T08201",0,770,null,null,20160701,20160930,46175.58,0]
[null,"GUANAJUATO","11DPT0013V",120,"BAMJ651013MA3","BAMJ651013HGTRRN08","JUAN PEDRO BARBOSA MORALES              ",null,0,1130,1003,3,2,"CF33206",0,18850,null,null,20160701,20160930,83173.850000000006,0]
[null,"GUANAJUATO","11DPT0007K",120,"BAPA711019KLA","BAPA711019MGTRRN03","ANA LOURDES BARAJAS PEREZ               ",null,0,1130,1003,2,3,"CF33204",0,3880,null,null,20160701,20160930,79548.92,0]
[null,"GUANAJUATO","11DPT0005M",120,"BAQL620315PN5","BAQL620315HGTRRS00","LUIS MANUEL BRAVO QUIROZ                ",null,0,1130,1003,0,72,"CF33206",0,13773,null,null,20160701,20160930,115544.66999999998,0]
[null,"GUANAJUATO","11DPT0008J",120,"BARJ8305267S1","BARJ830526HGTRYN02","JUAN ANGEL BRAVO REYES                  ",null,0,1130,1003,2,33,"CF33206",0,13503,null,null,20160701,20160930,82388.97,0]
[null,"GUANAJUATO","11DPT0005M",120,"BASS600608U7A","BASS600608MGTRRL08","MARIA SOLEDAD ROS BRAVO SERRANO         ",null,0,1130,1003,0,72,"CF19201",0,4426,null,null,20160701,20160930,45148.36,0]
[null,"GUANAJUATO","11DPT0010Y",120,"BAUM780104T8A","BAUM780104MGTRRC01","MICAELA BARCENAS URBINA                 ",null,0,1130,1003,2,4,"S01201",0,2514,null,null,20160701,20160930,43306.33,0]
[null,"GUANAJUATO","11DPT0001Q",120,"BAUR7105213K8","BAUR710521MDFRRT02","RITA BARCENAS URBINA                    ",null,0,1130,1003,0,28,"A03202",0,2495,null,null,20160701,20160930,48839.169999999991,0]
[null,"GUANAJUATO","11DPT0001Q",120,"BEEJ790327230","BEEJ790327HGTLSN06","JUAN GUSTAVO BELMAN ESPINOSA            ",null,0,1130,1003,0,28,"S01202",0,2512,null,null,20160701,20160930,33571.24,0]
[null,"GUANAJUATO","11DPT0002P",120,"BERC880813NK7","BERC880813MGTLMN05","CINDIA ELIZABETH BELTRAN RAMOS          ",null,0,1130,1003,0,29,"CF33202",0,2592,null,null,20160701,20160930,41141.42,0]
[null,"GUANAJUATO","11DPT0003O",120,"BUSG720302VE9","BUSG720302MGTLND02","MA. GUADALUPE BULLONS SANTIAGO          ",null,0,1130,1003,0,30,"A03202",0,9164,null,null,20160701,20160930,38693.479999999996,0]
[null,"GUANAJUATO","11DPT0008J",120,"CAAO740517PC6","CAAO740517HGTMRC05","OCTAVIANO CAMPOS ARRIAGA                ",null,0,1130,1003,2,33,"CF33204",0,2522,null,null,20160701,20160930,76902.860000000015,0]
[null,"GUANAJUATO","11DPT0003O",120,"CACF600221UD2","CACF600221HSPMSR07","FORTUNATO CAMACHO CASTILLO              ",null,0,1130,1003,0,30,"S01201",0,2618,null,null,20160701,20160930,31988.15,0]
[null,"GUANAJUATO","11DPT0007K",120,"CACL650308V86","CACL650308MGTMLZ03","MA. DE LA LUZ CAMARILLO COLLAZO         ",null,0,1130,1003,2,3,"CF33206",0,10298,null,null,20160701,20160930,118403.6,0]
[null,"GUANAJUATO","11DPT0007K",120,"CADG5812029W6","CADG581202MGTHLR09","GRACIELA CHAVEZ DELGADO                 ",null,0,1130,1003,2,3,"CF21202",0,9211,null,null,20160701,20160930,48380.15,0]
[null,"GUANAJUATO","11DPT0003O",120,"CAGM670126RV9","CAGM670126MGTHNR09","MARTHA DELIA CHAVEZ GONZALEZ            ",null,0,1130,1003,0,30,"CF33206",0,13682,null,null,20160701,20160930,112773.62000000002,0]
[null,"GUANAJUATO","11DPT0011X",120,"CAGN9001041L6","CAGN900104MGTSNN06","NANCY YARETH CASILLAS GONZALEZ          ",null,0,1130,1003,2,49,"S01201",0,10614,null,null,20160701,20160930,14259.72,0]
[null,"GUANAJUATO","11DPT0005M",120,"CAGR660928KD7","CAGR660928MGTSNB07","RUBICELIA CASTRO GONZALEZ               ",null,0,1130,1003,0,72,"CF33204",0,7424,null,null,20160701,20160930,93260.23,0]
[null,"GUANAJUATO","11DPT0001Q",120,"CAGT7903078F3","CAGT790307HGTMRM01","TOMAS ESTEBAN CAMACHO GARCIA            ",null,0,1130,1003,0,28,"S01201",0,2533,null,null,20160701,20160930,31349.620000000003,0]
[null,"GUANAJUATO","11DPT0002P",120,"CAGX680903LH5","CXGA680903HGTHNL08","ALBERTO CHAO GONZALEZ                   ",null,0,1130,1003,0,29,"CF02103",0,12628,null,null,20160701,20160930,92369.4,0]
[null,"GUANAJUATO","11APT0001T",100,"CAHG600308UU9","CAHG600308HDFDRL06","GUILLERMO CAUDILLO HERRERA              ",null,0,1130,1003,5,13,"CF02105",0,14598,null,null,20160701,20160930,52344.800000000003,0]
[null,"GUANAJUATO","11APT0001T",100,"CAJU780116N75","CAXJ780116HGTMXN05","JUAN JOSE CAMACHO                       ",null,0,1130,1003,5,13,"CF33206",0,14140,null,null,20160701,20160930,88398.360000000015,0]
[null,"GUANAJUATO","11DPT0003O",120,"CALA611023U79","CALA611023MZSRZD15","ADRIANA CARDENAS LOZA                   ",null,0,1130,1003,0,30,"CF33206",0,14317,null,null,20160701,20160930,103409.27000000002,0]
[null,"GUANAJUATO","11APT0001T",100,"CALA7006204L0","CALA700620MGTMPL09","ALEJANDRA CAMACHO LOPEZ                 ",null,0,1130,1003,5,13,"CF33204",0,11710,null,null,20160701,20160930,72432.649999999994,0]
[null,"GUANAJUATO","11DPT0011X",120,"CALA880830IGA","CALA880830MGTLPD08","ADRIANA CALDERON LOPEZ                  ",null,0,1130,1003,2,49,"CF04201",0,10296,null,null,20160701,20160930,38463.589999999997,0]
[null,"GUANAJUATO","11DPT0005M",120,"CAML640420FH8","CAML640420HDFSRS06","JOSE LUIS CASILLAS MIRANDA              ",null,0,1130,1003,0,72,"CF34201",0,4394,null,null,20160701,20160930,43804.880000000005,0]
[null,"GUANAJUATO","11DPT0013V",120,"CAML820820U36","CAML820820HGTNNS09","LUIS MIGUEL CANO MENDOZA                ",null,0,1130,1003,3,2,"CF33204",0,18853,null,null,20160701,20160930,72138.500000000015,0]
[null,"GUANAJUATO","11DPT0005M",120,"CANS730714K3A","CANS730714MGTSTR04","SARA CASTILLO NIETO                     ",null,0,1130,1003,0,72,"CF04201",0,4386,null,null,20160701,20160930,48264.97,0]
[null,"GUANAJUATO","11DPT0007K",120,"CAPE530526869","CAPE530526MGTRRL07"," M.ELENA CARDIEL PEREZ                  ",null,0,1130,1003,2,3,"CF33204",0,9174,null,null,20160701,20160930,80905.33,0]
[null,"GUANAJUATO","11DPT0002P",120,"CAPR810416EKA","CAPR810416HGTLRB07","ROBERTO CALDERON PEREZ                  ",null,0,1130,1003,0,29,"CF33204",0,2560,null,null,20160701,20160930,64469.490000000005,0]
[null,"GUANAJUATO","11DPT0001Q",120,"CARM520206UK0","CARM520206HGTBCR09","MARIO CABRERA RICO                      ",null,0,1130,1003,0,28,"CF02103",0,12566,null,null,20160701,20160930,92369.4,0]
[null,"GUANAJUATO","11DPT0005M",120,"CARR771026IP3","CARR771026MDFRMS09","ROSANA CARRILLO RAMIREZ                 ",null,0,1130,1003,0,72,"CF02105",0,14597,null,null,20160701,20160930,78517.2,0]
[null,"GUANAJUATO","11DPT0002P",120,"CASI750121969","CASI750121HGTSNS13","ISAAC CASTRO SANTILLANES                ",null,0,1130,1003,0,29,"CF18203",0,2576,null,null,20160701,20160930,47753.670000000006,0]
[null,"GUANAJUATO","11DPT0007K",120,"CAUF560705QGA","CAUF560705HGTHRL05","FILOMENO CHAGOYA URRUTIA                ",null,0,1130,1003,2,3,"S01201",0,9177,null,null,20160701,20160930,39640.969999999994,0]
[null,"GUANAJUATO","11DPT0002P",120,"CAVT730609CSA","CAVT730609MGTRRR12","MA. TERESA CARPIO VARGAS                ",null,0,1130,1003,0,29,"ED01201",0,2571,null,null,20160701,20160930,39051.99,0]
[null,"GUANAJUATO","11DPT0001Q",120,"CEFS680324L40","CEFS680324HJCRLL06","SAUL CERPA FLORES                       ",null,0,1130,1003,0,28,"S01202",0,2544,null,null,20160701,20160930,36705.51,0]
[null,"GUANAJUATO","11DPT0009I",120,"CELM960313G89","CELM960313MGTRPY09","MAYRA FRANCISCA CERVANTES LOPEZ         ",null,0,1130,1003,1,74,"S01201",0,8089,null,null,20160701,20160930,31504.949999999997,0]
[null,"GUANAJUATO","11APT0001T",100,"CESA870418K76","CESA870418MGTRMN08","ANA GABRIELA CERVERA SAMANO             ",null,0,1130,1003,5,13,"CF34201",0,8065,null,null,20160701,20160930,36077.409999999996,0]
[null,"GUANAJUATO","11DPT0007K",120,"CEVB731120C46","CEVB731120HGTDRR00","BERNARDO CEDILLO VERA                   ",null,0,1130,1003,2,3,"A01801",0,9183,null,null,20160701,20160930,33371.769999999997,0]
[null,"GUANAJUATO","11DPT0002P",120,"CIEE710907TK8","CIEE710907HDFSSD04","EDUARDO ALEJANDR CISNEROS ESPINOSA      ",null,0,1130,1003,0,29,"S01201",0,2607,null,null,20160701,20160930,33957.57,0]
[null,"GUANAJUATO","11DPT0006L",120,"CIGP680809983","CIGP680809HGTDRB07","PABLO MARTIN CID GARCIA                 ",null,0,1130,1003,1,63,"CF33206",0,13988,null,null,20160701,20160930,116494.32,0]
[null,"GUANAJUATO","11DPT0005M",120,"COAD7908184B7","COAD790818MGTVRN00","DENY COVARRUBIAS ARREGUIN               ",null,0,1130,1003,0,72,"S01201",0,4398,null,null,20160701,20160930,32531.480000000003,0]
[null,"GUANAJUATO","11DPT0002P",120,"COCA760915JU4","COCA760915HGTRLL02","ALEJANDRO CORIA CALDERON                ",null,0,1130,1003,0,29,"S01202",0,2593,null,null,20160701,20160930,33651.01,0]
[null,"GUANAJUATO","11DPT0009I",120,"COCM710215JF9","COCM710215HMNBMR04","MARIO COBIAN CAMACHO                    ",null,0,1130,1003,1,74,"CF33206",0,13501,null,null,20160701,20160930,116494.32,0]
[null,"GUANAJUATO","11DPT0012W",120,"COMI671203D76","COMI671203MGTNLR18","MA. IRAIS CONTRERAS MALDONADO           ",null,0,1130,1003,4,2,"CF02105",0,12780,null,null,20160701,20160930,78517.2,0]
[null,"GUANAJUATO","11DPT0006L",120,"COMP630327QN2","COMP630327HGTNRB00","PABLO GERARDO CONTRERAS MARTINEZ        ",null,0,1130,1003,1,63,"CF33206",0,13987,null,null,20160701,20160930,119951.73999999998,0]
[null,"GUANAJUATO","11DPT0010Y",120,"CORJ890525619","CORJ890525HGTRMR07","JORGE ARMANDO CORONA RAMIREZ            ",null,0,1130,1003,2,4,"CF19201",0,8513,null,null,20160701,20160930,35687.620000000003,0]
[null,"GUANAJUATO","11DPT0008J",120,"COVA700831PW6","COVA700831MGRNRM03","AMADA CONDE VERA                        ",null,0,1130,1003,2,33,"T08201",0,760,null,null,20160701,20160930,46963.520000000004,0]
[null,"GUANAJUATO","11DPT0008J",120,"COVF720114623","COVF720114HGTNRR02","FRANCISCO JAVIER CONDE VERA             ",null,0,1130,1003,2,33,"S01201",0,10181,null,null,20160701,20160930,31326.15,0]
[null,"GUANAJUATO","11DPT0002P",120,"CUHC5501119F9","CUHC550111HGTLNS08","CESAR CUELLAR HINOJOSA                  ",null,0,1130,1003,0,29,"A03202",0,2565,null,null,20160701,20160930,45358.880000000005,0]
[null,"GUANAJUATO","11APT0001T",100,"CUMG550523TM9","CUMG550523MDFRRL06","GLORIA ARACELI CRUZ MARTIN DEL CAMPO    ",null,0,1130,1003,5,13,"CF02100",0,12459,null,null,20160701,20160930,113531.28000000001,0]
[null,"GUANAJUATO","11DPT0010Y",120,"CUTR610723JC8","CUTR610723MGTLTS06","ROSA MARIA CUELLAR TETUAN               ",null,0,1130,1003,2,4,"CF33206",0,13542,null,null,20160701,20160930,122610.16,0]
[null,"GUANAJUATO","11DPT0010Y",120,"CUVL741004T6A","CUVL741004MGTRRR08","LAURA CRUZ VARGAS                       ",null,0,1130,1003,2,4,"CF33206",0,13545,null,null,20160701,20160930,110648.72,0]
[null,"GUANAJUATO","11DPT0002P",120,"CUVY830805JA3","CUVY830805MGTSRH00","YAHAIRA ALICIA E CUESTAS VARGAS         ",null,0,1130,1003,0,29,"S01201",0,2595,null,null,20160701,20160930,29073.449999999997,0]
[null,"GUANAJUATO","11DPT0003O",120,"DAFT8701278E1","DAFT870127MZSVLN04","TANIA LIZETH DAVILA FLORES              ",null,0,1130,1003,0,30,"S01202",0,2623,null,null,20160701,20160930,33367.24,0]
[null,"GUANAJUATO","11DPT0002P",120,"DEHM860518J96","DEHM860518HMCLRG02","MIGUEL ANGEL DELGADO HERNANDEZ          ",null,0,1130,1003,0,29,"CF34202",0,305,null,null,20160701,20160930,35087.770000000004,0]
[null,"GUANAJUATO","11DPT0002P",120,"DEJA790116B16","DEJA790116HMCLMN00","JOSE ANTONIO DELGADO JIMENEZ            ",null,0,1130,1003,0,29,"CF33206",0,13544,null,null,20160701,20160930,104706.09000000001,0]
[null,"GUANAJUATO","11APT0001T",100,"DIAL510311BH6","DIXA510311HGTSXL09","ALBERTO DE LA LU DIOSDADO               ",null,0,1130,1003,5,13,"CF11100",0,10304,null,null,20160701,20160930,241023.6,0]
[null,"GUANAJUATO","11DPT0004N",120,"DIJL7203079A3","DIJL720307MGTGCR01","MA. DE LOURDES DIEGO JACOBO             ",null,0,1130,1003,1,28,"CF19201",0,6523,null,null,20160701,20160930,43765.24,0]
[null,"GUANAJUATO","11DPT0002P",120,"DONA780620F80","DONA780620HGTMTL04","ALEJANDRO DOMINGUEZ NIETO               ",null,0,1130,1003,0,29,"S01201",0,2635,null,null,20160701,20160930,29848.799999999996,0]
[null,"GUANAJUATO","11DPT0004N",120,"DUAJ8704098Q4","DUAJ870409HGTRGR00","JORGE LUIS DURAN AGUILERA               ",null,0,1130,1003,1,28,"S01201",0,6520,null,null,20160701,20160930,29874.720000000001,0]
[null,"GUANAJUATO","11DPT0010Y",120,"DUFC8505038R7","DUFC850503MGTRLR04","MARIA CRUZ DURAN FLORES                 ",null,0,1130,1003,2,4,"CF19201",0,8513,null,null,20160701,20160930,44189.55,0]
[null,"GUANAJUATO","11DPT0013V",120,"EACA751029DJ3","EACA751029MGTSRN06","MA DE LOS ANGELE ESPARZA CORONA         ",null,0,1130,1003,3,2,"S01201",0,18882,null,null,20160701,20160930,38702.9,0]
[null,"GUANAJUATO","11DPT0011X",120,"EAFM570902GM4","EAFM570902HGTSLS06","MOISES ESTRADA FLORES                   ",null,0,1130,1003,2,49,"CF18201",0,6504,null,null,20160701,20160930,40089.829999999994,0]
[null,"GUANAJUATO","11DPT0006L",120,"EAMG8704104G8","EAMG870410MGTSRR00","GRECIA ROXANNA ESPARZA MARES            ",null,0,1130,1003,1,63,"S01201",0,7709,null,null,20160701,20160930,33407.919999999998,0]
[null,"GUANAJUATO","11APT0001T",100,"EAVG760111SA9","EAVG760111MGTSLD04","MA.GUADALUPE ESPARZA VALENCIA           ",null,0,1130,1003,7,5,"CF33204",0,2605,null,null,20160701,20160930,63688.55,0]
[null,"GUANAJUATO","11DPT0009I",120,"EICA641219IS3","EICA641219MGTLRL01","ALTAGRACIA ELIZARRARAS CERVANTES        ",null,0,1130,1003,1,74,"CF21202",0,8100,null,null,20160701,20160930,48401.590000000004,0]
[null,"GUANAJUATO","11DPT0001Q",120,"EICA780130NQ1","EICA780130MGTSRN03","ANA MARIA ESPINOZA CERVANTES            ",null,0,1130,1003,0,28,"A03202",0,2492,null,null,20160701,20160930,38875.81,0]
[null,"GUANAJUATO","11DPT0009I",120,"EICC740626328","EICC740626MGTLRL02","CLAUDIA ELIZARRARAS CERVANTES           ",null,0,1130,1003,1,74,"S01201",0,8099,null,null,20160701,20160930,3037.8599999999997,0]
[null,"GUANAJUATO","11DPT0008J",120,"EICT8203073V8","EICT820307HGTSRM05","TOMAS ROGELIO ESPINOZA CERVANTES        ",null,0,1130,1003,2,33,"ED01201",0,4430,null,null,20160701,20160930,35458.54,0]
[null,"GUANAJUATO","11DPT0009I",120,"EIMJ620524ID9","EIMJ620524HGTLRS02","JOSE ELIAS MORENO                       ",null,0,1130,1003,1,74,"CF33206",0,14311,null,null,20160701,20160930,82648.100000000006,0]
[null,"GUANAJUATO","11DPT0006L",120,"EIMJ880812BK0","EIMJ880812MGTLRH07","JHOANA IVON ELIZALDE MARTINEZ           ",null,0,1130,1003,1,63,"CF18201",0,7699,null,null,20160701,20160930,30063.4,0]
[null,"GUANAJUATO","11APT0001T",100,"EIPA861113S53","EIPA861113HGTSRB08","JOSE ABRAHAM ESPINOZA PORRAS            ",null,0,1130,1003,7,5,"CF34202",0,5581,null,null,20160701,20160930,34111.439999999995,0]
[null,"GUANAJUATO","11DPT0002P",120,"EIPM591011QG5","EIPM591011MGTSRR09","MARTHA ALICIA ESPINOSA PEREZ            ",null,0,1130,1003,0,29,"CF33206",0,13246,null,null,20160701,20160930,94700.77,0]
[null,"GUANAJUATO","11DPT0010Y",120,"EISB881118DD0","EISB881118MGTSPT05","BETSAIDA MAGDALE ESPINOZA SEPULVEDA     ",null,0,1130,1003,2,4,"S01201",0,2513,null,null,20160701,20160930,35995.839999999997,0]
[null,"GUANAJUATO","11DPT0009I",120,"EITG6112096F3","EITG611209MDFSBD05","MARIA GUADALUPE ESPINOSA TABLEROS       ",null,0,1130,1003,1,74,"CF33204",0,2591,null,null,20160701,20160930,76701.48,0]
[null,"GUANAJUATO","11DPT0009I",120,"EIVC851005GF2","EIVC851005HGTLRR07","CARLOS ELIZARRARAS VARGAS               ",null,0,1130,1003,1,74,"CF33206",0,14311,null,null,20160701,20160930,45667.06,0]
[null,"GUANAJUATO","11DPT0012W",120,"EUVA760924363","EUVA760924HGTSLN02","ANTONIO ESQUEDA VILLALON                ",null,0,1130,1003,4,2,"CF33204",0,1800,null,null,20160701,20160930,70499.459999999992,0]
[null,"GUANAJUATO","11DPT0003O",120,"FAAF540219KI2","FAAF540219MGTRGX06","MARIA FE FRAUSTO AGUILAR                ",null,0,1130,1003,0,30,"CF34201",0,2622,null,null,20160701,20160930,49274.76,0]
[null,"GUANAJUATO","11DPT0001Q",120,"FABC530210FR5","FABC530210MDFRRR00","MARIA DEL CARMEN FRANCO BOURET          ",null,0,1130,1003,0,28,"CF33202",0,2551,null,null,20160701,20160930,43355.25,0]
[null,"GUANAJUATO","11DPT0005M",120,"FIGP640907QP7","FIGP640907HGTGRD01","PEDRO FIGUEROA GARCIA                   ",null,0,1130,1003,0,72,"A03202",0,4388,null,null,20160701,20160930,44340.1,0]
[null,"GUANAJUATO","11DPT0005M",120,"FIRG871015PB5","FIRG871015MGTGMB07","GABRIELA FIGUEROA RAMIREZ               ",null,0,1130,1003,0,72,"S01201",0,4419,null,null,20160701,20160930,30710.050000000003,0]
[null,"GUANAJUATO","11DPT0010Y",120,"FOCJ7406233X9","FOCJ740623MGTLLS01","JOSEFINA FLORES CALVA                   ",null,0,1130,1003,2,4,"T08201",0,658,null,null,20160701,20160930,45392.11,0]
[null,"GUANAJUATO","11DPT0012W",120,"FOGH740517223","FOGH740517HGTLTC07","HECTOR FLORES GUTIERREZ                 ",null,0,1130,1003,4,2,"CF33202",0,3394,null,null,20160701,20160930,45194.359999999993,0]
[null,"GUANAJUATO","11DPT0008J",120,"FOJU6701074Z1","FOXJ670107HGTLXN09","JUAN ANTONIO FLORES                     ",null,0,1130,1003,2,33,"CF33204",0,10193,null,null,20160701,20160930,76922.810000000012,0]
[null,"GUANAJUATO","11DPT0003O",120,"FOSA610902SG9","FOSA610902MGTLNL09","ALEJANDRA PATRICI FLORES SANDOVAL       ",null,0,1130,1003,0,30,"CF33204",0,2611,null,null,20160701,20160930,79047.090000000011,0]
[null,"GUANAJUATO","11DPT0014U",120,"GAAE770204JK3","GAAE770204MDFYLL06","ELIA GAYTAN ALCARAZ                     ",null,0,1130,1003,3,3,"CF02104",0,18883,null,null,20160701,20160930,90482.46,0]
[null,"GUANAJUATO","11DPT0001Q",120,"GAAR6310249B2","GAAR631024HGTLRF01","RAFAEL GALLEGOS ARELLANO                ",null,0,1130,1003,0,28,"ED01201",0,2511,null,null,20160701,20160930,43462.049999999996,0]
[null,"GUANAJUATO","11DPT0014U",120,"GABI850102NDA","GABI850102MGTRRS03","MARIA ISABEL GARCIA BARRIENTOS          ",null,0,1130,1003,3,3,"CF33206",0,18864,null,null,20160701,20160930,92058.65,0]
[null,"GUANAJUATO","11DPT0004N",120,"GACR6704153I2","GACR670415MGTRRT06","MARIA RITA GARCIA CERRATO               ",null,0,1130,1003,1,28,"CF19201",0,6506,null,null,20160701,20160930,44783.839999999997,0]
[null,"GUANAJUATO","11DPT0008J",120,"GAFV6609298F9","GAFV660929MGTRRR06","VERONICA ROCIO GRANADOS FRIAS           ",null,0,1130,1003,2,33,"CF21202",0,10176,null,null,20160701,20160930,43938.770000000004,0]
[null,"GUANAJUATO","11DPT0010Y",120,"GAGA8610104P3","GAGA861010HGTSRM03","AMOS EDUARDO GASCA GARCIA               ",null,0,1130,1003,2,4,"CF18201",0,9223,null,null,20160701,20160930,21959.42,0]
[null,"GUANAJUATO","11APT0001T",100,"GAGV930611G79","GAGV930611HGTRMC04","VICTOR HUGO GARCIA GOMEZ                ",null,0,1130,1003,5,13,"S01201",0,2502,null,null,20160701,20160930,26729.229999999996,0]
[null,"GUANAJUATO","11DPT0012W",120,"GAGY700725MG2","GAGY700725MGTRNS04","YESENIA GRANADOS GONZALEZ               ",null,0,1130,1003,4,2,"CF02102",0,12518,null,null,20160701,20160930,92519.75999999998,0]
[null,"GUANAJUATO","11DPT0002P",120,"GAHJ561230M55","GAHJ561230HGTRRN04","JUAN GRANADOS HERNANDEZ                 ",null,0,1130,1003,0,29,"CF33206",0,13249,null,null,20160701,20160930,108261.15999999999,0]
[null,"GUANAJUATO","11DPT0011X",120,"GAJJ660505P94","GAJJ660505HGTRMN06","JUAN GARCIA JIMENEZ                     ",null,0,1130,1003,2,49,"CF19201",0,10602,null,null,20160701,20160930,43136.729999999996,0]
[null,"GUANAJUATO","11DPT0001Q",120,"GALE770303QD2","GALE770303HGTRSD04","EDUARDO GARCIA LESSO                    ",null,0,1130,1003,0,28,"CF33204",0,2545,null,null,20160701,20160930,57052.740000000005,0]
[null,"GUANAJUATO","11DPT0003O",120,"GALJ930324KX8","GALJ930324HGTRPN06","JUAN CARLOS GARCIA LOPEZ                ",null,0,1130,1003,0,30,"S01202",0,9200,null,null,20160701,20160930,31349.64,0]
[null,"GUANAJUATO","11DPT0001Q",120,"GAMM680220L32","GAMM680220MGTLRR01","MARTHA NORMA GALLEGOS MARISCAL          ",null,0,1130,1003,0,28,"ED01201",0,2509,null,null,20160701,20160930,47029.840000000004,0]
[null,"GUANAJUATO","11DPT0001Q",120,"GAOH8102061G0","GAOH810206HDFLLM04","HUMBERTO ISRAEL GALVAN OLVERA           ",null,0,1130,1003,0,28,"S01202",0,2520,null,null,20160701,20160930,31727.64,0]
[null,"GUANAJUATO","11APT0001T",100,"GAPS690711PT2","GAPS690711MGTRRR00","SARA GISELA GARCIA PEREZ                ",null,0,1130,1003,5,13,"CF02105",0,14599,null,null,20160701,20160930,78517.2,0]
[null,"GUANAJUATO","11DPT0009I",120,"GARG5704245R5","GARG570424HGTRZB08","GABRIEL GARCIA RAZO                     ",null,0,1130,1003,1,74,"S01202",0,8082,null,null,20160701,20160930,43844.890000000007,0]
[null,"GUANAJUATO","11DPT0003O",120,"GARJ690126G3A","GARJ690126HQTRVN01","JOSE JUAN GARCIA RIVERA                 ",null,0,1130,1003,0,30,"S01202",0,2633,null,null,20160701,20160930,33437.449999999997,0]
[null,"GUANAJUATO","11DPT0007K",120,"GARJ840526678","GARJ840526HGTRMV04","JAVIER ARTURO GARCIA ROMERO             ",null,0,1130,1003,2,3,"S01202",0,9193,null,null,20160701,20160930,36073.89,0]
[null,"GUANAJUATO","11DPT0007K",120,"GARL720427FX0","GARL720427MGTRMZ12","LUZ MA GARCIA ROMERO                    ",null,0,1130,1003,2,3,"ED01201",0,9180,null,null,20160701,20160930,43427.839999999997,0]
[null,"GUANAJUATO","11DPT0004N",120,"GARS670416A54","GARS670416MGTRYL05","SILVIA GARCIA REYES                     ",null,0,1130,1003,1,28,"CF33204",0,10604,null,null,20160701,20160930,85405.849999999991,0]
[null,"GUANAJUATO","11DPT0013V",120,"GASM690929112","GASM690929HDFRLR02","MARIO MIGUEL GARCIA SALINAS             ",null,0,1130,1003,3,2,"CF33204",0,18854,null,null,20160701,20160930,61997.250000000007,0]
[null,"GUANAJUATO","11DPT0002P",120,"GATG451128UX1","GATG451128HDFYRS05","GUSTAVO GAYTAN TORRES                   ",null,0,1130,1003,0,29,"CF33206",0,13248,null,null,20160701,20160930,83173.850000000006,0]
[null,"GUANAJUATO","11DPT0004N",120,"GAZE690718GX3","GAZE690718MGTRVL07","ELIZABETH GARCIA ZAVALA                 ",null,0,1130,1003,1,28,"CF04201",0,6498,null,null,20160701,20160930,45063.03,0]
[null,"GUANAJUATO","11DPT0001Q",120,"GIAJ670517N7A","GIAJ670517HGTRLN07","JUAN MANUEL GRIMALDO ALFARO             ",null,0,1130,1003,0,28,"CF34201",0,10177,null,null,20160701,20160930,48064.95,0]
[null,"GUANAJUATO","11DPT0005M",120,"GOAA770911HT1","GOAA770911MGTMLN09","ANA ROSA GOMEZ ALBA                     ",null,0,1130,1003,0,72,"CF33204",0,4409,null,null,20160701,20160930,63888.66,0]
[null,"GUANAJUATO","11APT0001T",100,"GOAV860422EK6","GOAV860422HGTNLC02","VICTOR ISRAEL GONZALEZ ALCANTAR         ",null,0,1130,1003,5,13,"CF33206",0,14322,null,null,20160701,20160930,72134.23000000001,0]
[null,"GUANAJUATO","11DPT0008J",120,"GOCH8410237R3","GOCH841023HGTNBC04","HECTOR HUGO GONZALEZ CABRERA            ",null,0,1130,1003,2,33,"CF18201",0,10175,null,null,20160701,20160930,30948.15,0]
[null,"GUANAJUATO","11DPT0010Y",120,"GOGD870617R99","GOGD870617HNLMRN00","JOSE DANIEL GOMEZ GARZA                 ",null,0,1130,1003,2,4,"CF33206",0,14315,null,null,20160701,20160930,88367.140000000014,0]
[null,"GUANAJUATO","11DPT0004N",120,"GOGE730923ME8","GOGE730923MMNNNL00","ELIZABETH GONZALEZ GONZALEZ             ",null,0,1130,1003,1,28,"A03202",0,6497,null,null,20160701,20160930,46476.19,0]
[null,"GUANAJUATO","11DPT0002P",120,"GOGF910421775","GOGF910421MGTNLR03","MARIA FERNANDA GONZALEZ GALLARDO        ",null,0,1130,1003,0,29,"S01201",0,2585,null,null,20160701,20160930,29392.239999999998,0]
[null,"GUANAJUATO","11DPT0012W",120,"GOGI750427GM1","GOGI750427HMCMYS02","ISRAEL GOMEZ GAYTAN                     ",null,0,1130,1003,4,2,"CF33206",0,14068,null,null,20160701,20160930,110402.23000000001,0]
[null,"GUANAJUATO","11DPT0001Q",120,"GOGK890902JT3","GOGK890902MGTNLR04","KARLA RAFAELA GONZALEZ GALLARDO         ",null,0,1130,1003,0,28,"CF33204",0,2526,null,null,20160701,20160930,61055.91,0]
[null,"GUANAJUATO","11DPT0007K",120,"GOGL6009014D1","GOGL600901MGTNLN08","LINA ENGRACIA GONZALEZ GALLARDO         ",null,0,1130,1003,2,3,"CF18203",0,9181,null,null,20160701,20160930,51427.33,0]
[null,"GUANAJUATO","11APT0001T",100,"GOLA7812182KA","GOLA781218MQTMPN05","ANA GLORIA GOMEZ LOPEZ                  ",null,0,1130,1003,7,5,"CF33204",0,11094,null,null,20160701,20160930,72429.510000000009,0]
[null,"GUANAJUATO","11DPT0011X",120,"GOLR590503HDA","GOLR590503HGTNDB04","ROBERTO GONZALEZ LEDESMA                ",null,0,1130,1003,2,49,"CF33206",0,14319,null,null,20160701,20160930,124199.33,0]
[null,"GUANAJUATO","11DPT0001Q",120,"GOMG8812289D6","GOMG881228HQTMLB01","GABRIEL GOMEZ MOLINERO                  ",null,0,1130,1003,0,28,"CF33204",0,2530,null,null,20160701,20160930,57049.040000000008,0]
[null,"GUANAJUATO","11DPT0003O",120,"GOML690426EW2","GOML690426MGTNDZ08","LUZ ESTELA GONZALEZ MEDINA              ",null,0,1130,1003,0,30,"CF33204",0,2666,null,null,20160701,20160930,84308.88,0]
[null,"GUANAJUATO","11DPT0013V",120,"GOML710913T66","GOML710913MGTNXC08","LUCIA GONZALEZ MU±OZ                    ",null,0,1130,1003,3,2,"CF33206",0,18851,null,null,20160701,20160930,71815.140000000014,0]
[null,"GUANAJUATO","11APT0001T",100,"GONM790924B46","GONM790924HGTNVG00","MIGUEL ANGEL GONZALEZ NAVARRO           ",null,0,1130,1003,7,5,"CF33204",0,2578,null,null,20160701,20160930,72370.38,0]
[null,"GUANAJUATO","11DPT0003O",120,"GOPP5010306G6","GOPP501030HGTNRD05","PEDRO GONZALEZ PORTILLO                 ",null,0,1130,1003,0,30,"CF33206",0,13685,null,null,20160701,20160930,71473.27,0]
[null,"GUANAJUATO","11DPT0003O",120,"GOPR8103287J3","GOPR810328HDFMRB09","RUBEN GOMEZ PORTILLA                    ",null,0,1130,1003,0,30,"CF02103",0,12664,null,null,20160701,20160930,92369.4,0]
[null,"GUANAJUATO","11DPT0011X",120,"GOSA4507257Y0","GOXS450725HGTNXN07","SANTIAGO GONZALEZ                       ",null,0,1130,1003,2,49,"S01202",0,10294,null,null,20160701,20160930,39912.649999999994,0]
[null,"GUANAJUATO","11DPT0010Y",120,"GOSL960615K94","GOSL960615MGTNPR02","LORENA GONZALEZ SEPULVEDA               ",null,0,1130,1003,2,4,"CF21202",0,"     ",null,null,20160701,20160930,8729.84,0]
[null,"GUANAJUATO","11DPT0002P",120,"GUAA600320L51","GUAA600320MGTTLL03","ALEJANDRA GUTIERREZ ALVAREZ             ",null,0,1130,1003,0,29,"ED01201",0,2602,null,null,20160701,20160930,42606.13,0]
[null,"GUANAJUATO","11DPT0006L",120,"GUFO930509HR3","GUFO930509MGTVRL06","OLIVIA GUEVARA FARFAN                   ",null,0,1130,1003,1,63,"S01201",0,7716,null,null,20160701,20160930,29874.720000000001,0]
[null,"GUANAJUATO","11DPT0003O",120,"GUFV820306TSA","GUFV820306HGRZLC04","VICTOR MANUEL GUZMAN FLORES             ",null,0,1130,1003,0,30,"CF33206",0,13684,null,null,20160701,20160930,90797.680000000008,0]
[null,"GUANAJUATO","11DPT0013V",120,"GUGA7312084M6","GUGA731208HGTTZL01","ALFREDO GUTIERREZ GUZMAN                ",null,0,1130,1003,3,2,"CF21202",0,18881,null,null,20160701,20160930,40336.209999999992,0]
[null,"GUANAJUATO","11DPT0007K",120,"GUGE730901EC4","GUGE730901MGTTNS07","ESPERANZA GUTIERREZ GONZALEZ            ",null,0,1130,1003,2,3,"CF04201",0,2612,null,null,20160701,20160930,50129.54,0]
[null,"GUANAJUATO","11DPT0007K",120,"GUGM650603GP3","GUGM650603MJCTZR08","MA. MARTINA GUTIERREZ GUZMAN            ",null,0,1130,1003,2,3,"CF33206",0,13321,null,null,20160701,20160930,126002.55,0]
[null,"GUANAJUATO","11APT0001T",100,"GUJE870107661","GUJE870107MGTTRL01","ELIZABETH VERONI GUTIERREZ JUAREZ       ",null,0,1130,1003,7,5,"CF33204",0,2546,null,null,20160701,20160930,62789.390000000014,0]
[null,"GUANAJUATO","11DPT0005M",120,"GULH680121BP6","GULH680121HDFTPR01","HORACIO GUTIERREZ LOPEZ                 ",null,0,1130,1003,0,72,"CF34202",0,9195,null,null,20160701,20160930,32011.69,0]
[null,"GUANAJUATO","11DPT0002P",120,"GULM790929U80","GULM790929HGTRGG04","MIGUEL ANGEL GUERRERO LAGUNA            ",null,0,1130,1003,0,29,"CF34202",0,2600,null,null,20160701,20160930,40207.430000000008,0]
[null,"GUANAJUATO","11DPT0010Y",120,"GUMB860612B77","GUMB860612MGTTRL01","BLANCA EDITH GUTIERREZ MORENO           ",null,0,1130,1003,2,4,"CF19201",0,9226,null,null,20160701,20160930,36904.11,0]
[null,"GUANAJUATO","11DPT0010Y",120,"GUPD810705I4A","GUPD810705HQTRDM04","DOMINGO DANIEL GUERRERO PADILLA         ",null,0,1130,1003,2,4,"CF02104",0,12744,null,null,20160701,20160930,90482.46,0]
[null,"GUANAJUATO","11DPT0013V",120,"GURG711212BH3","GURG711212MGTRXD01","MA GUADALUPE GUARDADO REA               ",null,0,1130,1003,3,2,"A03202",0,18859,null,null,20160701,20160930,36363.17,0]
[null,"GUANAJUATO","11DPT0008J",120,"GUTR690427DSA","GUTR690427MDFPRC02","ROCIO GUAPO TORRECILLAS                 ",null,0,1130,1003,2,33,"T08201",0,514,null,null,20160701,20160930,44152.7,0]
[null,"GUANAJUATO","11DPT0009I",120,"GUZA720514FG4","GUZA720514MDFTVL06","ALEJANDRA GUTIERREZ ZAVALA              ",null,0,1130,1003,1,74,"CF04201",0,8079,null,null,20160701,20160930,45604.01,0]
[null,"GUANAJUATO","11DPT0007K",120,"HEBL680226MH6","HEBL680226HDFRNS05","LUIS FELIPE HERRERA BUENDIA             ",null,0,1130,1003,2,3,"A03202",0,2609,null,null,20160701,20160930,38932.28,0]
[null,"GUANAJUATO","11DPT0003O",120,"HECH720907NC1","HECH720907MDFRNL01","HILDA HERNANDEZ CANCHOLA                ",null,0,1130,1003,0,30,"S01201",0,2500,null,null,20160701,20160930,40464.81,0]
[null,"GUANAJUATO","11DPT0010Y",120,"HECL500618L95","HECL500618HGTRRS04","JOSE LUIS HERNANDEZ CORTES              ",null,0,1130,1003,2,4,"CF21202",0,9210,null,null,20160701,20160930,7188.42,0]
[null,"GUANAJUATO","11DPT0003O",120,"HECL6401228X2","HECL640122MDFRLT03","LETICIA HERNANDEZ CALVILLO              ",null,0,1130,1003,0,30,"CF21202",0,2663,null,null,20160701,20160930,45931.140000000007,0]
[null,"GUANAJUATO","11DPT0005M",120,"HECS621213HZ5","HECS621213HGTRLR02","SERGIO HERNANDEZ CALDERON               ",null,0,1130,1003,0,72,"CF18203",0,4411,null,null,20160701,20160930,50970.9,0]
[null,"GUANAJUATO","11DPT0003O",120,"HEFM781229PE6","HEFM781229MGTRRL06","MARIA MILAGROS HERNANDEZ FRAUSTO        ",null,0,1130,1003,0,30,"S01202",0,2659,null,null,20160701,20160930,32529.64,0]
[null,"GUANAJUATO","11DPT0002P",120,"HEGC870427C96","HEGC870427HCSRNR00","CRISTOBAL DE JES HERNANDEZ GONZALEZ     ",null,0,1130,1003,0,29,"S01201",0,2567,null,null,20160701,20160930,32073.739999999998,0]
[null,"GUANAJUATO","11DPT0006L",120,"HEGN8708165Y4","HEGN870816MGTRRY05","NAYELI HERREJON GUERRERO                ",null,0,1130,1003,1,63,"CF18201",0,7705,null,null,20160701,20160930,29303.019999999997,0]
[null,"GUANAJUATO","11DPT0010Y",120,"HEHA830216PP3","HEHA830216MGTRRL04","ALMA DELIA HERNANDEZ HERNANDEZ          ",null,0,1130,1003,2,4,"CF18201",0,9224,null,null,20160701,20160930,38050.089999999997,0]
[null,"GUANAJUATO","11DPT0003O",120,"HEHA900701UB1","HEHA900701MGTRRN03","ANA LETICIA HERNANDEZ HERRERA           ",null,0,1130,1003,0,30,"S01202",0,2630,null,null,20160701,20160930,33709.64,0]
[null,"GUANAJUATO","11DPT0010Y",120,"HELB7109192T6","HELB710919MGTRNT04","BEATRIZ HERNANDEZ LONA                  ",null,0,1130,1003,2,4,"A03202",0,9213,null,null,20160701,20160930,44019.770000000004,0]
[null,"GUANAJUATO","11DPT0013V",120,"HELJ790519GT9","HELJ790519HGTRPN03","JUAN MANUEL HERNANDEZ LOPEZ             ",null,0,1130,1003,3,2,"CF18203",0,18857,null,null,20160701,20160930,45771.17,0]
[null,"GUANAJUATO","11DPT0007K",120,"HELU501011H62","HEXL501011HGTRXZ04","DE LA LUZ HERNANDEZ JOSE                ",null,0,1130,1003,2,3,"S01201",0,9184,null,null,20160701,20160930,40473.550000000003,0]
[null,"GUANAJUATO","11DPT0013V",120,"HEMG620422565","HEMG620422MGTRRR08","GRACIELA HERNANDEZ MARTINEZ             ",null,0,1130,1003,3,2,"CF33203",0,18858,null,null,20160701,20160930,38933.520000000004,0]
[null,"GUANAJUATO","11DPT0001Q",120,"HEMM6706104M9","HEMM670610MGTRNR09","MA. MERCEDES HERRERA MANCERA            ",null,0,1130,1003,0,28,"CF33206",0,12912,null,null,20160701,20160930,122020.24000000002,0]
[null,"GUANAJUATO","11APT0001T",100,"HEOS630818TG4","HEOS630818MDFRRN00","SONIA GUADALUPE HERNANDEZ OROZCO        ",null,0,1130,1003,5,13,"CF33206",0,13318,null,null,20160701,20160930,112438.06,0]
[null,"GUANAJUATO","11APT0001T",100,"HEPL670716M36","HEPL670716HGTRRS02","JOSE LUIS HERNANDEZ PEREZ               ",null,0,1130,1003,5,13,"CF01601",0,18847,null,null,20160701,20160930,90553.079999999987,0]
[null,"GUANAJUATO","11DPT0014U",120,"HEPU760412GG8","HEPU760412HPLRRZ03","UZIEL HERNANDEZ PEREZ                   ",null,0,1130,1003,3,3,"CF18203",0,18871,null,null,20160701,20160930,43637.93,0]
[null,"GUANAJUATO","11DPT0010Y",120,"HEVL6006012YA","HEVL600601HGTRLZ00","J LUZ HERNANDEZ VELAZQUEZ               ",null,0,1130,1003,2,4,"CF21202",0,9232,null,null,20160701,20160930,25197.98,0]
[null,"GUANAJUATO","11DPT0010Y",120,"HIMK800908LB0","HIMK800908HGTNNR04","KRISTIAN LUIS HINOJOSA MONROY           ",null,0,1130,1003,2,4,"S01202",0,10600,null,null,20160701,20160930,34504.35,0]
[null,"GUANAJUATO","11DPT0007K",120,"IAVC761114FE1","IAVC761114MNTBLL00","CLAUDIA ELIZABET IBARRA VILLANUEVA      ",null,0,1130,1003,2,3,"CF33206",0,13320,null,null,20160701,20160930,116727.46,0]
[null,"GUANAJUATO","11DPT0008J",120,"JACF700609GI1","JACF700609HGTRML07","FELIPE JARAMILLO CAMPOS                 ",null,0,1130,1003,2,33,"S01202",0,10195,null,null,20160701,20160930,32929.31,0]
[null,"GUANAJUATO","11DPT0006L",120,"JALS470121DUA","JALS470121HMNMPR04","SERGIO JAIMES LOPEZ                     ",null,0,1130,1003,1,63,"CF02103",0,12618,null,null,20160701,20160930,92369.4,0]
[null,"GUANAJUATO","11DPT0007K",120,"JAMC821119QK9","JAMC821119MGTMSL07","CLAUDIA MARCELA JAIME MOSQUEDA          ",null,0,1130,1003,2,3,"S01202",0,9206,null,null,20160701,20160930,34312.31,0]
[null,"GUANAJUATO","11DPT0001Q",120,"JAMJ591122Q73","JAMJ591122HGTRNV07","JAVIER JARALEÐO MANCERA                 ",null,0,1130,1003,0,28,"A03202",0,9832,null,null,20160701,20160930,41941.049999999996,0]
[null,"GUANAJUATO","11DPT0011X",120,"JILD710426DB9","JILD710426HGTMPR06","DARIO DAMIAN JIMENEZ LOPEZ              ",null,0,1130,1003,2,49,"CF02103",0,12685,null,null,20160701,20160930,92369.4,0]
[null,"GUANAJUATO","11DPT0003O",120,"JIOL8008248F7","JIOL800824MGTMRZ11","LIZETH ARIADNA JIMENEZ ORTEGA           ",null,0,1130,1003,0,30,"CF33204",0,2510,null,null,20160701,20160930,77335.37999999999,0]
[null,"GUANAJUATO","11DPT0001Q",120,"JOOM700802BM5","JOOM700802HGTYRG06","MIGUEL ANGEL JOYA ORTIZ                 ",null,0,1130,1003,0,28,"CF33206",0,12916,null,null,20160701,20160930,118183.25000000001,0]
[null,"GUANAJUATO","11DPT0002P",120,"JUHF791105831","JUHF791105HDFRLR06","FERNANDO JUAREZ HELGUERA                ",null,0,1130,1003,0,29,"S01201",0,2579,null,null,20160701,20160930,29874.720000000001,0]
[null,"GUANAJUATO","11DPT0005M",120,"JUMH681213NW0","JUMH681213HGTRGL00","JOSE HILARIO JUAREZ MAGAÐA              ",null,0,1130,1003,0,72,"CF33206",0,13770,null,null,20160701,20160930,113689.35,0]
[null,"GUANAJUATO","11DPT0006L",120,"JUPA730712HA3","JUPA730712MGTRRN04","ANA LAURA JUAREZ PEREZ                  ",null,0,1130,1003,1,63,"CF18203",0,7703,null,null,20160701,20160930,47486.080000000002,0]
[null,"GUANAJUATO","11DPT0014U",120,"JUSD780922L87","JUSD780922MQTRRL03","DULCE MARIA JUAREZ SORIA                ",null,0,1130,1003,3,3,"A01801",0,18870,null,null,20160701,20160930,41985.469999999994,0]
[null,"GUANAJUATO","11DPT0002P",120,"LAMA800707D83","LAMA800707HGTRRL05","JOSE ALEJANDRO LARA MERCADO             ",null,0,1130,1003,0,29,"S01202",0,2570,null,null,20160701,20160930,34103.369999999995,0]
[null,"GUANAJUATO","11DPT0008J",120,"LAVA8108019Q9","LAVA810801MGTGRN09","MARIA DE LOS ANG LAGUNA VARGAS          ",null,0,1130,1003,2,33,"CF33206",0,14313,null,null,20160701,20160930,104399.08,0]
[null,"GUANAJUATO","11DPT0008J",120,"LAVD841123J58","LAVD841123HGTGRN02","DANIEL LAGUNA VARGAS                    ",null,0,1130,1003,2,33,"S01201",0,10179,null,null,20160701,20160930,32777.57,0]
[null,"GUANAJUATO","11DPT0005M",120,"LELE610112FLA","LELE610112MGTMRL09","ELSA GUADALUPE LEMUS LIRA               ",null,0,1130,1003,0,72,"CF33206",0,14321,null,null,20160701,20160930,101354.41,0]
[null,"GUANAJUATO","11APT0001T",100,"LERD770827UM0","LERD770827HGTNDM00","JOSE DOMINGO DE LEON RODRIGUEZ          ",null,0,1130,1003,5,13,"CF01601",0,11084,null,null,20160701,20160930,90553.079999999987,0]
[null,"GUANAJUATO","11DPT0009I",120,"LILB720207HV3","LILB720207MGTNML02","BLANCA ESTELA LINARES LOMELI            ",null,0,1130,1003,1,74,"CF33202",0,8087,null,null,20160701,20160930,48400.479999999996,0]
[null,"GUANAJUATO","11DPT0001Q",120,"LIRA890608KM8","LIRA890608MGTZZL06","ALMA ROSARIO LIZARRAGA RUIZ             ",null,0,1130,1003,0,28,"S01201",0,2556,null,null,20160701,20160930,29551.22,0]
[null,"GUANAJUATO","11DPT0006L",120,"LOAP6711257L7","LOAP671125HGTPGB09","JOSE PABLO LOPEZ AGUIRRE                ",null,0,1130,1003,1,63,"A03202",0,7687,null,null,20160701,20160930,37936.960000000006,0]
[null,"GUANAJUATO","11DPT0002P",120,"LOBM750809KY1","LOBM750809HGTPRG01","MIGUEL LOPEZ BARRAGAN                   ",null,0,1130,1003,0,29,"S01202",0,2597,null,null,20160701,20160930,35237.5,0]
[null,"GUANAJUATO","11DPT0003O",120,"LOCR480518KR8","LOCR480518HDFPRG01","ROGELIO LOPEZ CERVANTES                 ",null,0,1130,1003,0,30,"CF18203",0,9186,null,null,20160701,20160930,53142.05,0]
[null,"GUANAJUATO","11DPT0011X",120,"LOCV8505084R9","LOCV850508MGTPRR07","VERONICA LOPEZ CARDOSO                  ",null,0,1130,1003,2,49,"S01201",0,2557,null,null,20160701,20160930,34219.74,0]
[null,"GUANAJUATO","11DPT0004N",120,"LOGM731124S65","LOGM731124MMNPZN04","MONICA IVETT LOPEZ GUZMAN               ",null,0,1130,1003,1,28,"CF33206",0,13686,null,null,20160701,20160930,97383.99000000002,0]
[null,"GUANAJUATO","11DPT0004N",120,"LOGY890331RG1","LOGY890331MGTPZN04","YANNET LOPEZ GUZMAN                     ",null,0,1130,1003,1,28,"S01201",0,6511,null,null,20160701,20160930,36362.89,0]
[null,"GUANAJUATO","11DPT0009I",120,"LOLA590613UN8","LOLA590613HGTPPN00","ANTONIO LOPEZ LOPEZ                     ",null,0,1130,1003,1,74,"CF33206",0,13500,null,null,20160701,20160930,123198.92000000001,0]
[null,"GUANAJUATO","11DPT0001Q",120,"LOLA870110SJ9","LOLA870110MGTPPL02","ALMA ALEJANDRA LOPEZ LOPEZ              ",null,0,1130,1003,0,28,"CF33204",0,2553,null,null,20160701,20160930,61976.990000000005,0]
[null,"GUANAJUATO","11DPT0007K",120,"LOMA701120ND4","LOXM701120HGTPXR04","MARTIN EDUARDO LOPEZ                    ",null,0,1130,1003,2,3,"CF33206",0,13319,null,null,20160701,20160930,115174.46000000002,0]
[null,"GUANAJUATO","11DPT0012W",120,"LOSG55020446A","LOSG550204HGTPTL09","GUILLERMO LOPEZ SOTO                    ",null,0,1130,1003,4,2,"ED01201",0,11525,null,null,20160701,20160930,42089.820000000007,0]
[null,"GUANAJUATO","11DPT0010Y",120,"LOZE620109TAO","LOZE620109MGTPMV07","MA.EVERILDA LOPEZ ZAMORA                ",null,0,1130,1003,2,4,"CF04201",0,9214,null,null,20160701,20160930,40312.679999999993,0]
[null,"GUANAJUATO","11APT0001T",100,"LUCH751109S53","LUCH751109HGTVNG03","HUGO ENRIQUE LUEVANO CONTRERAS          ",null,0,1130,1003,5,13,"CF02105",0,14596,null,null,20160701,20160930,78517.2,0]
[null,"GUANAJUATO","11DPT0004N",120,"LURR5303156L3","LURR530315HGTNMY04","RAYMUNDO LUNA RAMIREZ                   ",null,0,1130,1003,1,28,"CF33206",0,14055,null,null,20160701,20160930,111269.82,0]
[null,"GUANAJUATO","11DPT0002P",120,"MABH800524BY7","MABH800524HMNRRG02","HUGO MARTINEZ BARRERA                   ",null,0,1130,1003,0,29,"CF33206",0,13247,null,null,20160701,20160930,88398.360000000015,0]
[null,"GUANAJUATO","11APT0001T",100,"MABM8602122N2","MABM860212MGTRRL21","MELISSA MARISELA MARTINEZ BARRIOS       ",null,0,1130,1003,7,5,"S01201",0,2647,null,null,20160701,20160930,31348.309999999998,0]
[null,"GUANAJUATO","11DPT0002P",120,"MACP790228577","MACP790228MGTRSL06","MARIA DEL PILAR MARTINEZ CASTRO         ",null,0,1130,1003,0,29,"S01202",0,2604,null,null,20160701,20160930,31347.909999999996,0]
[null,"GUANAJUATO","11DPT0010Y",120,"MADB860405V48","MADB860405MGTLZL02","MARIA BLANCA MALAGON DIAZ               ",null,0,1130,1003,2,4,"CF34202",0,12050,null,null,20160701,20160930,51008.61,0]
[null,"GUANAJUATO","11DPT0002P",120,"MADJ760413GFA","MADJ760413HGTTZQ01","JOAQUIN MATA DIAZ                       ",null,0,1130,1003,0,29,"A03202",0,2563,null,null,20160701,20160930,43843.789999999994,0]
[null,"GUANAJUATO","11DPT0002P",120,"MADM900319GN9","MADM900319HGTTZN05","JOSE MANUEL MATA DIAZ                   ",null,0,1130,1003,0,29,"S01201",0,2594,null,null,20160701,20160930,31326.15,0]
[null,"GUANAJUATO","11DPT0006L",120,"MAFJ5906036T8","MAFJ590603HGTRRN00","JUAN MANUEL MARTINEZ FRIAS              ",null,0,1130,1003,1,63,"ED01201",0,18886,null,null,20160701,20160930,45107.079999999994,0]
[null,"GUANAJUATO","11DPT0001Q",120,"MAGB8208194P2","MAGB820819MGTLRL08","BLANCA ELIA MALDONADO GARCIA            ",null,0,1130,1003,0,28,"CF33204",0,2524,null,null,20160701,20160930,61173.149999999994,0]
[null,"GUANAJUATO","11DPT0001Q",120,"MAGC661126AJ5","MAGC661126MGTLNR18","MA.CARMEN MALDONADO GONZALEZ            ",null,0,1130,1003,0,28,"CF33206",0,12910,null,null,20160701,20160930,105944.19,0]
[null,"GUANAJUATO","11DPT0007K",120,"MAGF780719PC1","MAGF780719MGTRNT03","FATIMA MARTINEZ GONZALEZ                ",null,0,1130,1003,2,3,"S01201",0,9171,null,null,20160701,20160930,30973.480000000003,0]
[null,"GUANAJUATO","11DPT0013V",120,"MAHM7308144V2","MAHM730814MGTRRR07","MARCELA DEL PILA MARTINEZ HERNANDEZ     ",null,0,1130,1003,3,2,"CF33206",0,18852,null,null,20160701,20160930,99614.03,0]
[null,"GUANAJUATO","11DPT0011X",120,"MAJG650413GMA","MAJG650413HGTLRS08","GUSTAVO MALAGON JUAREZ                  ",null,0,1130,1003,2,49,"CF33206",0,13689,null,null,20160701,20160930,113378.75,0]
[null,"GUANAJUATO","11DPT0003O",120,"MALR690904B5A","MALR690904MGTRPS03","ROSA EUGENIA MARTINEZ LOPEZ             ",null,0,1130,1003,0,30,"CF34201",0,2649,null,null,20160701,20160930,43679.54,0]
[null,"GUANAJUATO","11DPT0003O",120,"MAMJ620217DW9","MAMJ620217HGTRNN03","JUAN ANTONIO MARTINEZ MONCIBAIS         ",null,0,1130,1003,0,30,"CF33204",0,2638,null,null,20160701,20160930,84064.310000000012,0]
[null,"GUANAJUATO","11DPT0011X",120,"MAMM8504029T1","MAMM850402MGTLLS09","MASSIEL MALDONADO MALDONADO             ",null,0,1130,1003,2,49,"S01201",0,10610,null,null,20160701,20160930,35322.199999999997,0]
[null,"GUANAJUATO","11APT0001T",100,"MANR8209073S1","MANR820907HGTCGT04","RITO MACIAS NEGRETE                     ",null,0,1130,1003,7,5,"CF01601",0,11035,null,null,20160701,20160930,90553.079999999987,0]
[null,"GUANAJUATO","11APT0001T",100,"MAOJ7405168FA","MAOJ740516MGTRCN05","JUANA MARTINEZ OCHOA                    ",null,0,1130,1003,5,13,"CF33206",0,14141,null,null,20160701,20160930,113945.69000000002,0]
[null,"GUANAJUATO","11DPT0013V",120,"MARC9411088E1","MARC941108MGTYDC02","CECILIA IRAIS MAYORGA RODRIGUEZ         ",null,0,1130,1003,3,2,"A03202",0,"     ",null,null,20160701,20160930,16318.5,0]
[null,"GUANAJUATO","11DPT0009I",120,"MARM6405079G7","MARM640507HGTGVR02","MARTIN MAGAÐA RIVERA                    ",null,0,1130,1003,1,74,"CF33206",0,14310,null,null,20160701,20160930,104774.68000000001,0]
[null,"GUANAJUATO","11DPT0009I",120,"MATF6010095M3","MATF601009HGTGFR00","FRANCISCO MAGAÐA TAFOYA                 ",null,0,1130,1003,1,74,"CF19201",0,8090,null,null,20160701,20160930,46884.86,0]
[null,"GUANAJUATO","11DPT0009I",120,"MATM660127FH7","MATM660127MGTGFN01","MONICA MAGAÐA TAFOYA                    ",null,0,1130,1003,1,74,"CF33203",0,8091,null,null,20160701,20160930,41618.130000000005,0]
[null,"GUANAJUATO","11DPT0010Y",120,"MAVR700118TS6","MAVR700118HGTRRB08","RUBEN MARTINEZ VARELA                   ",null,0,1130,1003,2,4,"CF33206",0,13251,null,null,20160701,20160930,117992.03,0]
[null,"GUANAJUATO","11DPT0009I",120,"MAZC650708TU1","MAZC650708MGTQRR01","MARIA CARMEN MAQUEDA ZARATE             ",null,0,1130,1003,1,74,"A03202",0,8076,null,null,20160701,20160930,41297.4,0]
[null,"GUANAJUATO","11DPT0009I",120,"MAZC781203DS0","MAZC781203HGTQRR06","CARLOS MAQUEDA ZARATE                   ",null,0,1130,1003,1,74,"CF18201",0,8093,null,null,20160701,20160930,30941.050000000003,0]
[null,"GUANAJUATO","11DPT0006L",120,"MAZR720405LB8","MAZR720405HMNRTC01","RICARDO MARTINEZ ZETINA                 ",null,0,1130,1003,1,63,"CF33204",0,7693,null,null,20160701,20160930,63769.020000000004,0]
[null,"GUANAJUATO","11DPT0002P",120,"MEAE910606I30","MEAE910606HGTJGD01","EDGAR EMMANUEL MEJIA AGUILA             ",null,0,1130,1003,0,29,"S01201",0,2574,null,null,20160701,20160930,29667.370000000003,0]
[null,"GUANAJUATO","11DPT0013V",120,"MEES880125B67","MEES880125MGTZSN02","SANDRA MARGARITA MEZA ESTRADA           ",null,0,1130,1003,3,2,"S01201",0,18860,null,null,20160701,20160930,31992.69,0]
[null,"GUANAJUATO","11DPT0005M",120,"MEGG6410124T0","MEGG641012MGTDRL06","GLORIA MEDINA GARCIA                    ",null,0,1130,1003,0,72,"S01202",0,4415,null,null,20160701,20160930,40518.370000000003,0]
[null,"GUANAJUATO","11DPT0009I",120,"MEGM680209QU7","MEGM680209MGTDZR08","MARTHA SUSANA MEDEL GUZMAN              ",null,0,1130,1003,1,74,"S01201",0,8085,null,null,20160701,20160930,29514.949999999997,0]
[null,"GUANAJUATO","11DPT0004N",120,"MEGR631011V43","MEGR631011MGTNRS04","ROSA MENDEZ GARCIA                      ",null,0,1130,1003,1,28,"S01202",0,6514,null,null,20160701,20160930,43702.75,0]
[null,"GUANAJUATO","11DPT0008J",120,"MELJ7904219Z8","MELJ790421HGTLDN03","JUAN MAURICIO MELGOZA LEDESMA           ",null,0,1130,1003,2,33,"CF19201",0,10190,null,null,20160701,20160930,34133.97,0]
[null,"GUANAJUATO","11DPT0001Q",120,"MELN680719F21","MELN680719MGTLDR00","NORMA LETICIA MELGOZA LEDESMA           ",null,0,1130,1003,0,28,"CF34201",0,2504,null,null,20160701,20160930,42207.950000000004,0]
[null,"GUANAJUATO","11DPT0014U",120,"MEME901101QT3","MEME901101MGTNRL08","MARIA ELENA MENDOZA MARTINEZ            ",null,0,1130,1003,3,3,"A01801",0,18872,null,null,20160701,20160930,38701.800000000003]
[null,"GUANAJUATO","11DPT0005M",120,"MEMM670521N64","MEMM670521MDFDJR03","MARTHA PATRICIA MEDEL MEJIA             ",null,0,1130,1003,0,72,"CF33202",0,4420,null,null,20160701,20160930,50815.48,0]
[null,"GUANAJUATO","11DPT0001Q",120,"MEMM740704297","MEMM740704MDFDRR03","MIRNA MEDINA MARIN                      ",null,0,1130,1003,0,28,"S01202",0,2542,null,null,20160701,20160930,35587.619999999995,0]
[null,"GUANAJUATO","11DPT0009I",120,"MERA680725T53","MERA680725MGTJML04","ALMA DELIA MEJIA RAMOS                  ",null,0,1130,1003,1,74,"A03202",0,8078,null,null,20160701,20160930,45043.619999999995,0]
[null,"GUANAJUATO","11DPT0014U",120,"MERG840929RZ5","MERG840929MGTNDB06","GABRIELA MENDEZ RODRIGUEZ               ",null,0,1130,1003,3,3,"S01201",0,18875,null,null,20160701,20160930,22421.64]
[null,"GUANAJUATO","11APT0001T",100,"MESL860213877","MESL860213MGTNNR09","LOURDES PAULINA MENDOZA SANCHEZ         ",null,0,1130,1003,5,13,"CF33204",0,2660,null,null,20160701,20160930,59986.87000000001,0]
[null,"GUANAJUATO","11DPT0002P",120,"MEVJ760816A58","MEVJ760816HGTJLL19","JULIO ENRIQUE MEJIA VILLANUEVA          ",null,0,1130,1003,0,29,"CF33206",0,13252,null,null,20160701,20160930,116606.84,0]
[null,"GUANAJUATO","11DPT0001Q",120,"MIAO8312189C2","MIAO831218HDFLPM04","OMAR MILLAN APUD                        ",null,0,1130,1003,0,28,"CF33204",0,2519,null,null,20160701,20160930,56685.990000000005,0]
[null,"GUANAJUATO","11DPT0014U",120,"MIHG8606185P2","MIHG860618MDFRRB06","GABRIELA MIRAMONTES HERNANDEZ           ",null,0,1130,1003,3,3,"A03202",0,18868,null,null,20160701,20160930,32267.139999999996]
[null,"GUANAJUATO","11DPT0008J",120,"MOFD480314HT2","MOFD480314HGTRLL00","JOSE DOLORES MORALES FLORES             ",null,0,1130,1003,2,33,"S01202",0,10194,null,null,20160701,20160930,42560.840000000004,0]
[null,"GUANAJUATO","11DPT0002P",120,"MOFD741006FM4","MOFD741006HGTSLV05","DAVID MOSQUEDA FLORES                   ",null,0,1130,1003,0,29,"CF18203",0,11914,null,null,20160701,20160930,42731.87,0]
[null,"GUANAJUATO","11DPT0002P",120,"MOFY680125UV7","MOFY680125MGTSLL00","YOLANDA MOSQUEDA FLORES                 ",null,0,1130,1003,0,29,"T08201",0,690,null,null,20160701,20160930,50059.99,0]
[null,"GUANAJUATO","11APT0001T",100,"MOGM581228P96","MOGM581228MGTRNR09","MARTHA DEL CARME MORENO GONZALEZ        ",null,0,1130,1003,5,13,"A01801",0,18843,null,null,20160701,20160930,45841.68,0]
[null,"GUANAJUATO","11DPT0001Q",120,"MOHA6909151AA","MOHA690915MGTRRN03","ANDREA MORALES HERNANDEZ                ",null,0,1130,1003,0,28,"S01202",0,2548,null,null,20160701,20160930,34278.5,0]
[null,"GUANAJUATO","11DPT0014U",120,"MOJC851117J2A","MOJC851117MGTRST08","CITLALLI TONANCI MORA JASSO             ",null,0,1130,1003,3,3,"CF33206",0,18863,null,null,20160701,20160930,96335.77]
[null,"GUANAJUATO","11DPT0013V",120,"MOLJ6908066K2","MOLJ690806HGTNRN01","JUAN ANTONIO MONTALVO LIRA              ",null,0,1130,1003,3,2,"CF33204",0,18855,null,null,20160701,20160930,72162.450000000012,0]
[null,"GUANAJUATO","11DPT0011X",120,"MOMA590424218","MOMA590424HGTNLN04","JOSE ANTONIO MONCADA MALDONADO          ",null,0,1130,1003,2,49,"CF34201",0,10609,null,null,20160701,20160930,43674.38,0]
[null,"GUANAJUATO","11DPT0007K",120,"MORA580316U78","MORA580316HGTJML06","ALEJANDRO MOJICA RAMIREZ                ",null,0,1130,1003,2,3,"CF18203",0,2641,null,null,20160701,20160930,47203.909999999996,0]
[null,"GUANAJUATO","11DPT0005M",120,"MORM6501066X7","MORM650106HGTRSL00","MELCHOR BENITO MORENO ROSALES           ",null,0,1130,1003,0,72,"CF33206",0,14320,null,null,20160701,20160930,110997.87000000001,0]
[null,"GUANAJUATO","11DPT0004N",120,"MORM731010QZ9","MORM731010MVZLZR03","MIRSA MARICELA MOLGORA RAZO             ",null,0,1130,1003,1,28,"CF02104",0,12767,null,null,20160701,20160930,90482.46,0]
[null,"GUANAJUATO","11DPT0005M",120,"MORM8011214B7","MORM801121HDFRMN03","MANUEL EFRAIN MORENO ROMERO             ",null,0,1130,1003,0,72,"S01201",0,4389,null,null,20160701,20160930,37497.57,0]
[null,"GUANAJUATO","11DPT0006L",120,"MOSJ790615LD6","MOSJ790615HGTLNN00","JUAN MOLINA SANCHEZ                     ",null,0,1130,1003,1,63,"A03202",0,7688,null,null,20160701,20160930,39983.44999999999,0]
[null,"GUANAJUATO","11DPT0006L",120,"MOSP780508DF7","MOSP780508HGTLND02","PEDRO MOLINA SANCHEZ                    ",null,0,1130,1003,1,63,"CF18203",0,7713,null,null,20160701,20160930,45051.25,0]
[null,"GUANAJUATO","11DPT0012W",120,"MUHA861028V94","MUHA861028HGTXRD02","JOSE ADAN MUÐOZ HERNANDEZ               ",null,0,1130,1003,4,2,"S01201",0,2516,null,null,20160701,20160930,33036.720000000001,0]
[null,"GUANAJUATO","11DPT0007K",120,"MUPT600105IQ9","MUPT600105MGTRRR07","MA TRINIDAD MURILLO PEREZ               ",null,0,1130,1003,2,3,"CF34201",0,9205,null,null,20160701,20160930,37975.149999999994,0]
[null,"GUANAJUATO","11DPT0001Q",120,"MUSF920131FC2","MUSF920131MGTXCR06","MARIA FERNANDA MUÐOZ SAUCILLO           ",null,0,1130,1003,0,28,"S01202",0,2534,null,null,20160701,20160930,30963.1,0]
[null,"GUANAJUATO","11DPT0003O",120,"NAME6411037H1","NAME641103MDFVDV03","EVA NAVARRO MADRIGAL                    ",null,0,1130,1003,0,30,"A03202",0,9169,null,null,20160701,20160930,38045.14,0]
[null,"GUANAJUATO","11DPT0014U",120,"NAQI780206S92","NAQI780206HDFVXV07","IVAN AGUSTIN NAVARRETE QUIÐONES         ",null,0,1130,1003,3,3,"CF21202",0,18874,null,null,20160701,20160930,44605.359999999993]
[null,"GUANAJUATO","11DPT0006L",120,"NAVS621206356","NAVS621206MGTVLN00","SANDRA JUANA NAVA VELAZQUEZ             ",null,0,1130,1003,1,63,"CF33204",0,7704,null,null,20160701,20160930,76752.479999999996,0]
[null,"GUANAJUATO","11DPT0011X",120,"NAZA870510IS9","NAZA870510HGTVVN07","JOSE ANTONIO NAVARRETE ZAVALA           ",null,0,1130,1003,2,49,"CF18201",0,6515,null,null,20160701,20160930,26891.450000000004,0]
[null,"GUANAJUATO","11DPT0001Q",120,"NIHE721201VC3","NIHE721201HGTTRS04","EUSEBIO MIGUEL A NIETO HERNANDEZ        ",null,0,1130,1003,0,28,"S01202",0,2541,null,null,20160701,20160930,38244.910000000003,0]
[null,"GUANAJUATO","11DPT0005M",120,"NIMA711025LJ1","NIMA711025MGTTRL07","ALICIA NIETO MARTINEZ                   ",null,0,1130,1003,0,72,"A03202",0,4384,null,null,20160701,20160930,44456.03,0]
[null,"GUANAJUATO","11DPT0005M",120,"NIMT691014GT1","NIMT691014MGTTRR05","TERESITA NIETO MARTINEZ                 ",null,0,1130,1003,0,72,"CF18201",0,4429,null,null,20160701,20160930,31019.719999999998,0]
[null,"GUANAJUATO","11DPT0003O",120,"NIRA700123GK9","NIRA700123MGTTVN01","ANA LAURA NIETO RIVERA                  ",null,0,1130,1003,0,30,"CF33206",0,14316,null,null,20160701,20160930,123661.44,0]
[null,"GUANAJUATO","11DPT0007K",120,"NIRG591215T84","NIRG591215MGTTVR06","GEORGINA DE LOURD NIETO RIVERA          ",null,0,1130,1003,2,3,"CF02103",0,12576,null,null,20160701,20160930,92369.4,0]
[null,"GUANAJUATO","11DPT0001Q",120,"NUBS660923RQA","NUBS660923MGTXRL07","MA.SILVIA NUÐEZ BARRERA                 ",null,0,1130,1003,0,28,"CF21202",0,2547,null,null,20160701,20160930,45012.39,0]
[null,"GUANAJUATO","11DPT0008J",120,"NUCS580811UI9","NUCS580811MGTXRS04","SUSANA NUÐEZ CERRITOS                   ",null,0,1130,1003,2,33,"A03202",0,5548,null,null,20160701,20160930,44263.93,0]
[null,"GUANAJUATO","11DPT0010Y",120,"OAGS860412RP6","OAGS860412MGTRTR05","SARA DEL ROSARIO ORRANTI GUTIERREZ      ",null,0,1130,1003,2,4,"S01201",0,9221,null,null,20160701,20160930,33896.29,0]
[null,"GUANAJUATO","11DPT0001Q",120,"OAMC600520F43","OAMC600520HSLLLR01","CARLOS JAVIER OLAVEZ MELESIO            ",null,0,1130,1003,0,28,"CF19201",0,2543,null,null,20160701,20160930,46196.909999999996,0]
[null,"GUANAJUATO","11DPT0012W",120,"OELW670610C88","OELW670610HGTLDN06","WENCESLAO OLVERA LEDESMA                ",null,0,1130,1003,4,2,"CF18203",0,11932,null,null,20160701,20160930,43089.22,0]
[null,"GUANAJUATO","11APT0001T",100,"OERL7305255H3","OERL730525HGTJDS00","LUIS ALBERTO OJEDA RODRIGUEZ            ",null,0,1130,1003,7,5,"CF11102",0,14556,null,null,20160701,20160930,114455.7,0]
[null,"GUANAJUATO","11DPT0012W",120,"OERM770419UD7","OERM770419HGTLSG03","MIGUEL ANGEL OLVERA RESENDIZ            ",null,0,1130,1003,4,2,"A03202",0,10293,null,null,20160701,20160930,41962.29,0]
[null,"GUANAJUATO","11DPT0008J",120,"OETL661122IZ6","OETL661122MGTRRZ06","LUZ CECILIA ORTEGA TORRES               ",null,0,1130,1003,2,33,"CF04201",0,2491,null,null,20160701,20160930,37377.109999999993,0]
[null,"GUANAJUATO","11DPT0004N",120,"OEVL650213T59","OEVL650213MGTRLR01","LAURA INES ORTEGA VALADEZ               ",null,0,1130,1003,1,28,"CF33206",0,14314,null,null,20160701,20160930,127154.9,0]
[null,"GUANAJUATO","11DPT0007K",120,"OILH810313JS5","OILH810313HGTVGC18","HECTOR GERARDO OVIEDO LUGO              ",null,0,1130,1003,2,3,"S01201",0,9203,null,null,20160701,20160930,22105.439999999999,0]
[null,"GUANAJUATO","11DPT0007K",120,"OILP6802156K9","OILP680215MDFVGL09","MARIA DEL PILAR OVIEDO LUGO             ",null,0,1130,1003,2,3,"A03202",0,9168,null,null,20160701,20160930,41588.89,0]
[null,"GUANAJUATO","11APT0001T",100,"OING5906128T6","OING590612HGTRCS02","GUSTAVO ORTIZ NICASIO                   ",null,0,1130,1003,5,13,"CF18203",0,7719,null,null,20160701,20160930,47209.77,0]
[null,"GUANAJUATO","11DPT0003O",120,"OIOM621117BE8","OIOM621117HGTLLN02","MANUEL MARTIN OLIVA OLIVA               ",null,0,1130,1003,0,30,"CF18203",0,2648,null,null,20160701,20160930,51160.05,0]
[null,"GUANAJUATO","11APT0001T",100,"OISI790511DD8","OISI790511HHGLNS14","ISMAEL OLIVO SANCHEZ                    ",null,0,1130,1003,7,5,"S01201",0,2653,null,null,20160701,20160930,28709.229999999996,0]
[null,"GUANAJUATO","11DPT0014U",120,"OOCM7903122F9","OOCM790312MGTRRR03","MARCELA OROZCO CORNEJO                  ",null,0,1130,1003,3,3,"CF33204",0,18865,null,null,20160701,20160930,68630.97]
[null,"GUANAJUATO","11DPT0005M",120,"OUGM7012272G3","OUGM701227MGTRRN03","MONICA ORDUNA GARCIA                    ",null,0,1130,1003,0,72,"S01202",0,4418,null,null,20160701,20160930,32958.910000000003,0]
[null,"GUANAJUATO","11DPT0005M",120,"PACM840215MT1","PACM840215MGTLRR00","MAURA ANGELICA PALOMINO CARREÐO         ",null,0,1130,1003,0,72,"S01201",0,4417,null,null,20160701,20160930,27156.58,0]
[null,"GUANAJUATO","11DPT0008J",120,"PACM941015U40","PACM941015MGTLRR06","MARIANA PALOMINO CARRE±O                ",null,0,1130,1003,2,33,"S01201",0,10189,null,null,20160701,20160930,29643.93,0]
[null,"GUANAJUATO","11DPT0001Q",120,"PACS8101228Y0","PACS810122MGTLRR02","SARA PALOMINO CARREÐO                   ",null,0,1130,1003,0,28,"S01202",0,2525,null,null,20160701,20160930,29461.64,0]
[null,"GUANAJUATO","11DPT0005M",120,"PAGM5802105H5","PAGM580210HNTLRT06","MATIAS PALOMARES GARCIA                 ",null,0,1130,1003,0,72,"S01202",0,4408,null,null,20160701,20160930,34742.65,0]
[null,"GUANAJUATO","11DPT0004N",120,"PAGR7307144R1","PAGR730714MGTNMF00","MARIA DEL REFUGIO PANTOJA GOMEZ         ",null,0,1130,1003,1,28,"CF21202",0,6518,null,null,20160701,20160930,49839.359999999993,0]
[null,"GUANAJUATO","11DPT0006L",120,"PAHM630123LJ6","PAHM630123HGTNRN05","MANUEL PANTOJA HERRERA                  ",null,0,1130,1003,1,63,"CF33206",0,13986,null,null,20160701,20160930,119951.73999999998,0]
[null,"GUANAJUATO","11DPT0008J",120,"PAJJ830708SK1","PAJJ830708HQTTMR06","JORGE ADALBERTO PATINO JIMENEZ          ",null,0,1130,1003,2,33,"CF34202",0,12051,null,null,20160701,20160930,35690.350000000006,0]
[null,"GUANAJUATO","11DPT0002P",120,"PALM711130LV9","PALM711130HGTRGG02","MIGUEL ANGEL PARAMO LAGUNA              ",null,0,1130,1003,0,29,"CF34201",0,2596,null,null,20160701,20160930,41606.460000000006,0]
[null,"GUANAJUATO","11DPT0003O",120,"PAPA810618AR6","PAPA810618HGTLLB03","ABRAHAM PALACIOS PALACIOS               ",null,0,1130,1003,0,30,"S01202",0,2637,null,null,20160701,20160930,32931.31,0]
[null,"GUANAJUATO","11DPT0007K",120,"PAZR620620HP0","PAZR620620MGTCPQ07","RAQUEL PACHECO ZAPIEN                   ",null,0,1130,1003,2,3,"CF33204",0,9194,null,null,20160701,20160930,84090.180000000008,0]
[null,"GUANAJUATO","11DPT0012W",120,"PECE671111QE4","PECE671111HDFRSL09","ELOY MARTIN PEREZ CASTILLO              ",null,0,1130,1003,4,2,"CF33206",0,14253,null,null,20160701,20160930,119035.61000000002,0]
[null,"GUANAJUATO","11APT0001T",100,"PEGL590326TB4","PEGL590326MGTRMZ05","LUZ ELENA PERALES GOMEZ                 ",null,0,1130,1003,5,13,"CF33203",0,2575,null,null,20160701,20160930,40320.129999999997,0]
[null,"GUANAJUATO","11APT0001T",100,"PELI680925LM6","PELI680925MGTDPV03","IVONNE YOLANDA PEDROZA LOPEZ            ",null,0,1130,1003,5,13,"CF33206",0,10303,null,null,20160701,20160930,118773.06,0]
[null,"GUANAJUATO","11DPT0010Y",120,"PELL790204HW5","PELL790204MNTRRC05","LUCIA PEREZ LARA                        ",null,0,1130,1003,2,4,"S01201",0,9228,null,null,20160701,20160930,35964.92,0]
[null,"GUANAJUATO","11APT0001T",100,"PESE6410262W2","PESE641026HTSRNR02","ERNESTO PEREZ SANCHEZ                   ",null,0,1130,1003,7,5,"CF01601",0,11098,null,null,20160701,20160930,90553.079999999987,0]
[null,"GUANAJUATO","11DPT0005M",120,"PIAR680730PSA","PIAR680730MGTRGG01","MARIA REGINA PRIETO AGUILAR             ",null,0,1130,1003,0,72,"CF33204",0,2202,null,null,20160701,20160930,83011.320000000007,0]
[null,"GUANAJUATO","11DPT0001Q",120,"PIOP550618BT2","PIOP550618HGTCLB08","PABLO PICHARDO OLVERA                   ",null,0,1130,1003,0,28,"A03202",0,2494,null,null,20160701,20160930,45793.25,0]
[null,"GUANAJUATO","11DPT0012W",120,"POGA790726B24","POGA790726MGTNZL05","ALMA DELIA PONCE GUZMAN                 ",null,0,1130,1003,4,2,"CF04201",0,1440,null,null,20160701,20160930,48590.82,0]
[null,"GUANAJUATO","11DPT0007K",120,"POMR6708302N1","POMR670830MGTRNS05","ROSA MARIA PORRAS MANRIQUE              ",null,0,1130,1003,2,3,"CF33204",0,2642,null,null,20160701,20160930,77014.210000000006,0]
[null,"GUANAJUATO","11APT0001T",100,"PUAJ821120LU8","PUAJ821120MJCGLN05","JUANA PUGA ALDANA                       ",null,0,1130,1003,5,13,"S01202",0,2636,null,null,20160701,20160930,34036.770000000004,0]
[null,"GUANAJUATO","11DPT0006L",120,"QUDW870430HH4","QUDW870430MGTNMN07","WENDY YAZMIN QUINTANA DOMINGUEZ         ",null,0,1130,1003,1,63,"CF21202",0,7721,null,null,20160701,20160930,39292.46,0]
[null,"GUANAJUATO","11DPT0001Q",120,"QUGE620101NK4","QUGE620101HGTNRF01","EFRAIN QUINTANA GARCIA                  ",null,0,1130,1003,0,28,"S01202",0,2552,null,null,20160701,20160930,34420.36,0]
[null,"GUANAJUATO","11APT0001T",100,"QUZJ6303282J5","QUZJ630328HSRLNN05","JUAN QUILES ZUNO                        ",null,0,1130,1003,5,13,"A01801",0,18844,null,null,20160701,20160930,42808.079999999994,0]
[null,"GUANAJUATO","11DPT0014U",120,"RAAE850827HM7","RAAE850827MGTMNL05","ELVIA RAMIREZ ANDRADE                   ",null,0,1130,1003,3,3,"S01201",0,18885,null,null,20160701,20160930,33012.050000000003]
[null,"GUANAJUATO","11DPT0001Q",120,"RAAG5908278S6","RAAG590827HMNNBL08","GUILLERMO RANGEL ABURTO                 ",null,0,1130,1003,0,28,"CF18203",0,4397,null,null,20160701,20160930,52419.54,0]
[null,"GUANAJUATO","11DPT0014U",120,"RAAI811229BW5","RAAI811229MMCMNS05","MARIA ISABEL RAMIREZ ANDRADE            ",null,0,1130,1003,3,3,"CF33203",0,18876,null,null,20160701,20160930,50265.299999999996]
[null,"GUANAJUATO","11DPT0010Y",120,"RABR820601BH9","RABR820601HGTMND08","RODOLFO OSVALDO RAMIREZ BUENO           ",null,0,1130,1003,2,4,"CF33206",0,13543,null,null,20160701,20160930,95982.860000000015,0]
[null,"GUANAJUATO","11DPT0008J",120,"RACA8011159T0","RACA801115MGTMRD05","ADELA RAMIREZ CERRITOS                  ",null,0,1130,1003,2,33,"S01202",0,10174,null,null,20160701,20160930,36780.350000000006,0]
[null,"GUANAJUATO","11DPT0011X",120,"RACB5510265G3","RACB551026HGTMSN05","BENITO RAMIREZ CASTILLO                 ",null,0,1130,1003,2,49,"A03202",0,10292,null,null,20160701,20160930,44769.430000000008,0]
[null,"GUANAJUATO","11APT0001T",100,"RAEL8409015U2","RAEL840901MGTMSR07","LAURA PATRICIA RAMOS ESTRADA            ",null,0,1130,1003,5,13,"CF33206",0,10307,null,null,20160701,20160930,91680.39,0]
[null,"GUANAJUATO","11DPT0005M",120,"RAFA620326696","RAFA620326HGTMNN00","JOSE ANTONIO RAMIREZ FUENTES            ",null,0,1130,1003,0,72,"CF33206",0,13772,null,null,20160701,20160930,121092.41999999998,0]
[null,"GUANAJUATO","11DPT0008J",120,"RAFG691106392","RAFG691106HGTMRR04","GERARDO RAMIREZ FERNANDEZ               ",null,0,1130,1003,2,33,"CF02104",0,12749,null,null,20160701,20160930,90482.46,0]
[null,"GUANAJUATO","11DPT0010Y",120,"RAGJ8207054L2","RAGJ820705HGTNMN05","JUAN ANTONIO RANGEL GOMEZ               ",null,0,1130,1003,2,4,"CF21202",0,9216,null,null,20160701,20160930,43913.02,0]
[null,"GUANAJUATO","11DPT0012W",120,"RAGT730306AI0","RAGT730306HGTNRR07","JOSE TRINIDAD RANGEL GUERRERO           ",null,0,1130,1003,4,2,"A01801",0,18845,null,null,20160701,20160930,46058.07,0]
[null,"GUANAJUATO","11DPT0007K",120,"RAHJ6410105C3","RAHJ641010MGTMRS04","MA. DE JESUS RAMIREZ HORTA              ",null,0,1130,1003,2,3,"CF33206",0,13317,null,null,20160701,20160930,121941.6,0]
[null,"GUANAJUATO","11DPT0002P",120,"RAHL900721A16","RAHL900721MGTNRL09","LILIANA BERENICE RANGEL HERNANDEZ       ",null,0,1130,1003,0,29,"CF18201",0,2573,null,null,20160701,20160930,26039.199999999997,0]
[null,"GUANAJUATO","11APT0001T",100,"RALU580110A37","RAXL580110HGTMXS01","LUIS FERNANDO RAMOS                     ",null,0,1130,1003,7,5,"CF02105",0,14601,null,null,20160701,20160930,78517.2,0]
[null,"GUANAJUATO","11APT0001T",100,"RAMA640606AQ0","RAMA640606HGTNXL06","ALBERTO RANGEL MUÐOZ                    ",null,0,1130,1003,7,5,"ED01201",0,2619,null,null,20160701,20160930,42817.89,0]
[null,"GUANAJUATO","11APT0001T",100,"RAMD6103291R4","RAMD610329HGTMNV10","DAVID RAMIREZ MONJARAZ                  ",null,0,1130,1003,7,5,"CF21202",0,1687,null,null,20160701,20160930,40218.5,0]
[null,"GUANAJUATO","11DPT0003O",120,"RARE590716V64","RARE590716MJCMMV05","EVELIA DEL CARMEN RAMIREZ RAMIREZ       ",null,0,1130,1003,0,30,"CF33203",0,9197,null,null,20160701,20160930,51410.860000000008,0]
[null,"GUANAJUATO","11DPT0007K",120,"RARP630605NP2","RARP630605HJCMMD06","PEDRO RAMIREZ RAMIREZ                   ",null,0,1130,1003,2,3,"S01202",0,2621,null,null,20160701,20160930,39910.269999999997,0]
[null,"GUANAJUATO","11DPT0003O",120,"RARR701207IA9","RARR701207MDFMMT08","RITA RAMIREZ RAMIREZ                    ",null,0,1130,1003,0,30,"CF04201",0,9170,null,null,20160701,20160930,40880.229999999996,0]
[null,"GUANAJUATO","11DPT0010Y",120,"RARR710422AB6","RARR710422HGTMDM09","RAMON RAMIREZ RODRIGUEZ                 ",null,0,1130,1003,2,4,"CF33204",0,10192,null,null,20160701,20160930,80533.960000000006,0]
[null,"GUANAJUATO","11DPT0008J",120,"RASE540830U28","RASE540830HGTYLL02","ELEAZAR RAYAS SILVA                     ",null,0,1130,1003,2,33,"CF18203",0,10187,null,null,20160701,20160930,49707.8,0]
[null,"GUANAJUATO","11DPT0008J",120,"RASJ781020U88","RASJ781020MGTZSS02","JOSEFINA RAZO SOSA                      ",null,0,1130,1003,2,33,"CF33206",0,14312,null,null,20160701,20160930,71496.060000000012,0]
[null,"GUANAJUATO","11DPT0009I",120,"RELR6206286CA","RELR620628HGTYPG09","ROGELIO REYES LOPEZ                     ",null,0,1130,1003,1,74,"CF18203",0,8094,null,null,20160701,20160930,53671.32,0]
[null,"GUANAJUATO","11DPT0013V",120,"RELS650704P63","RELS650704MGTXZL00","MA. SOLEDAD REA LOZANO                  ",null,0,1130,1003,3,2,"A01801",0,18877,null,null,20160701,20160930,55539.229999999996,0]
[null,"GUANAJUATO","11DPT0001Q",120,"RERE8505068T2","RERE850506HMNYMD04","EDUARDO REYES RAMIREZ                   ",null,0,1130,1003,0,28,"S01202",0,2508,null,null,20160701,20160930,30208.78,0]
[null,"GUANAJUATO","11APT0001T",100,"RESA730203TA5","RESA730203MGTYNN04","ANA CELIA REYNOSO SANCHEZ               ",null,0,1130,1003,5,13,"CF02100",0,12458,null,null,20160701,20160930,113531.28000000001,0]
[null,"GUANAJUATO","11DPT0014U",120,"RESO730809AI4","RESO730809MGTYNF03","OFELIA REYES SANDOVAL                   ",null,0,1130,1003,3,3,"CF18203",0,18873,null,null,20160701,20160930,40073.700000000004]
[null,"GUANAJUATO","11DPT0001Q",120,"RIAA790529868","RIAA790529MMNSGN11","ANA KATHERINE RIOS AGUILAR              ",null,0,1130,1003,0,28,"CF02105",0,14595,null,null,20160701,20160930,78517.2,0]
[null,"GUANAJUATO","11DPT0011X",120,"RIGA780625KX0","RIGA780625HGTVMG07","JOSE AUGUSTO RIVERA GOMEZ               ",null,0,1130,1003,2,49,"S01202",0,10597,null,null,20160701,20160930,39490.089999999997,0]
[null,"GUANAJUATO","11DPT0014U",120,"RIHR880331D30","RIHR880331HGTSRC09","RICARDO RIOS HERNANDEZ                  ",null,0,1130,1003,3,3,"CF33204",0,18867,null,null,20160701,20160930,60993.549999999988]
[null,"GUANAJUATO","11DPT0007K",120,"RIOS5803272M4","RIOS580327MZSVLC03","MA. DEL SOCORRO RIVERA OLVERA           ",null,0,1130,1003,2,3,"CF33204",0,9199,null,null,20160701,20160930,75697.640000000014,0]
[null,"GUANAJUATO","11DPT0002P",120,"ROBA710226BG0","RXBA710226MGTBRL07","ALMA ROBLES BRAVO                       ",null,0,1130,1003,0,29,"CF34201",0,2587,null,null,20160701,20160930,39673.770000000004,0]
[null,"GUANAJUATO","11DPT0002P",120,"ROBB6412029G0","ROBB641202MGTBRL04","BLANCA ESTELA ROBLES BRAVO              ",null,0,1130,1003,0,29,"CF21202",0,2588,null,null,20160701,20160930,48401.590000000004,0]
[null,"GUANAJUATO","11DPT0001Q",120,"ROBY7612249Q3","ROBY761224MMCDCN00","YUNUEN RODRIGUEZ BECERRA                ",null,0,1130,1003,0,28,"CF34202",0,2537,null,null,20160701,20160930,38187.49,0]
[null,"GUANAJUATO","11DPT0008J",120,"ROCS8704055G4","ROCS870405MMCDSL06","MARIA DEL SOL RODRIGUEZ CASTRO          ",null,0,1130,1003,2,33,"CF33204",0,10188,null,null,20160701,20160930,57921.87000000001,0]
[null,"GUANAJUATO","11DPT0002P",120,"RODY660703MQ8","RODY660703MGTXLL07","YOLANDA ROA DELGADO                     ",null,0,1130,1003,0,29,"CF33204",0,2598,null,null,20160701,20160930,79333.86,0]
[null,"GUANAJUATO","11DPT0001Q",120,"ROEJ700824751","ROEJ700824HVZMSL05","JULIO CESAR ROMERO ESCOBAR              ",null,0,1130,1003,0,28,"S01201",0,2506,null,null,20160701,20160930,32488.739999999998,0]
[null,"GUANAJUATO","11DPT0003O",120,"ROFL910916ES9","ROFL910916MGTBNR05","LORENA ROBLEDO FONSECA                  ",null,0,1130,1003,0,30,"CF18202",0,11099,null,null,20160701,20160930,22421.64,0]
[null,"GUANAJUATO","11DPT0011X",120,"ROGA640613DQ5","ROGA640613MDFJTN05","ANTONIA ESTELA ROJAS GUTIERREZ          ",null,0,1130,1003,2,49,"CF33206",0,14318,null,null,20160701,20160930,102324.61000000002,0]
[null,"GUANAJUATO","11DPT0007K",120,"ROGF800428M80","ROGF800428HGTDZD06","FIDEL RODRIGUEZ GUZMAN                  ",null,0,1130,1003,2,3,"CF33204",0,9201,null,null,20160701,20160930,47942.39,0]
[null,"GUANAJUATO","11DPT0003O",120,"ROGJ631018GD6","ROGJ631018HGTMRN04","JUAN JOSE ROMERO GARCIA                 ",null,0,1130,1003,0,30,"CF19201",0,2620,null,null,20160701,20160930,50402.100000000006,0]
[null,"GUANAJUATO","11DPT0007K",120,"ROGJ720412CD2","ROGJ720412HGTCNL01","JULIO BERNARDO ROCHA GONZALEZ           ",null,0,1130,1003,2,3,"CF33202",0,2652,null,null,20160701,20160930,47338.37,0]
[null,"GUANAJUATO","11DPT0008J",120,"ROGJ7905253Y5","ROGJ790525HPLJDN05","JOSE JUAN ROJAS GODOY                   ",null,0,1130,1003,2,33,"CF33206",0,13502,null,null,20160701,20160930,109131.6,0]
[null,"GUANAJUATO","11DPT0007K",120,"ROGL591003DS4","ROGL591003MGTMNN05","MA.LINA TERESA ROMERO GONZALEZ          ",null,0,1130,1003,2,3,"CF34202",0,4402,null,null,20160701,20160930,38288.949999999997,0]
[null,"GUANAJUATO","11DPT0008J",120,"ROHH851230UU9","ROHH851230HGTJRR04","HERNAN ROJAS HERNANDEZ                  ",null,0,1130,1003,2,33,"S01201",0,2532,null,null,20160701,20160930,29583.550000000003,0]
[null,"GUANAJUATO","11DPT0001Q",120,"ROHR681221N53","ROHR681221MGTJRB00","RUBISELA ROJAS HUARACHA                 ",null,0,1130,1003,0,28,"CF33204",0,10599,null,null,20160701,20160930,85915.78,0]
[null,"GUANAJUATO","11DPT0007K",120,"ROMI501119KW9","ROMI501119HGTCZS14","J. ISABEL ROCHA MEZA                    ",null,0,1130,1003,2,3,"S01201",0,9202,null,null,20160701,20160930,38926.81,0]
[null,"GUANAJUATO","11DPT0001Q",120,"ROMR681004UF2","ROMR681004HGTDRM02","RAMIRO RODRIGUEZ MARTINEZ               ",null,0,1130,1003,0,28,"CF18203",0,2507,null,null,20160701,20160930,49580.479999999996,0]
[null,"GUANAJUATO","11DPT0013V",120,"ROMR861218274","ROMR861218HGTDGC00","RICARDO RODRIGUEZ MAGDALENO             ",null,0,1130,1003,3,2,"CF33206",0,18849,null,null,20160701,20160930,83173.850000000006,0]
[null,"GUANAJUATO","11DPT0009I",120,"ROPJ630922717","ROPJ630922MGTDRS08","JOSEFINA RODRIGUEZ PEREZ                ",null,0,1130,1003,1,74,"A03202",0,8080,null,null,20160701,20160930,42599.26,0]
[null,"GUANAJUATO","11DPT0001Q",120,"ROPR4911033YA","ROPR491103HGTDTF04","RAFAEL RODRIGUEZ PATINO                 ",null,0,1130,1003,0,28,"S01202",0,2539,null,null,20160701,20160930,36717.440000000002,0]
[null,"GUANAJUATO","11DPT0011X",120,"ROPR8607125H9","ROPR860712MGTDNS08","ROSA AIDE RODRIGUEZ PANIAGUA            ",null,0,1130,1003,2,49,"CF33206",0,12915,null,null,20160701,20160930,83173.850000000006,0]
[null,"GUANAJUATO","11DPT0013V",120,"RORA760321A25","RORA760321HGTDDL07","ALEXANDER DANIEL RODRIGUEZ RODRIGUEZ    ",null,0,1130,1003,3,2,"CF02104",0,18848,null,null,20160701,20160930,90482.46,0]
[null,"GUANAJUATO","11DPT0013V",120,"RORC850223K78","RORC850223HGTDMR02","CARLOS ALBERTO RODRIGUEZ RAMIREZ        ",null,0,1130,1003,3,2,"CF18203",0,18879,null,null,20160701,20160930,40191.94,0]
[null,"GUANAJUATO","11DPT0005M",120,"RORF650224FV1","RORF650224HDFDDR03","FERNANDO RODRIGUEZ RODRIGUEZ            ",null,0,1130,1003,0,72,"S01202",0,4395,null,null,20160701,20160930,33652.11,0]
[null,"GUANAJUATO","11DPT0003O",120,"RORJ800328CB1","RORJ800328HGTDMN01","JUAN PABLO RODRIGUEZ RAMIREZ            ",null,0,1130,1003,0,30,"A03202",0,2613,null,null,20160701,20160930,42701.709999999992,0]
[null,"GUANAJUATO","11DPT0002P",120,"ROSA621019UW4","ROSA621019HGTDNG01","AGAPITO RODRIGUEZ SANCHEZ               ",null,0,1130,1003,0,29,"CF19201",0,2583,null,null,20160701,20160930,44717.869999999995,0]
[null,"GUANAJUATO","11DPT0013V",120,"ROSJ840320PL5","ROSJ840320MMCMGL06","JULIA OYUKI ROMERO SEGURA               ",null,0,1130,1003,3,2,"A03202",0,18880,null,null,20160701,20160930,11259.48,0]
[null,"GUANAJUATO","11DPT0010Y",120,"ROTF640526L74","ROTF640526HGTDVL07","FELIPE RODRIGUEZ TOVAR                  ",null,0,1130,1003,2,4,"CF19201",0,9217,null,null,20160701,20160930,36509.74,0]
[null,"GUANAJUATO","11DPT0008J",120,"ROVA500401GUA","ROVA500401HGTJLR05","ARTURO ROJAS VALENCIA                   ",null,0,1130,1003,2,33,"S01202",0,8084,null,null,20160701,20160930,47248.759999999995,0]
[null,"GUANAJUATO","11DPT0010Y",120,"ROVL470314635","ROVL470314HGTXGS09","LUIS RUBEN ROA VEGA                     ",null,0,1130,1003,2,4,"CF34202",0,2655,null,null,20160701,20160930,37491.58,0]
[null,"GUANAJUATO","11DPT0012W",120,"ROVR751027UW3","ROVR751027MGTBRS09","MARIA DEL ROSARI ROBLES VARGAS          ",null,0,1130,1003,4,2,"S01201",0,2662,null,null,20160701,20160930,36495.08,0]
[null,"GUANAJUATO","11DPT0003O",120,"ROVS5612313Z0","ROVS561231HGTBNL05","J. SILVESTRE ROBLEDO VENEGAS            ",null,0,1130,1003,0,30,"ED01201",0,2656,null,null,20160701,20160930,46730.369999999995,0]
[null,"GUANAJUATO","11DPT0008J",120,"ROZA560516SE3","ROZA560516HGTJPB08","ABEL ROJAS ZAPATERO                     ",null,0,1130,1003,2,33,"CF33203",0,10178,null,null,20160701,20160930,50782.05,0]
[null,"GUANAJUATO","11DPT0013V",120,"RUER840817TJ2","RUER840817HGTZSN07","RENE RUIZ ESPINOZA                      ",null,0,1130,1003,3,2,"A01801",0,18856,null,null,20160701,20160930,43125.79,0]
[null,"GUANAJUATO","11DPT0001Q",120,"RURO710818A13","RURO710818MGTZFL04","OLGA AMALIA RUIZ RUFINO                 ",null,0,1130,1003,0,28,"CF33202",0,2517,null,null,20160701,20160930,49347.839999999997,0]
[null,"GUANAJUATO","11DPT0009I",120,"SAAA790117M77","SAAA790117HGTNRL19","JOSE ALFREDO SANCHEZ ARREDONDO          ",null,0,1130,1003,1,74,"CF33206",0,13499,null,null,20160701,20160930,103323.38,0]
[null,"GUANAJUATO","11APT0001T",100,"SAAK880407FL7","SAAK880407MJCNNR03","KARLA ANGELINA SANDOVAL DE ANDA         ",null,0,1130,1003,5,13,"CF02105",0,12830,null,null,20160701,20160930,78517.2,0]
[null,"GUANAJUATO","11DPT0008J",120,"SABA620417HF9","SABA620417HVZNTN05","ANICETO SANTIAGO BAUTISTA               ",null,0,1130,1003,2,33,"CF33206",0,13504,null,null,20160701,20160930,125168.38999999998,0]
[null,"GUANAJUATO","11DPT0005M",120,"SABM631225F45","SABM631225HGTVRR06","MARTIN SALVADOR SAAVEDRA BRAVO          ",null,0,1130,1003,0,72,"S01202",0,4404,null,null,20160701,20160930,31412.639999999999,0]
[null,"GUANAJUATO","11DPT0007K",120,"SACA791207U75","SACA791207MGTLSL02","MARIA ALEJANDRA SALAZAR CASTANEDA       ",null,0,1130,1003,2,3,"CF02105",0,12840,null,null,20160701,20160930,78895.990000000005,0]
[null,"GUANAJUATO","11DPT0002P",120,"SACM851223UV7","SACM851223MDFNSN01","MONSERRAT SANCHEZ CISNEROS              ",null,0,1130,1003,0,29,"S01201",0,2601,null,null,20160701,20160930,32957.15,0]
[null,"GUANAJUATO","11DPT0007K",120,"SAGG7304218VA","SAGG730421MGTNLL02","GLORIA SANCHEZ GALVAN                   ",null,0,1130,1003,2,3,"CF19201",0,9188,null,null,20160701,20160930,43946.01,0]
[null,"GUANAJUATO","11DPT0001Q",120,"SAGM730131V93","SAGM730131MDFNRR07","MARCELA SANCHEZ GARCIA                  ",null,0,1130,1003,0,28,"CF33206",0,12914,null,null,20160701,20160930,90004.62000000001,0]
[null,"GUANAJUATO","11DPT0004N",120,"SAGN550328R1A","SAGN550328HGTNMC00","NICOLAS SANTOYO GOMEZ                   ",null,0,1130,1003,1,28,"S01202",0,6509,null,null,20160701,20160930,7534.86,0]
[null,"GUANAJUATO","11DPT0002P",120,"SAGS78112652A","SAGS781126HGTLTS16","SASHA EMMANUEL SALINAS GUTIERREZ        ",null,0,1130,1003,0,29,"S01201",0,11702,null,null,20160701,20160930,33893.89,0]
[null,"GUANAJUATO","11DPT0012W",120,"SAHA7408317B1","SAHA740831MDFNRR01","AURELIA SANDOVAL HERNANDEZ              ",null,0,1130,1003,4,2,"S01201",0,11167,null,null,20160701,20160930,36317.439999999995,0]
[null,"GUANAJUATO","11APT0001T",100,"SAHE741012DCA","SAHE741012MGTNRS04","MA. ESTHER SANCHEZ HERNANDEZ            ",null,0,1130,1003,5,13,"CF01601",0,11097,null,null,20160701,20160930,90553.079999999987,0]
[null,"GUANAJUATO","11DPT0002P",120,"SAHI670121KQ3","SAHI670121MGTNRN07","MA. INES SANDOVAL HERNANDEZ             ",null,0,1130,1003,0,29,"CF04201",0,2561,null,null,20160701,20160930,45658.67,0]
[null,"GUANAJUATO","11DPT0002P",120,"SAHL6309234X5","SAHL630923HGTNRS00","LUIS MIGUEL SANCHEZ HERNANDEZ           ",null,0,1130,1003,0,29,"CF33204",0,2603,null,null,20160701,20160930,83011.320000000007,0]
[null,"GUANAJUATO","11DPT0004N",120,"SAHO620602LB0","SAHO620602HSRLRS06","OSMAN SALAZAR HERNANDEZ                 ",null,0,1130,1003,1,28,"S01201",0,6507,null,null,20160701,20160930,29874.720000000001,0]
[null,"GUANAJUATO","11DPT0002P",120,"SALM811102IP0","SALG811102MGTNGD00","MA. GUADALUPE SANCHEZ LAGUNA            ",null,0,1130,1003,0,29,"CF33204",0,2599,null,null,20160701,20160930,57052.740000000005,0]
[null,"GUANAJUATO","11DPT0008J",120,"SALS651213I40","SALS651213MGTNNN03","SANJUANA SANCHEZ LUNA                   ",null,0,1130,1003,2,33,"CF04201",0,10172,null,null,20160701,20160930,57888.73,0]
[null,"GUANAJUATO","11DPT0006L",120,"SAMG651113CLA","SAMG651113MGTVDD08","MARIA GUADALUPE SAAVEDRA MEDRANO        ",null,0,1130,1003,1,63,"CF34201",0,7700,null,null,20160701,20160930,42817.599999999999,0]
[null,"GUANAJUATO","11APT0001T",100,"SAML830406CC2","SAML830406HDFNNS01","LUIS ENRIQUE SANCHEZ MENDOZA            ",null,0,1130,1003,5,13,"CF33204",0,3181,null,null,20160701,20160930,59215.740000000005,0]
[null,"GUANAJUATO","11APT0001T",100,"SAMN650727TS7","SAMN650727MGTNJT03","MA. NATALIA SANCHEZ MOJICA              ",null,0,1130,1003,5,13,"S01201",0,9230,null,null,20160701,20160930,32026.179999999997,0]
[null,"GUANAJUATO","11DPT0010Y",120,"SAOC521104BAA","SAOC521104HGTNLR02","CARLOS SANCHEZ OLIVA                    ",null,0,1130,1003,2,4,"S01202",0,9227,null,null,20160701,20160930,43459.16,0]
[null,"GUANAJUATO","11DPT0002P",120,"SARA881017KA5","SARA881017HGTNXL07","ALBERTO ALEXANDR SANTILLAN REA          ",null,0,1130,1003,0,29,"S01201",0,2590,null,null,20160701,20160930,29873.129999999997,0]
[null,"GUANAJUATO","11DPT0011X",120,"SARF810815QJ5","SARF810815MDFNCB12","MARIA FABIOLA SANCHEZ RICO              ",null,0,1130,1003,2,49,"S01201",0,10589,null,null,20160701,20160930,34274.319999999992,0]
[null,"GUANAJUATO","11DPT0009I",120,"SARO9410041H4","SARO941004HGNXL07","OLDAIR FERNANDO SANTILLAN REA           ",null,0,1130,1003,1,74,"CF18201",0,8098,null,null,20160701,20160930,30676.720000000001,0]
[null,"GUANAJUATO","11DPT0001Q",120,"SARR700714SU4","SARR700714MGTCMS06","MARIA DEL ROSARI SAUCILLO RAMIREZ       ",null,0,1130,1003,0,28,"CF33204",0,2540,null,null,20160701,20160930,62205.9,0]
[null,"GUANAJUATO","11DPT0002P",120,"SASJ650121CF2","SAST650121HGTNMR00","J. TRINIDAD SANCHEZ SAMANO              ",null,0,1130,1003,0,29,"CF33204",0,9176,null,null,20160701,20160930,70218.11,0]
[null,"GUANAJUATO","11DPT0005M",120,"SATR640529JN3","SATR640529HGTLRB08","RUBEN SALAZAR TORRES                    ",null,0,1130,1003,0,72,"CF21202",0,4412,null,null,20160701,20160930,48370.520000000004,0]
[null,"GUANAJUATO","11DPT0002P",120,"SAVJ890118LK2","SAVJ890118HGTNZS05","JOSE DE JESUS SANCHEZ VAZQUEZ           ",null,0,1130,1003,0,29,"S01202",0,2568,null,null,20160701,20160930,33816.410000000003,0]
[null,"GUANAJUATO","11DPT0014U",120,"SECG740707K72","SECG740707MZSGML05","GUILLERMINA SEGURA CAMPOS               ",null,0,1130,1003,3,3,"CF33206",0,"     ",null,null,20160701,20160930,78014.180000000008]
[null,"GUANAJUATO","11DPT0011X",120,"SEES881205VA7","SEES881205MGTRSR08","SARA SERRANO ESTRADA                    ",null,0,1130,1003,2,49,"CF33203",0,10611,null,null,20160701,20160930,40053.700000000004,0]
[null,"GUANAJUATO","11DPT0007K",120,"SETV690706LG3","SETV690706MDFRRR05","VERONICA SERRANO TORRES                 ",null,0,1130,1003,2,3,"CF33206",0,13316,null,null,20160701,20160930,85068.690000000017,0]
[null,"GUANAJUATO","11DPT0005M",120,"SIFB790507EM8","SIFB790507HGTRRR00","BRAULIO ISAAC SIERRA FERREYRA           ",null,0,1130,1003,0,72,"CF33206",0,13771,null,null,20160701,20160930,93622.860000000015,0]
[null,"GUANAJUATO","11DPT0014U",120,"SIRI830722KG2","SIRI830722HGTXCG04","IGNACIO MANUEL SIXTOS RICO              ",null,0,1130,1003,3,3,"CF33204",0,18866,null,null,20160701,20160930,61918.33]
[null,"GUANAJUATO","11DPT0006L",120,"SIRO600318LE2","SIRO600318HGTRDC04","JOSE OCTAVIO SIERRA RODRIGUEZ           ",null,0,1130,1003,1,63,"CF33204",0,7708,null,null,20160701,20160930,76308.350000000006,0]
[null,"GUANAJUATO","11DPT0014U",120,"SOMC8307243E3","SOMC830724HGTTNH06","CHRISTIAN SOTO MENDOZA                  ",null,0,1130,1003,3,3,"CF33206",0,18861,null,null,20160701,20160930,88419.47]
[null,"GUANAJUATO","11DPT0009I",120,"SOMJ580901N40","SOMJ580901HMNLRS02","JESUS SOLIS MARIN                       ",null,0,1130,1003,1,74,"S01202",0,8097,null,null,20160701,20160930,45426.560000000005,0]
[null,"GUANAJUATO","11DPT0004N",120,"SOPA800206QN0","SOPA800206HMCRRB02","ABNER ISAI SORIA PEREZ                  ",null,0,1130,1003,1,28,"CF33204",0,10615,null,null,20160701,20160930,61997.250000000007,0]
[null,"GUANAJUATO","11DPT0012W",120,"SOPL831024T56","SOPL831024MGTTRR09","LAURA ANGELICA SOTO PEREZ               ",null,0,1130,1003,4,2,"CF33204",0,363,null,null,20160701,20160930,70969.31,0]
[null,"GUANAJUATO","11DPT0012W",120,"SUFR660516C81","SUFR660516MDFRLQ08","RAQUEL SUAREZ FALCON                    ",null,0,1130,1003,4,2,"CF33204",0,10959,null,null,20160701,20160930,71675.23000000001,0]
[null,"GUANAJUATO","11DPT0004N",120,"TAAS6205308FA","TAAS620530MJCPLR01","SARA TAPIA ALCANTARA                    ",null,0,1130,1003,1,28,"CF34201",0,6522,null,null,20160701,20160930,44715.56,0]
[null,"GUANAJUATO","11DPT0003O",120,"TAPM7310026U1","TAPM731002HDFRSG06","MIGUEL ANGEL TAURINO PASTEN             ",null,0,1130,1003,0,30,"A03202",0,2614,null,null,20160701,20160930,42766.80999999999,0]
[null,"GUANAJUATO","11DPT0001Q",120,"TEHM7408294G1","TEHM740829HGTLRR02","MARCO ANTONIO TELLEZ HERRERA            ",null,0,1130,1003,0,28,"S01201",0,2501,null,null,20160701,20160930,30157.67,0]
[null,"GUANAJUATO","11DPT0001Q",120,"TIRA931025MA1","TIRA931025MGTRMN09","ANA CECILIA TIERRABLANCA ROMERO         ",null,0,1130,1003,0,28,"CF18201",0,2535,null,null,20160701,20160930,22332.989999999998,0]
[null,"GUANAJUATO","11DPT0005M",120,"TOCB650526UK9","TOCB650526MGTRBR04","BERTHA TORRES COVARRUBIAS               ",null,0,1130,1003,0,72,"CF02103",0,12617,null,null,20160701,20160930,92369.4,0]
[null,"GUANAJUATO","11DPT0001Q",120,"TOCF910415931","TOCF910415MGTRRT00","FATIMA DEL ROSAR TORRES CERVANTES       ",null,0,1130,1003,0,28,"S01201",0,2558,null,null,20160701,20160930,30710.050000000003,0]
[null,"GUANAJUATO","11DPT0006L",120,"TOMP701231IUA","TOMP701231MGTRJT08","PATRICIA TORRES MEJIA                   ",null,0,1130,1003,1,63,"CF33203",0,7702,null,null,20160701,20160930,43633.59,0]
[null,"GUANAJUATO","11DPT0010Y",120,"TOOC610522FW3","TOOC610522MGTRRL02","CELIA TORRES ORIGEL                     ",null,0,1130,1003,2,4,"CF33206",0,13683,null,null,20160701,20160930,72111.44,0]
[null,"GUANAJUATO","11DPT0014U",120,"TORM8008155Q9","TORM800815HGTRVR02","MARIO TORRES RIVERA                     ",null,0,1130,1003,3,3,"A03202",0,18869,null,null,20160701,20160930,37214.559999999998]
[null,"GUANAJUATO","11DPT0001Q",120,"TOSS530312KL6","TOSS530312HDFRMM05","SAMUEL TORRES SUMOZA                    ",null,0,1130,1003,0,28,"S01202",0,2555,null,null,20160701,20160930,33639.07,0]
[null,"GUANAJUATO","11DPT0001Q",120,"VAAM631105TU4","VAAM631105HGTLYR06","MARTIN VALENTE AYALA                    ",null,0,1130,1003,0,28,"CF19201",0,2496,null,null,20160701,20160930,42737.17,0]
[null,"GUANAJUATO","11DPT0009I",120,"VACM560124H46","VACM560124HGTZRR03","MAURILIO VAZQUEZ CERVANTES              ",null,0,1130,1003,1,74,"S01202",0,8092,null,null,20160701,20160930,43941.74,0]
[null,"GUANAJUATO","11APT0001T",100,"VACR780505180","VACR780505MGTRHS07","MARIA DEL ROSARI VARGAS CHAVEZ          ",null,0,1130,1003,5,13,"CF01601",0,11095,null,null,20160701,20160930,90553.079999999987,0]
[null,"GUANAJUATO","11DPT0005M",120,"VACY6607278R7","VACY660727MGTRSL08","YOLANDA VARGAS CASTILLO                 ",null,0,1130,1003,0,72,"CF33204",0,4428,null,null,20160701,20160930,87511.84,0]
[null,"GUANAJUATO","11DPT0002P",120,"VAEA7904041V2","VAEA790404HGTLLL05","ALEJANDRO VALADEZ ELIAS                 ",null,0,1130,1003,0,29,"S01202",0,2582,null,null,20160701,20160930,34512.99,0]
[null,"GUANAJUATO","11DPT0005M",120,"VAGC6606185V3","VAGC660618MGTRRN09","CANDELARIA VARGAS GARCIA                ",null,0,1130,1003,0,72,"S01201",0,4413,null,null,20160701,20160930,29900.050000000003,0]
[null,"GUANAJUATO","11APT0001T",100,"VAGS770812TH3","VAGS770812HGTLRM07","SAMUEL VALLEJO GUERRERO                 ",null,0,1130,1003,5,13,"CF33204",0,4390,null,null,20160701,20160930,63235.630000000005,0]
[null,"GUANAJUATO","11DPT0005M",120,"VALN7508285U9","VALN750828MGTZMR00","NORMA ADRIANA VAZQUEZ LOMELI            ",null,0,1130,1003,0,72,"ED01201",0,4403,null,null,20160701,20160930,44368.29,0]
[null,"GUANAJUATO","11DPT0012W",120,"VAMF590309CY5","VAMF590309HGTLNR07","FERNANDO VALDES MONTES                  ",null,0,1130,1003,4,2,"CF33206",0,13687,null,null,20160701,20160930,103150.37000000001,0]
[null,"GUANAJUATO","11APT0001T",100,"VARG660927MXA","VARG660927MDFLSL01","GLORIA GUADALUPE VALENZUELA RIOS        ",null,0,1130,1003,7,5,"CF01601",0,11090,null,null,20160701,20160930,90553.079999999987,0]
[null,"GUANAJUATO","11DPT0004N",120,"VASO730804UX2","VASO730804HGTRTC00","OCTAVIO VARGAS SOTO                     ",null,0,1130,1003,1,28,"CF33206",0,13688,null,null,20160701,20160930,102950.46,0]
[null,"GUANAJUATO","11DPT0012W",120,"VASS860602N16","VASS860602MQTLNN00","SANDRA YANET VALTIERRA SANCHEZ          ",null,0,1130,1003,4,2,"CF33206",0,14067,null,null,20160701,20160930,83517.940000000017,0]
[null,"GUANAJUATO","11DPT0002P",120,"VEGJ461124SB6","VEGJ461124HGTLLD01","J. GUADALUPE VELAZQUEZ GALLARDO         ",null,0,1130,1003,0,29,"A03202",0,2564,null,null,20160701,20160930,44888.729999999996,0]
[null,"GUANAJUATO","11DPT0001Q",120,"VEGR631014AK5","VEGR631014HGTLRB01","RUBEN VELAZQUEZ GARCIA                  ",null,0,1130,1003,0,28,"S01202",0,2527,null,null,20160701,20160930,36453.270000000004,0]
[null,"GUANAJUATO","11DPT0001Q",120,"VEMM86100222D","VEMM861022MGTRNR00","MIRIAM SOLEDAD VERA MENDIETA            ",null,0,1130,1003,0,28,"CF18201",0,2515,null,null,20160701,20160930,30711.360000000001,0]
[null,"GUANAJUATO","11DPT0012W",120,"VIRS630902SUA","VIRS630902HMNLYL09","SALVADOR VILLANUEVA REYNOSO             ",null,0,1130,1003,4,2,"CF33206",0,14252,null,null,20160701,20160930,97809.180000000008,0]
[null,"GUANAJUATO","11DPT0008J",120,"VIVM841025NR4","VIVM841025MGTLRL07","MELINA VILLARREAL VARGAS                ",null,0,1130,1003,2,33,"CF33206",0,13505,null,null,20160701,20160930,85769.89,0]
[null,"GUANAJUATO","11DPT0006L",120,"YEGL891123ML2","YEGL891123MGTPRR08","LAURA VERONICA YEPEZ GARCIA             ",null,0,1130,1003,1,63,"S01201",0,7712,null,null,20160701,20160930,30213.329999999998,0]
[null,"GUANAJUATO","11APT0001T",100,"ZAAF7902055E9","ZAAF790205HGTMLR09","FERNANDO ZAMARRIPA ALDAPE               ",null,0,1130,1003,5,13,"CF33206",0,13250,null,null,20160701,20160930,109012.45,0]
[null,"GUANAJUATO","11DPT0012W",120,"ZABS740117LZ8","ZABS740117MGRMLS00","SUSY ROCIO ZAMUDIO BALVUENA             ",null,0,1130,1003,4,2,"CF33204",0,2531,null,null,20160701,20160930,76949.420000000013,0]
[null,"GUANAJUATO","11DPT0012W",120,"ZABS850402N68","ZABS850402HGTMLR06","SERGIO LUIS ZAMUDIO BELTRAN             ",null,0,1130,1003,4,2,"CF04201",0,11168,null,null,20160701,20160930,40434.389999999992,0]
[null,"GUANAJUATO","11APT0001T",100,"ZAHE711130S69","ZAHE711130MDFMRR03","ERIKA DE LOS ANGE ZAMORA HERNANDEZ      ",null,0,1130,1003,7,5,"CF33206",0,13498,null,null,20160701,20160930,114044.25,0]
[null,"GUANAJUATO","11DPT0001Q",120,"ZALC5604237Q2","ZALC560423HGTVPR01","CARLOS ZAVALA LOPEZ                     ",null,0,1130,1003,0,28,"A03202",0,2497,null,null,20160701,20160930,42170.57,0]
[null,"GUANAJUATO","11APT0001T",100,"ZALE620903MK9","ZALE620903HGTVND01","EDUARDO ZAVALA LEON                     ",null,0,1130,1003,7,5,"CF33204",0,11089,null,null,20160701,20160930,69243.360000000001,0]
[null,"GUANAJUATO","11DPT0013V",120,"ZERV770303SS4","ZERV770303MGTNCN07","MARIA  VANESSA ZENDEJAS ROCHA           ",null,0,1130,1003,3,2,"A01801",0,18878,null,null,20160701,20160930,48468.28,0]
[null,"GUANAJUATO","11APT0001T",100,"ZERY820116NN8","ZERY820116MGTNCD08","YADIRA BERENICE ZENDEJAS ROCHA          ",null,0,1130,1003,7,5,"A01801",0,18846,null,null,20160701,20160930,48364.85,0]
[null,"GUANAJUATO","11DPT0009I",120,"ZUGJ521022BB6","ZUGJ521022HGTXRV02","JAVIER ZUÐIGA GARCIA                    ",null,0,1130,1003,1,74,"CF02103",0,12663,null,null,20160701,20160930,92369.4,0]
[null,"GUANAJUATO","11DPT0003O",120,"AABR750608IB4","AABR750608MGTYRS01","ROSA MARGARITA AYALA BARRERA",3,"15.0",1130,3102,0,30,"PC","15.0",28,3,null,20160701,20160930,20004.780000000002,0]
[null,"GUANAJUATO","11DPT0010Y",120,"AAFO86011729A","AAFO860117MGTRRL08","OLGA ELIZABETH ARAUJO FERNANDEZ",3,"27.0",1130,3102,2,4,"PA","27.0",204092,3,null,20160701,20160930,13511.099999999999,0]
[null,"GUANAJUATO","11DPT0002P",100,"AAGC731126M29","AAGC731126HDFLNN07","CONRRADO ARTURO ALVAREZ GONZALEZ",3,"12.0",1130,3102,0,29,"PB","12.0",29005,3,null,20160701,20160930,28510.32,0]
[null,"GUANAJUATO","11DPT0009I",100,"AAGG8604281N4","AAGG860428MGTLRD04","MARIA GUADALUPE ALAMILLA GARCIA",3,"24.0",1130,3102,1,74,"PA","24.0",740002,3,null,20160701,20160930,28786.800000000003]
[null,"GUANAJUATO","11DPT0004N",100,"AAGR6807041Y2","AAGR680704MDFLRF04","MA DEL REFUGIO ANALLA GRANADOS",3,"16.0",1710,3102,1,28,"PA","16.0",128003,3,null,20160701,20160930,25596.410000000003,0]
[null,"GUANAJUATO","11DPT0010Y",120,"AALJ72112271A","AALJ721122MGTLZN08","JUANA CECILIA ALVAREZ LOZANO",3,"30.0",1130,3102,2,4,"PA","30.0",204004,3,null,20160701,20160930,88009.600000000006,0]
[null,"GUANAJUATO","11DPT0011X",100,"AALJ750316LPA","AALJ750316HGTYLS05","JOSE  AYALA  LULE ",3,"18.0",1130,3102,2,49,"TA","18.0",249007,3,null,20160701,20160930,51415.139999999985,0]
[null,"GUANAJUATO","11DPT0013V",120,"AAMT550321C79","AAMT550321MGTLRR02","MARIA TERESA ALVAREZ MARES",3,"16.0",1130,3102,3,2,"PB","16.0",302004,3,null,20160701,20160930,3081.2]
[null,"GUANAJUATO","11DPT0001Q",120,"AAVB660401UL2","AAVB660401MDFLVL01","BLANCA IVETTE ALVAREZ DEL CASTILLO VENTRE",3,"20.0",11028,3102,0,28,"PC","20.0",280002,3,null,20160701,20160930,26953,0]
[null,"GUANAJUATO","11DPT0009I",100,"AAVL730510P19","AAVL730510MGTYLR00","LAURA ELENA AYALA VALTIERRA",3,"20.0",1130,3102,1,74,"PB","20.0",740024,3,null,20160701,20160930,55622]
[null,"GUANAJUATO","11DPT0014U",100,"AEAJ830601BM3","AEAJ830601HGTRRN02","JUAN RAMON ARELLANO  ARIAS",3,"23.0",1130,3102,3,3,"PB","23.0",303029,3,null,20160701,20160930,8858.4599999999991]
[null,"GUANAJUATO","11DPT0012W",120,"AEDI770518OLA","AEDI770518HGTRRS01","ISRAEL ARMANDO ARREDONDO  DORANTES",3,"20.0",1130,3102,4,2,"TA","20.0",27002,3,null,20160701,20160930,15117,0]
[null,"GUANAJUATO","11DPT0003O",120,"AEGD640414KLA","AAPJ880904HGTRTN01","JUAN MIGUEL ARANDA PATLAN",3,"25.0",1130,3102,0,30,"PA","25.0",28,3,null,20160701,20160930,34270,0]
[null,"GUANAJUATO","11DPT0012W",120,"AEPI820115AQ1","AEPI820115MDFRLS04","ISABEL ARREDONDO PLATA",3,"20.0",1130,3102,4,2,"PA","20.0",27000,3,null,20160701,20160930,3535,0]
[null,"GUANAJUATO","11DPT0004N",120,"AERA900121CW4","AERA900121MGTBDD04","ADNARA YESSICA ABREGO RODRIGUEZ",3,"8.0",1710,3102,1,28,"PB","8.0",128069,3,null,20160701,20160930,1828.31,0]
[null,"GUANAJUATO","11DPT0006L",100,"AERJ730331GZ5","AERJ730331HGTRMN05","JUAN CARLOS ARREOLA ROMERO",3,"10.0",1130,3102,10,63,"PA","10.0",163004,3,null,20160701,20160930,9077.75,0]
[null,"GUANAJUATO","11DPT0008J",120,"AETA681104M99","AETA681104MGTRPL00","ALEJANDRA ARREGUIN TAPIA",3,"23.0",1130,3102,2,33,"TA","23.0",523363,3,null,20160701,20160930,5977.7]
[null,"GUANAJUATO","11DPT0005M",120,"AICF790308Q83","AICF790308HGTMLR01","FERNANDO AMBRIZ COLIN",3,"15.0",1130,3102,0,72,"PC","15.0",1130,3,null,20160701,20160930,60014.339999999982,0]
[null,"GUANAJUATO","11DPT0004N",100,"AOML850714B93","AOML850714MMNLGR07","LAURA VENTURA ALBOR MAGAÑA",3,"15.0",1710,3102,1,28,"PB","15.0",128002,3,null,20160701,20160930,19197.29,0]
[null,"GUANAJUATO","11DPT0005M",120,"AOMR770309JR5","AOMR770309MGTCRS03","ROSAURA ACOSTA MORENO",3,"28.0",1130,3102,0,72,"PB","28.0",1130,3,null,20160701,20160930,34663.560000000005,0]
[null,"GUANAJUATO","11DPT0001Q",100,"AOOC650822A32","AOOC650822MGTRJR02","MA CRISTINA ARROYO OJEDA",3,"20.0",1130,3102,0,28,"PB","20.0",280005,3,null,20160701,20160930,81234.509999999995,0]
[null,"GUANAJUATO","11DPT0001Q",100,"AOOS720925113","AOOS720925MGTBRN08","SANDRA ABOYTES OROZCO",3,"30.0",1130,3102,0,28,"PB","30.0",28001,3,null,20160701,20160930,71514]
[null,"GUANAJUATO","11DPT0003O",120,"AORS650107KK2","AORS650107MGTRML00","MA SOLEDAD ARROYO RAMIREZ",3,"17.0",1130,3102,0,30,"PB","17.0",28,3,null,20160701,20160930,13865.4,0]
[null,"GUANAJUATO","11DPT0002P",100,"AOVI670402NJA","AOVI670402HGTCZS07","ISMAEL ACOSTA VAZQUEZ",3,"25.0",1130,3102,0,29,"PB","25.0",290001,3,null,20160701,20160930,28886.280000000002,0]
[null,"GUANAJUATO","11DPT0009I",100,"AOZL870509M00","AOZL870509MGTLRC04","LUCIA ALONSO ZARAGOZA",3,"13.0",1130,3102,1,74,"TA","13.0",740047,3,null,20160701,20160930,6989.18]
[null,"GUANAJUATO","11DPT0010Y",100,"AUCR760401U5A","AUCR760401HGTGRC06","RICARDO AGUILAR CORONA",3,"12.0",1130,3102,2,4,"TA","12.0",204001,3,null,20160701,20160930,19852.859999999997,0]
[null,"GUANAJUATO","11DPT0002P",100,"AUGJ550312251","AUJG550312HGTGTR07","JORGE AGUILERA GUTIERREZ",3,"27.0",1130,3102,0,29,"PB","27.0",290002,3,null,20160701,20160930,53150.759999999995,0]
[null,"GUANAJUATO","11DPT0005M",120,"AULG650807MX2","AULG650807MCLGPD08","MARIA GUADALUPE AGUILAR LOPEZ",3,"20.0",1130,3102,0,72,"PB","20.0",1130,3,null,20160701,20160930,51568.800000000003,0]
[null,"GUANAJUATO","11DPT0008J",120,"AUME740716A41","AUME740716HPLGDN13","ENRIQUE AGUILAR MEDRANO",3,"19.0",1130,3102,2,33,"PA","19.0",523363,3,null,20160701,20160930,3255.65]
[null,"GUANAJUATO","11DPT0012W",120,"AUMJ800706AM9","AUMJ800706HMCGRL14","JOEL AGUILLON MORALES",3,"25.0",1130,3102,4,2,"PB","25.0",270001,3,null,20160701,20160930,33700.660000000003,0]
[null,"GUANAJUATO","11DPT0010Y",100,"AURJ751104NX7","AURJ751104HGTGDN09","JUAN CARLOS  AGUIRRE RODRÌGUEZ",3,"21.0",1130,3102,2,4,"PB","21.0",204002,3,null,20160701,20160930,56617.120000000017,0]
[null,"GUANAJUATO","11DPT0009I",100,"BACA821115M00","BACA821115MGTRRN05","MARIA DE LOS ANGELES BARRON  CORONA ",3,"26.0",1130,3102,1,74,"TA","26.0",740050,3,null,20160701,20160930,19858.8]
[null,"GUANAJUATO","11DPT0006L",100,"BACG700412ET2","BACG700412MGTRSD07","MA GUADALUPE BRAVO CASTRO",3,"10.0",1130,3102,10,63,"PA","10.0",163007,3,null,20160701,20160930,7262.2,0]
[null,"GUANAJUATO","11DPT0005M",120,"BACL660127PY3","BACL660127HGTRNS02","JOSE LUIS BRAVO CANO",3,"25.0",1130,3102,0,72,"PB","25.0",1130,3,null,20160701,20160930,76562.28,0]
[null,"GUANAJUATO","11DPT0011X",100,"BAEJ7111265C6","BAEJ711126HGTTSS04","JESUS MARIO  BAUTISTA  ESCAMILLA ",3,"15.0",1130,3102,2,49,"PC","15.0",249008,3,null,20160701,20160930,46677.819999999992,0]
[null,"GUANAJUATO","11DPT0003O",120,"BAFL750321MR1","BAFL730321HGTRLS09","LUIS EDUARDO BARRERA FLORES",3,"20.0",1130,3102,0,30,"PB","20.0",28,3,null,20160701,20160930,35322,0]
[null,"GUANAJUATO","11DPT0005M",120,"BAGG740408RC0","BAGG740408MGTZRB07","GABRIELA BAEZA GARCIA",3,"20.0",1130,3102,0,72,"PB","20.0",1130,3,null,20160701,20160930,65007.78,0]
[null,"GUANAJUATO","11DPT0012W",120,"BAMV8801104X4","BAMV880110MGTRNR09","VERONICA GUADALUPE BRAVO MONTES",3,"10.0",1130,3102,4,2,"PA","10.0",270161,3,null,20160701,20160930,7165.57,0]
[null,"GUANAJUATO","11DPT0005M",120,"BAPA800509JH2","BAPA800509HDFRRL06","ALAN BAROJAS PEREZ",3,"24.0",1130,3102,0,72,"PB","24.0",1130,3,null,20160701,20160930,29271.439999999999,0]
[null,"GUANAJUATO","11DPT0012W",120,"BASC910503127","BASC910503MGTZNR03","MARIA CRUZ BAEZA SANCHEZ",3,"20.0",1130,3102,4,2,"TA","20.0",27000,3,null,20160701,20160930,5314.87]
[null,"GUANAJUATO","11DPT0005M",120,"BASM671211R18","BASM671211MGTCNR06","MARTHA PATRICIA BACA SANCHEZ",3,"12.0",1130,3102,0,72,"PB","12.0",1130,3,null,20160701,20160930,63600.539999999972,0]
[null,"GUANAJUATO","11DPT0010Y",120,"BAVB810501LRA","BAVB810501MGTRLL01","BLANCA ELIZABETH BARAJAS VALLEJO",3,"20.0",1130,3102,2,4,"PA","20.0",204009,3,null,20160701,20160930,70324.100000000006,0]
[null,"GUANAJUATO","11DPT0006L",100,"BEGR700112IU3","BEGR700112MGTRRB08","MA REBECA BERNAL GORDILLO",3,"18.0",1130,3102,10,63,"PA","18.0",163006,3,null,20160701,20160930,71117.499999999985,0]
[null,"GUANAJUATO","11DPT0006L",100,"BEMG751210DE6","BEMG751210MDFLRD00","GUADALUPE KARINA BELTRAN MARTINEZ",3,"5.0",1130,3102,10,63,"PC","5.0",163005,3,null,20160701,20160930,5007.88,0]
[null,"GUANAJUATO","11DPT0001Q",100,"BESJ810412R10","BESJ810412HGTLNS06","JESUS EDUARDO BELMAN SANTILLAN",3,"20.0",1130,3102,0,28,"PB","20.0",280007,3,null,20160701,20160930,60163.6]
[null,"GUANAJUATO","11DPT0008J",120,"BIEF750826Q65","BIEF750826HGTRSL05","FILIBERTO BRISEÑO ESPITIA",3,"21.0",1130,3102,2,33,"PB","21.0",523305,3,null,20160701,20160930,56617.120000000017]
[null,"GUANAJUATO","11DPT0001Q",100,"BOSC820326R12","BOSC820326HGTLRR09","CARLOS MARTIN BOLAÑOS SERVIN",3,"20.0",1130,3102,0,28,"PB","20.0",280008,3,null,20160701,20160930,81234.509999999995]
[null,"GUANAJUATO","11DPT0001Q",100,"CAAL690628AM6","CAAL690628MGTRLT08","MARIA LETICIA CARDENAS ALMANZA",3,"20.0",1130,3102,0,28,"PB","20.0",280009,3,null,20160701,20160930,79886.45]
[null,"GUANAJUATO","11DPT0005M",120,"CABA581007J13","CABA581007MMNRZN16","MARIA DE LOS ANGELES CARDENAS BAEZA",3,"25.0",1130,3102,0,72,"PC","25.0",1130,3,null,20160701,20160930,68782.559999999983,0]
[null,"GUANAJUATO","11DPT0005M",120,"CABD570205P26","CABD570205MMNRZL00","MARIA DE LOS DOLORES CARDENAS BAEZA",3,"20.0",1130,3102,0,72,"PB","20.0",1130,3,null,20160701,20160930,47676,0]
[null,"GUANAJUATO","11DPT0001Q",120,"CABD840721MI3","CABD840721HGTSNN09","DANIEL CASIQUE BUENAVISTA",3,"12.0",1130,3102,0,28,"TA","12.0",28059,3,null,20160701,20160930,3332.51,0]
[null,"GUANAJUATO","11DPT0009I",100,"CACC741121MK3","CACC741121HGTSRR01","CARLOS ALBERTO CASTILLO CRUZ",3,"15.0",1130,3102,1,74,"PB","15.0",740008,3,null,20160701,20160930,35210.28]
[null,"GUANAJUATO","11DPT0005M",120,"CACR540413CR4","CACR540413HBCSSL00","RAUL CASTAÑEDA CASTRO",3,"24.0",1130,3102,0,72,"PB","24.0",1130,3,null,20160701,20160930,103793.70000000003,0]
[null,"GUANAJUATO","11DPT0012W",120,"CACV851205PW0","CACV851205MQTRRR00","VERA CABELLO  CORONA",3,"30.0",1130,3102,4,2,"PB","30.0",27005,3,null,20160701,20160930,49831.38]
[null,"GUANAJUATO","11DPT0010Y",120,"CACX831109CP9","CXCA831109MGTMHM07","AMERICA CAMPOS CHAGOYA",3,"14.0",1130,3102,2,4,"PB","14.0",204011,3,null,20160701,20160930,52255.979999999989,0]
[null,"GUANAJUATO","11DPT0006L",120,"CADJ720202F14","CADJ720202HMNHRN03","JUAN CHAVEZ DURAN",3,"10.0",1130,3102,10,63,"PC","10.0",163010,3,null,20160701,20160930,2259.75,0]
[null,"GUANAJUATO","11DPT0001Q",100,"CAEL691012SG8","CAEL691012MDFRST01","LETICIA CARMONA  ESPINOSA ",3,"25.0",1130,3102,0,28,"PB","25.0",28096,3,null,20160701,20160930,43095.520000000004]
[null,"GUANAJUATO","11DPT0002P",100,"CAEL721019IZ9","CAEL721019MGTSLL08","LILIA ISELA CASTILLO ELIZARRARAZ",3,"21.0",1130,3102,0,29,"PB","21.0",290009,3,null,20160701,20160930,49697.579999999994,0]
[null,"GUANAJUATO","11DPT0011X",100,"CAER830626JA4","CAER830626MGTRSY00","REYNA LILIANA  CARDOSO  ESCUTIA ",3,"9.0",1130,3102,2,49,"PB","9.0",249011,3,null,20160701,20160930,10962.42,0]
[null,"GUANAJUATO","11DPT0008J",120,"CAFJ650317IR5","CAFJ650317HGTRLR04","JORGE CARRANCO FLORES",3,"12.0",1130,3102,2,33,"TA","12.0",523371,3,null,20160701,20160930,4980.13]
[null,"GUANAJUATO","11DPT0005M",120,"CAGG711124NT7","CAGG711124MGTRTD19","MARIA GUADALUPE CARDENAS GUTIERREZ",3,"18.0",1130,3102,0,72,"TA","18.0",1130,3,null,20160701,20160930,13839.180000000002,0]
[null,"GUANAJUATO","11DPT0010Y",120,"CAGG7503244Z4","CAGG750324MGTBTB00","GABRIELA DEL CARMEN CABRERA GUTIÉRREZ",3,"30.0",1130,3102,2,4,"PB","30.0",204010,3,null,20160701,20160930,40596.36,0]
[null,"GUANAJUATO","11DPT0006L",100,"CAGG841115NK6","CAGG841115MGTLNL08","GIULIANA CALDERON GONZALEZ",3,"12.0",1130,3102,10,63,"PB","12.0",163009,3,null,20160701,20160930,23457.3,0]
[null,"GUANAJUATO","11DPT0002P",120,"CAHJ750812FB7","CAHJ750812HGTHRR09","JORGE ALEJANDRO CHAGOYA HERNANDEZ",3,"10.0",1130,3102,0,29,"PC","10.0",290012,3,null,20160701,20160930,13652.58,0]
[null,"GUANAJUATO","11DPT0003O",120,"CAMA720409D58","CAMA720409HGTMRN04","JOSE ANTONIO CAMPOS MORENO",3,"15.0",1130,3102,0,30,"PA","15.0",28,3,null,20160701,20160930,21210,0]
[null,"GUANAJUATO","11DPT0002P",120,"CAMH790325MK6","CAMH790325HGTSSC09","HECTOR CASTRO MOSQUEDA",3,"21.0",1130,3102,0,29,"PB","21.0",290010,3,null,20160701,20160930,66208.320000000007,0]
[null,"GUANAJUATO","11DPT0013V",120,"CAMJ670419324","CAMJ670419HGTRRS00","JOSE DE JESUS CARRILLO MARTINEZ",3,"16.0",1130,3102,3,2,"PC","16.0",302120,3,null,20160701,20160930,24894.800000000003]
[null,"GUANAJUATO","11DPT0012W",120,"CAMJ890730SG6","CAMJ890730MDFSDZ09","JAZMIN CASASOLA MEDINA",3,"30.0",1130,3102,4,2,"PA","30.0",270010,3,null,20160701,20160930,5140.5]
[null,"GUANAJUATO","11DPT0001Q",120,"CAOL581027513","CAOL581027HGTMLS01","JOSE LUIS CAMPOS OLALDE",3,"15.0",1130,3102,0,28,"PA","15.0",280179,3,null,20160701,20160930,5125.75,0]
[null,"GUANAJUATO","11DPT0014U",100,"CAPD830504746","CAPD830504HGTRTG05","DIEGO FELIPE CARDENAS PATIÑO",3,"30.0",1130,3102,3,3,"PB","30.0",303001,3,null,20160701,20160930,17696.25]
[null,"GUANAJUATO","11DPT0001Q",100,"CAPJ680119DJ7","CAPJ680119HGTZTN01","J. ANDRES CAZARES PATIÑO",3,"17.0",1130,3102,0,28,"PB","17.0",280011,3,null,20160701,20160930,20220.410000000003]
[null,"GUANAJUATO","11DPT0011X",100,"CARH670101MS3","CARH670101HGTRZC08","HECTOR  CARDENAS  RUIZ ",3,"21.0",1130,3102,2,49,"PB","21.0",249010,3,null,20160701,20160930,68749.38,0]
[null,"GUANAJUATO","11DPT0001Q",100,"CARL560630141","CARL560630HGTSVS09","JOSE LUIS CASTRO RIVAS",3,"20.0",1130,3102,0,28,"PB","20.0",280010,3,null,20160701,20160930,11990.08]
[null,"GUANAJUATO","11DPT0002P",120,"CARS710511U36","CARS710511HGTMNR10","SERGIO ARTURO CAMPOS RANGEL",3,"15.0",1130,3102,0,29,"PA","15.0",290006,3,null,20160701,20160930,31713.120000000003,0]
[null,"GUANAJUATO","11DPT0006L",100,"CASC710716KT2","CASC710716MGTBRR00","MA CARMEN CABALLERO SIERRA",3,"12.0",1130,3102,10,63,"PA","12.0",163008,3,null,20160701,20160930,21784.199999999997,0]
[null,"GUANAJUATO","11DPT0009I",100,"CASM6003305D3","CASM600330HGTMTL02","MELCHOR CAMPOS SOTO",3,"25.0",1130,3102,1,74,"PA","25.0",740007,3,null,20160701,20160930,57573.599999999999]
[null,"GUANAJUATO","11DPT0001Q",100,"CAVA820322S74","CAVA820322HDFHRB06","ABRAHAM CHAVEZ VARELA",3,"17.0",1130,3102,0,28,"PB","17.0",280013,3,null,20160701,20160930,25612.51]
[null,"GUANAJUATO","11DPT0003O",120,"CAVM6302079D4","CAVM630207MDFLLR04","MARIANA FEDERICA CALDERON VILLALOBOS",3,"15.0",1130,3102,0,30,"PC","15.0",28,3,null,20160701,20160930,16670.650000000001,0]
[null,"GUANAJUATO","11DPT0002P",120,"CECE690308KZ9","CECE690308HGTRRL05","ELIAS CERVANTES CRUZ",3,"18.0",1130,3102,0,29,"TA","18.0",290011,3,null,20160701,20160930,40032.900000000009,0]
[null,"GUANAJUATO","11DPT0004N",100,"CECL851027UY4","CECL851027MGRRSL00","LILIANA CERRATO CUSTODIO",3,"12.0",1710,3102,1,28,"PA","12.0",128041,3,null,20160701,20160930,21939.780000000002,0]
[null,"GUANAJUATO","11DPT0001Q",100,"CEGE7106304G8","CEGE710630MGTBML09","MA ELIZABETH CEBALLOS GOMEZ",3,"25.0",1130,3102,0,28,"PB","25.0",280012,3,null,20160701,20160930,95709.880000000019]
[null,"GUANAJUATO","11DPT0008J",120,"CIAV791109IT0","CIAV791109MGTRRR05","VERONICA CRISANTO ARRIAGA",3,"18.0",1130,3102,2,33,"PB","18.0",523308,3,null,20160701,20160930,48528.899999999987]
[null,"GUANAJUATO","11DPT0001Q",100,"CIGM510313HX4","CIGM510313HVZSRG08","MIGUEL ANGEL CISNEROS GARCIA",3,"23.0",1130,3102,0,28,"PB","23.0",280014,3,null,20160701,20160930,13723.25]
[null,"GUANAJUATO","11DPT0014U",120,"CIHJ8210229R1","CIHJ821022HGTHRR04","JORGE LUIS CHIA HERNANDEZ",3,"0.0",1130,3102,3,3,"PA","0.0",303047,3,null,20160701,20160930,10251.5]
[null,"GUANAJUATO","11DPT0002P",100,"CILG720124JZ9","CILG720124MGTSPD05","MA GUADALUPE CISNEROS LOPEZ",3,"24.0",1130,3102,0,29,"PB","24.0",290015,3,null,20160701,20160930,27730.799999999999,0]
[null,"GUANAJUATO","11DPT0002P",100,"CILG730402N95","CILG730402MGTSPL08","BLANCA ESTELA GUILLERMINA CISNEROS LOPEZ",3,"30.0",1130,3102,0,29,"PB","30.0",290014,3,null,20160701,20160930,58927.98,0]
[null,"GUANAJUATO","11DPT0004N",100,"CIOR7805171L4","CIOR780517HGTNRB00","ROBERTO CINTORA JR.",3,"14.0",1710,3102,1,28,"PC","14.0",128007,3,null,20160701,20160930,12798.169999999998,0]
[null,"GUANAJUATO","11DPT0007K",120,"CIOV5211227Z3","CIOV521122HDFSRC01"," VICTOR SAMUEL CISNEROS ORTEGA",3,"18.0",1130,3102,2,3,"PC","18.0",203019,3,null,20160701,20160930,53650.349999999984,0]
[null,"GUANAJUATO","11DPT0002P",120,"COCF790524RG5","COCJ790524HGTNRR07","FRANCISCO JAVIER CONTRERAS CERVANTES",3,"15.0",1130,3102,0,29,"PC","15.0",290073,3,null,20160701,20160930,80019.12,0]
[null,"GUANAJUATO","11DPT0002P",120,"COCJ790301RG5","COCJ790301HGTRRN06","JOSE JUAN CORRALES CORONA",3,"16.0",1130,3102,0,29,"PB","16.0",290017,3,null,20160701,20160930,36974.400000000001,0]
[null,"GUANAJUATO","11DPT0008J",120,"COCJ840424II1","COCJ840424HTLCNR00","JAIRO COCOLETZI CONDE",3,"17.0",1130,3102,2,33,"PB","17.0",523307,3,null,20160701,20160930,46821.67000000002]
[null,"GUANAJUATO","11DPT0007K",120,"COGA610228CT2","COGA610228HDFRRL00"," ALFONSO CORONA GARCIA",3,"22.0",1130,3102,2,3,"PC","22.0",203020,3,null,20160701,20160930,65572.650000000009,0]
[null,"GUANAJUATO","11DPT0009I",100,"COGB581101LL6","COGB581101HGTRMN07","BENJAMIN CORONA GOMEZ",3,"15.0",1130,3102,1,74,"TA","15.0",740009,3,null,20160701,20160930,27563.410000000003]
[null,"GUANAJUATO","11DPT0004N",100,"COJR790910633","COJR790910MGTRMS08","ROSALVA CORNEJO JIMENEZ",3,"14.0",1710,3102,1,28,"PB","14.0",128008,3,null,20160701,20160930,16454.82,0]
[null,"GUANAJUATO","11DPT0002P",120,"COMI550105UFA","COMI550105MVZRRS01","MARIA ISABEL CORTES MARTINEZ",3,"16.0",1130,3102,0,29,"PB","16.0",290018,3,null,20160701,20160930,18487.2,0]
[null,"GUANAJUATO","11DPT0002P",120,"COMJ7702043T7","COMJ770204HGTRRL02","JOEL DE JESUS CORONA MORENO",3,"28.0",1130,3102,0,29,"PA","28.0",290159,3,null,20160701,20160930,8910.2000000000007,0]
[null,"GUANAJUATO","11DPT0013V",120,"COML571122DD6","COML571122MGTRRT18","LETICIA CORNEJO MARTINEZ",3,"16.0",1130,3102,3,2,"PC","16.0",302009,3,null,20160701,20160930,3556.4]
[null,"GUANAJUATO","11DPT0001Q",100,"COMM610831NKA","COMM610831HDFRRG06","MIGUEL CORTES MORALES",3,"20.0",1130,3102,0,28,"PB","20.0",280014,3,null,20160701,20160930,40325.949999999997]
[null,"GUANAJUATO","11DPT0002P",120,"COMS721010P5A","COMS721010MGTRSL09","SILVIA CORDOBA  MOSQUEDA",3,"30.0",1130,3102,0,29,"PC","30.0",290074,3,null,20160701,20160930,71029.84,0]
[null,"GUANAJUATO","11DPT0004N",120,"COOA720302IP3","COOA720302MGTRRL01","ALMA ROSA CORTEZ ORTIZ",3,"14.0",1710,3102,1,28,"PA","14.0",128066,3,null,20160701,20160930,2742.47,0]
[null,"GUANAJUATO","11DPT0006L",100,"COPG691022N6A","COPG691022MGTNRD16","MA GUADALUPE CONTRERAS PEREZ",3,"16.0",11163,3102,10,63,"PC","16.0",163011,3,null,20160701,20160930,53346.000000000015,0]
[null,"GUANAJUATO","11DPT0006L",100,"COTR740102LT0","COTR740102MMCRRC00","ROCIO CORONA TIRADO",3,"20.0",1130,3102,10,63,"PA","20.0",163012,3,null,20160701,20160930,35350,0]
[null,"GUANAJUATO","11DPT0005M",120,"CUGV730427G51","CUGV730427HGTLMC00","VICTOR MANUEL CUELLAR GOMEZ",3,"20.0",1130,3102,0,72,"PB","20.0",1130,3,null,20160701,20160930,80028.600000000006,0]
[null,"GUANAJUATO","11DPT0008J",120,"CUMJ850922E29","CUMJ850922MGTVRV00","JAVIERA MARIANA CUEVAS MIRELES",3,"20.0",1130,3102,2,33,"PA","20.0",523309,3,null,20160701,20160930,56044.1]
[null,"GUANAJUATO","11DPT0003O",120,"CURP6903018I5","CURP690301MGTRYT08","PATRICIA DE LA CRUZ REYES",3,"12.0",1130,3102,0,30,"PC","12.0",28,3,null,20160701,20160930,54018,0]
[null,"GUANAJUATO","11DPT0005M",120,"DABG810704HX9","DABG810704HGTMRR08","GERSON FALCAO DAMIAN BRAVO",3,"23.0",1130,3102,0,72,"PB","23.0",1130,3,null,20160701,20160930,81402.77999999997,0]
[null,"GUANAJUATO","11DPT0002P",100,"DARE870421E95","DARE870421MGTMDD0","EDUARDINA ESAIG DAMIAN  RODRIGUEZ",3,"24.0",1130,3102,0,29,"PB","24.0",290119,3,null,20160701,20160930,28168.199999999997,0]
[null,"GUANAJUATO","11DPT0003O",120,"DAZM801018IR0","DAZM801018MGTVMR04","MIRIAM TERESA DÁVALOS ZAMORA",3,"15.0",1130,3102,0,30,"PA","15.0",28,3,null,20160701,20160930,6285.08,0]
[null,"GUANAJUATO","11DPT0002P",120,"DEBY851217D4A","DEBJ851217MGTLLS09","JUSELY GUADALUPE DELGADO BELTRAN",3,"26.0",1130,3102,0,29,"PB","26.0",290139,3,null,20160701,20160930,15020.849999999999,0]
[null,"GUANAJUATO","11DPT0008J",120,"DEGJ790106AH3","DEGJ790106HGTLRR08","JORGE ALBERTO DELGADO GUERRERO",3,"23.0",1130,3102,2,33,"PC","23.0",523310,3,null,20160701,20160930,67888.94]
[null,"GUANAJUATO","11DPT0001Q",100,"DEPT800907TBA","DEPT800907MGTRDR04","MARIA TERESA DERRAMADERO PADILLA",3,"30.0",1130,3102,0,28,"PB","30.0",280017,3,null,20160701,20160930,58136.61]
[null,"GUANAJUATO","11DPT0002P",120,"DICI670401TA1","DICI670401MGTZMR00","IRENE DIAZ CAMPOS",3,"20.0",1130,3102,0,29,"PC","20.0",290021,3,null,20160701,20160930,26673,0]
[null,"GUANAJUATO","11DPT0011X",100,"DICJ590119T4A","DICJ590119HGTZCS01","JOSE  DIAZ  COCILION ",3,"8.0",1130,3102,2,49,"PB","8.0",249016,3,null,20160701,20160930,35521.360000000001,0]
[null,"GUANAJUATO","11DPT0004N",100,"DIEM790506MK2","DIEM790506MGTZSR04","MARTHA SOFIA DIAZ ESCUTIA",3,"13.0",1130,3102,1,28,"PB","13.0",128010,3,null,20160701,20160930,18077.150000000001,0]
[null,"GUANAJUATO","11DPT0005M",120,"DIGJ5805018S3","DIGJ580501HGTZTR09","JORGE DIAZ GUTIERREZ",3,"20.0",1130,3102,0,72,"PB","20.0",1130,3,null,20160701,20160930,34663.560000000005,0]
[null,"GUANAJUATO","11DPT0002P",100,"DIJT521003PE9","DIJT521003MVZZCR03","MARIA TERESITA DIAZ JACOME",3,"20.0",1130,3102,0,29,"PC","20.0",290023,3,null,20160701,20160930,53346,0]
[null,"GUANAJUATO","11DPT0007K",120,"DIVA711128CB2","DIVA711128MMCZGL03","ALEJANDRA DIAZ VEGA",3,"12.0",1130,3102,2,3,"PB","12.0",203132,3,null,20160701,20160930,9548.44,0]
[null,"GUANAJUATO","11DPT0002P",100,"DOMN670802UR9","DOMN670802MGTMNT03","NATALIA DE LOS ANGELES DOMINGUEZ MANZANO",3,"25.0",1130,3102,0,29,"PB","25.0",290024,3,null,20160701,20160930,28886.280000000002,0]
[null,"GUANAJUATO","11DPT0003O",120,"DUCC5804306T4","DUCC580430HGTXSR01","CARLOS VICTOR DUENAS CASTILLO",3,"10.0",1130,3102,0,30,"TA","10.0",28,3,null,20160701,20160930,4189.41,0]
[null,"GUANAJUATO","11DPT0002P",100,"EAGA611030B76","EAGA611030HGTSTN01","ANTONIO MARTIN ESTRADA GUTIERREZ",3,"16.0",1130,3102,0,29,"PA","16.0",290029,3,null,20160701,20160930,49867.19999999999,0]
[null,"GUANAJUATO","11DPT0011X",100,"EAMA860511UL8","EAMA860511MMNSRN08","ANA LUCIA ESCALANTE MARIN",3,"15.0",1130,3102,2,49,"PB","15.0",249017,3,null,20160701,20160930,40440.82,0]
[null,"GUANAJUATO","11DPT0005M",120,"EANE770730ID6","EANE770730HMNSXD06","EDGAR CUAUHTEMOC ESTRADA NUÑEZ",3,"24.0",1130,3102,0,72,"PB","24.0",1130,3,null,20160701,20160930,10969.859999999999,0]
[null,"GUANAJUATO","11DPT0001Q",100,"EASG800616J20","EASG800616HGTSSR09","GERARDO ESTRADA SESENTO",3,"20.0",1130,3102,0,28,"PC","20.0",280021,3,null,20160701,20160930,31118.5]
[null,"GUANAJUATO","11DPT0001Q",100,"EICS7010205K2","EICS701020MMNNRR06","SERAFINA ENRIQUEZ CORDOVA",3,"20.0",1130,3102,0,28,"PC","20.0",280019,3,null,20160701,20160930,93355.5]
[null,"GUANAJUATO","11DPT0005M",120,"EIDR500307HY1","EIDR500307HGTNLN02","JOSE RENE ENRIQUEZ DELGADO",3,"20.0",1130,3102,0,72,"PB","20.0",1130,3,null,20160701,20160930,68474.100000000006,0]
[null,"GUANAJUATO","11DPT0008J",120,"EIEA830501N66","EIEA830501MGTSSN05","ANDREA ESPITIA ESPITIA",3,"20.0",1130,3102,2,33,"PB","20.0",523312,3,null,20160701,20160930,79886.45]
[null,"GUANAJUATO","11DPT0008J",120,"EIGG680608R24","EIGG680608HGTSNR01","GERARDO ESPITIA GONZALEZ",3,"26.0",1130,3102,2,33,"PB","26.0",523313,3,null,20160701,20160930,94343.9]
[null,"GUANAJUATO","11DPT0012W",100,"EIHA7010296Z8","EIHA701029HGTSRL01","ALEJANDRO ESPINOSA HERNANDEZ",3,"10.0",1130,3102,4,2,"PB","10.0",27007,3,null,20160701,20160930,12013.32,0]
[null,"GUANAJUATO","11DPT0006L",100,"EILO590921526","EILO590921MGTSNF06","OFELIA ESPINOSA LUNA",3,"20.0",1130,3102,10,63,"PC","20.0",163015,3,null,20160701,20160930,45155,0]
[null,"GUANAJUATO","11DPT0006L",100,"EIME671030L39","EIME671030HGTSRD00","EDUARDO ESPINO MIRANDA",3,"16.0",1130,3102,10,63,"PC","16.0",163014,3,null,20160701,20160930,17782,0]
[null,"GUANAJUATO","11DPT0002P",120,"EIVG610404DLA","EIVG610404HDFLLR08","JORGE ALBERTO ELIZARRARAS VILLALPANDO",3,"20.0",1130,3102,0,29,"PC","20.0",290025,3,null,20160701,20160930,35564,0]
[null,"GUANAJUATO","11DPT0007K",120,"EOTJ551129MU2","EOTS551129HGTSPT10"," J. SATURNINO ESCOTO TAPIA",3,"12.0",1130,3102,2,3,"PC","12.0",203026,3,null,20160701,20160930,34674.899999999994,0]
[null,"GUANAJUATO","11DPT0002P",120,"EUQJ600614JNA","EUQJ600614HDFSRN05","JUAN MIGUEL ESQUIVEL QUIROZ",3,"16.0",1130,3102,0,29,"PB","16.0",290028,3,null,20160701,20160930,36974.400000000001,0]
[null,"GUANAJUATO","11DPT0003O",120,"FABV830514ES9","FABV830514HGTRLC04","VICTOR ESTEBAN FRAUSTO BOLIO",3,"20.0",1130,3102,0,30,"PB","20.0",28,3,null,20160701,20160930,18669.46,0]
[null,"GUANAJUATO","11DPT0001Q",100,"FEHE800724TQ5","FEHE800724HGTRRD06","EDUARDO FERNANDEZ HERNANDEZ",3,"12.0",1130,3102,0,28,"PB","12.0",280022,3,null,20160701,20160930,22877.48]
[null,"GUANAJUATO","11DPT0009I",100,"FEPD780323M00","FEPD780323MGTLRL01","DELIA FELIPE  PEREZ ",3,"20.0",1130,3102,1,74,"PB","20.0",740011,3,null,20160701,20160930,26118.66]
[null,"GUANAJUATO","11DPT0010Y",100,"FIOM790619I13","FIOM790619HDFLRH07","MAHY ROLANDO FILOMENO ORTIZ",3,"15.0",1130,3102,2,4,"PB","15.0",204017,3,null,20160701,20160930,12527.34,0]
[null,"GUANAJUATO","11DPT0004N",100,"FOBD780903IT3","FOBD780903HGTNDV05","DAVID FONSECA BEDOLLA",3,"15.0",1130,3102,1,28,"PA","15.0",128014,3,null,20160701,20160930,10893.3,0]
[null,"GUANAJUATO","11DPT0005M",120,"GABM731224PP4","GABM731224HGTRLG09","MIGUEL ANGEL GARCIA BELTRAN",3,"15.0",1130,3102,0,72,"PC","15.0",1130,3,null,20160701,20160930,20004.780000000002,0]
[null,"GUANAJUATO","11DPT0005M",120,"GACF650909JFA","GACF650909HGTRND07","FIDEL GARCIA CONEJO",3,"20.0",1130,3102,0,72,"PC","20.0",1130,3,null,20160701,20160930,54186,0]
[null,"GUANAJUATO","11DPT0007K",120,"GACM6402137QA","GACM640213MGTRNR05","MARICELA GARCIA CHAVEZ",3,"20.0",1130,3102,2,3,"PC","20.0",203031,3,null,20160701,20160930,57791.5,0]
[null,"GUANAJUATO","11DPT0008J",120,"GACP660324G26","GACP660324HGTLPD03","PEDRO GALVEZ CAPORAL",3,"21.0",1130,3102,2,33,"PA","21.0",523316,3,null,20160701,20160930,25982.25]
[null,"GUANAJUATO","11DPT0001Q",100,"GACS730701E50","GACS730701MGTYDN08","SANDRA KARINA GAYTAN CADENA",3,"25.0",1130,3102,0,28,"PC","25.0",28002,3,null,20160701,20160930,40123.159999999996,0]
[null,"GUANAJUATO","11DPT0002P",120,"GAEA800524AAA","GAEA800524HGTRLL00","J. ALFREDO GRANADOS ELIZARRARAS",3,"9.0",1130,3102,0,29,"PC","9.0",290177,3,null,20160701,20160930,21590.44,0]
[null,"GUANAJUATO","11DPT0008J",120,"GAFR660603435","GAFR660603MGTRRS00","ROSAICELA CRISTINA GARCIA FRIAS",3,"20.0",1130,3102,2,33,"PC","20.0",523315,3,null,20160701,20160930,31118.5]
[null,"GUANAJUATO","11DPT0007K",120,"GAGA6703123EA","GAGA670312HGTSNL02","JOSE ALFREDO GASCA GONZALEZ",3,"25.0",1130,3102,2,3,"PC","25.0",203032,3,null,20160701,20160930,132305.94000000003,0]
[null,"GUANAJUATO","11DPT0003O",120,"GAGE660725EF1","GAGE660725MGTYNG09","MA. EUGENIA GAYTAN GONZALEZ",3,"15.0",1130,3102,0,30,"PC","15.0",28,3,null,20160701,20160930,107742.12000000002,0]
[null,"GUANAJUATO","11DPT0004N",120,"GAGR770628PU1","GAGR770628HGTRYF06","RAFAEL GARCIA GAYTAN",3,"10.0",1710,3102,1,28,"PB","10.0",128093,3,null,20160701,20160930,2742.47,0]
[null,"GUANAJUATO","11DPT0011X",100,"GAMA5108287F5","GAMA510828HGTRR609","AGUSTIN  GARDIAZABAL  MORALES ",3,"12.0",1130,3102,2,49,"PC","12.0",249024,3,null,20160701,20160930,5334.6,0]
[null,"GUANAJUATO","11DPT0001Q",100,"GAMC720506I97","GAMC720506MGTRRN08","CONSTANZA GARCIA  MARTINEZ",3,"20.0",1130,3102,0,28,"PC","20.0",280025,3,null,20160701,20160930,52456.92,0]
[null,"GUANAJUATO","11DPT0010Y",120,"GAME651110B38","GAME651110HDFRRD00","EDUARDO GARCÍA MORALES",3,"20.0",1130,3102,2,4,"PA","20.0",204020,3,null,20160701,20160930,24745,0]
[null,"GUANAJUATO","11DPT0002P",100,"GAMM750120RB8","GANN750120MGTRSR08","MARTHA ELBA GARCIA MOSQUEDA",3,"25.0",1130,3102,0,29,"PB","25.0",290032,3,null,20160701,20160930,58683.78,0]
[null,"GUANAJUATO","11DPT0009I",100,"GAPA750814NW2","GAPA750814MDFMRN01","ANGIE GAMBOA PEREZ",3,"18.0",1130,3102,1,74,"TA","18.0",740012,3,null,20160701,20160930,16129.68]
[null,"GUANAJUATO","11DPT0012W",120,"GARB840625CP8","GARB840625MQTLDR08","BRENDA LIDIA GALLEGOS RODRIGUEZ",3,"37.0",1130,3102,4,2,"PA","37.0",270008,3,null,20160701,20160930,23332.05]
[null,"GUANAJUATO","11DPT0007K",120,"GARG881113FV7","GARG881113HGTRDL05","GUILLERMO GARCIA RODRIGUEZ",3,"20.0",1130,3102,2,3,"PA","20.0",203227,3,null,20160701,20160930,10706.52,0]
[null,"GUANAJUATO","11DPT0006L",100,"GASM760821854","GASS760821MGTRTC10","MA. DEL SOCORRO GARCIA SOTELO",3,"15.0",1130,3102,10,63,"PB","15.0",163017,3,null,20160701,20160930,28886.300000000007,0]
[null,"GUANAJUATO","11DPT0005M",120,"GASR730617EQ9","GASR730619MGTRLS03","ROSA MARIA GARCIA  SILVA",3,"20.0",1130,3102,0,72,"PB","20.0",1130,3,null,20160701,20160930,51568.800000000003,0]
[null,"GUANAJUATO","11DPT0001Q",100,"GAUR8010189E2","GAUR801018MGTRRS03","MARIA DEL ROSARIO GRANADOS URIBE",3,"20.0",1130,3102,0,28,"PC","20.0",280034,3,null,20160701,20160930,35564,0]
[null,"GUANAJUATO","11DPT0002P",120,"GAVJ660521UR1","GAVJ660521HGTRGN08","JUAN CARLOS GARCIA VEGA",3,"21.0",1130,3102,0,29,"TA","21.0",290158,3,null,20160701,20160930,5382.79,0]
[null,"GUANAJUATO","11DPT0004N",100,"GAVJ851126FM4","GAVJ851126HGTRYV07","JAVIER GARCIA VIEYRA",3,"15.0",1130,3102,1,28,"PB","15.0",128015,3,null,20160701,20160930,61299.07,0]
[null,"GUANAJUATO","11DPT0003O",120,"GIPE8705187T7","GIPE870718MGTRDR06","ERIKA ELIZABETH GRIMALDO PADILLA",3,"20.0",1130,3102,0,30,"PA","20.0",28,3,null,20160701,20160930,17135,0]
[null,"GUANAJUATO","11DPT0013V",120,"GOAJ880125GX4","GOAJ880125HGTNLS06","JOSUE ABRAHAM GONZALEZ ALCANTAR",3,"21.0",1130,3102,3,2,"TA","21.0",302092,3,null,20160701,20160930,5164.9799999999996]
[null,"GUANAJUATO","11DPT0004N",120,"GOCE620703SD6","GOCE620703HDFNRN08","ENRIQUE GONZALEZ CARDONA",3,"8.0",1710,3102,1,28,"PC","8.0",128078,3,null,20160701,20160930,2742.47,0]
[null,"GUANAJUATO","11DPT0001Q",100,"GODA691116ALA","GODA691116HDFMZL07","ALEJANDRO GOMEZ DIAZ",3,"20.0",1130,3102,0,28,"PA","20.0",280029,3,null,20160701,20160930,20562,0]
[null,"GUANAJUATO","11DPT0008J",120,"GOGF7511182R7","GOGF751118HGTNSR05","FRANCISCO JAVIER GONZALEZ GASCA",3,"24.0",1130,3102,2,33,"PB","24.0",523319,3,null,20160701,20160930,120327.20000000001]
[null,"GUANAJUATO","11DPT0012W",120,"GOHJ740202PJ6","GOHJ740202MGTMRN01","MA JUANA GOMEZ HERNANDEZ",3,"22.0",1130,3102,4,2,"TA","22.0",27007,3,null,20160701,20160930,2866.23]
[null,"GUANAJUATO","11DPT0008J",120,"GOHM731017127","GOHM731017HGTMRG05","MIGUEL ANGEL GOMEZ HERNANDEZ",3,"27.0",1130,3102,2,33,"PB","27.0",523318,3,null,20160701,20160930,28067.830000000005]
[null,"GUANAJUATO","11DPT0005M",120,"GOHM880217IT0","GOHM880217HGTNRR05","MARCOS ELIAS GONZALEZ HERNANDEZ",3,"15.0",1130,3102,0,72,"TA","15.0",1130,3,null,20160701,20160930,3947.32,0]
[null,"GUANAJUATO","11DPT0012W",120,"GOHS8907177Z1","GOHS890717MQTMRN05","SANDRA IRAIS GOMEZ HERNANDEZ",3,"10.0",1130,3102,4,2,"TA","10.0",270008,3,null,20160701,20160930,1390.84]
[null,"GUANAJUATO","11DPT0001Q",100,"GOLG8308137R7","GOLG830813HSPNPB08","GABRIEL HUMBERTO GONZALEZ LOPEZ",3,"20.0",1130,3102,0,28,"TA","20.0",280031,3,null,20160701,20160930,44197.719999999994,0]
[null,"GUANAJUATO","11DPT0009I",100,"GOMO860112AC6","GOMO860112HDFNRM01","OMAR FRANCISCO GONZALEZ MARTINEZ",3,"16.0",1130,3102,1,74,"PB","16.0",740015,3,null,20160701,20160930,105073.70999999998]
[null,"GUANAJUATO","11DPT0005M",120,"GONJ690921H46","GONJ690921HGTMTS00","JOSE JESUS GOMEZ NIETO",3,"15.0",1130,3102,0,72,"PB","15.0",1130,3,null,20160701,20160930,35210.28,0]
[null,"GUANAJUATO","11DPT0003O",120,"GONS740424640","GONS740424MGTNXS08","SUSANA MAGNOLIA GONZALEZ NU?Z",3,"30.0",1130,3102,0,30,"PB","30.0",28,3,null,20160701,20160930,65798.7,0]
[null,"GUANAJUATO","11DPT0007K",120,"GOOC7007237B8","GOOC700123MGTMRR07","MA. DEL CARMEN GOMEZ OROPEZA",3,"30.0",1130,3102,2,3,"PC","30.0",203040,3,null,20160701,20160930,103173.75,0]
[null,"GUANAJUATO","11DPT0008J",120,"GOPA710319IB0","GOPA710319HGTNRD02","ADAN ALEJANDRO GONZALEZ PRESA",3,"15.0",1130,3102,2,33,"PC","15.0",523320,3,null,20160701,20160930,46677.819999999992]
[null,"GUANAJUATO","11DPT0001Q",100,"GOPE721215MA1","GOPE721215HGTNSD00","EDISON OSWALDO GONZALEZ PESCADOR",3,"20.0",1130,3102,0,28,"PB","20.0",280032,3,null,20160701,20160930,3851.5,0]
[null,"GUANAJUATO","11DPT0007K",120,"GOPS6802087F1","GOPS680208HGTNDN00","SANTIAGO GONZALEZ PADILLA",3,"18.0",1130,3102,2,3,"PC","18.0",203034,3,null,20160701,20160930,53650.349999999984,0]
[null,"GUANAJUATO","11DPT0002P",120,"GORC820608RCA","GORC820608MGTLRT07","MA CONCEPCION GONZALEZ RAMIREZ",3,"12.0",1130,3102,0,29,"PC","12.0",290097,3,null,20160701,20160930,16003.8,0]
[null,"GUANAJUATO","11DPT0001Q",100,"GUCA621009A88","GUCA621009MGTTHR00","ARACELI GUTIERREZ CHACON",3,"20.0",1130,3102,0,28,"PB","20.0",280037,3,null,20160701,20160930,48031.41,0]
[null,"GUANAJUATO","11DPT0001Q",100,"GUCM630109EJ1","GUCM630109MGTTSR00","MARIA MARTINA MARGARITA GUTIERREZ CASTRO",3,"25.0",1130,3102,0,28,"PC","25.0",280036,3,null,20160701,20160930,32674.459999999995,0]
[null,"GUANAJUATO","11DPT0011X",100,"GUCT560830E19","GUCT560830MGTRSR17","MA TERESA GUERRERO CASTRO",3,"20.0",1130,3102,2,49,"PC","20.0",249025,3,null,20160701,20160930,62237,0]
[null,"GUANAJUATO","11DPT0007K",120,"GUHR661007QW0","GUHR661007MGTTRC18","ROCIO DEL ROSARIO GUTIERREZ HERNANDEZ",3,"31.0",1130,3102,2,3,"PC","31.0",203038,3,null,20160701,20160930,268571.03000000003,0]
[null,"GUANAJUATO","11DPT0001Q",100,"GUJE600723CI3","GUJE600723HGTZMR03","ERNESTO GUZMAN JIMENEZ",3,"25.0",1130,3102,0,28,"PC","25.0",280038,3,null,20160701,20160930,117919.48000000003,0]
[null,"GUANAJUATO","11DPT0001Q",100,"GULA760327G74","GULA760327MCSLPN05","ANA CELIA GUILLEN LOPEZ",3,"21.0",1130,3102,0,28,"PB","21.0",280035,3,null,20160701,20160930,16176.32,0]
[null,"GUANAJUATO","11DPT0002P",120,"GULG780404F75","GULG780404HGTRGR06","JORGE GUADALUPE GUERRERO LAGUNA",3,"10.0",1130,3102,0,29,"TA","10.0",290035,3,null,20160701,20160930,16062.120000000003,0]
[null,"GUANAJUATO","11DPT0007K",120,"GUMR8110123U3","GUMR811012HCHZNM08","RAMIRO GUZMAN MONTES",3,"10.0",1130,3102,2,3,"PB","10.0",203153,3,null,20160701,20160930,24058.140000000003,0]
[null,"GUANAJUATO","11DPT0006L",120,"GUSG880306VD5","GUSG880306HGTLNR09","GERARDO GUILLEN SANCHEZ",3,"18.0",1130,3102,10,63,"TA","18.0",163093,3,null,20160701,20160930,2299.67,0]
[null,"GUANAJUATO","11DPT0006L",100,"GUSS851005CT6","GUSS851005MGTLNN08","SANDRA GUILLEN SANCHEZ",3,"20.0",1130,3102,10,63,"PA","20.0",163080,3,null,20160701,20160930,21210,0]
[null,"GUANAJUATO","11DPT0002P",120,"GUVG640807PZ4","GUVG640807MDFZRB04","GABRIELA GUIZAR VARGAS",3,"12.0",1130,3102,0,29,"PC","12.0",290036,3,null,20160701,20160930,44440.62000000001,0]
[null,"GUANAJUATO","11DPT0002P",120,"GUVJ730410LD4","GUVJ730410MGTZRD08","JUDITH GUIZAR VARGAS",3,"13.0",1130,3102,0,29,"PA","13.0",290110,3,null,20160701,20160930,13981.800000000001,0]
[null,"GUANAJUATO","11DPT0003O",120,"HEAA581022HVA","HEAA581022HMCRTL07","JOSE ALBERTO HERRERA ATILANO",3,"23.0",1130,3102,0,30,"PC","23.0",28,3,null,20160701,20160930,34391.279999999999,0]
[null,"GUANAJUATO","11DPT0007K",120,"HEAM5406144E9","HEAM540614MDFRRR09","MARISELA HERRERA ARVIZU",3,"12.0",1130,3102,2,3,"PC","12.0",203172,3,null,20160701,20160930,24005.7,0]
[null,"GUANAJUATO","11DPT0011X",100,"HECM670422CC4","HECM670422MDFRBR02","MARIA MARCELA  HERRERA  CEBALLOS ",3,"25.0",1130,3102,2,49,"PC","25.0",249026,3,null,20160701,20160930,71241.659999999989,0]
[null,"GUANAJUATO","11DPT0004N",100,"HEDA800812DP2","HEDA800812HGTTZD09","ADRIAN HERNANDEZ DIAZ",3,"15.0",1130,3102,1,28,"PB","15.0",128017,3,null,20160701,20160930,41645.030000000006,0]
[null,"GUANAJUATO","11DPT0010Y",120,"HEDT700419HG2","HEDT700419HGTRRR01","JOSÉ TERESO HERNÁNDEZ DURÁN",3,"9.0",1130,3102,2,4,"PB","9.0",204024,3,null,20160701,20160930,43475.64,0]
[null,"GUANAJUATO","11DPT0008J",120,"HEEF6801012R8","HEEF680101HHGRSL09","FELIPE HERNANDEZ ESTRADA",3,"26.0",1130,3102,2,33,"PC","26.0",523323,3,null,20160701,20160930,40454.050000000003]
[null,"GUANAJUATO","11DPT0008J",120,"HEFJ700120711","HEFG700120HGTRSD12","J. GUADALUPE HERNANDEZ FISCAL",3,"20.0",1130,3102,2,33,"PC","20.0",523324,3,null,20160701,20160930,125450.5]
[null,"GUANAJUATO","11DPT0012W",120,"HELM570929SP5","HELM570929HQTRRG04","MIGUEL HERNANDEZ LIRA",3,"16.0",1130,3102,4,2,"TA","16.0",270001,3,null,20160701,20160930,6388.52]
[null,"GUANAJUATO","11DPT0008J",120,"HEMB820716LV7","HEMB820716MGTRDR06","BRENDA HERNANDEZ MEDINA",3,"24.0",1130,3102,2,33,"PA","24.0",523365,3,null,20160701,20160930,4112.3999999999996]
[null,"GUANAJUATO","11DPT0008J",120,"HEMR760314HY6","HEMR760314HGTRRL06","RAUL HERNANDEZ MARTINEZ",3,"14.0",1130,3102,2,33,"PB","14.0",523361,3,null,20160701,20160930,2781.1]
[null,"GUANAJUATO","11DPT0011X",100,"HEMY820605MZ2","HEMY820605MGTRNL07","YOLANDA  HERNANDEZ  MONTOYA ",3,"26.0",1130,3102,2,49,"PA","26.0",249067,3,null,20160701,20160930,20066.47,0]
[null,"GUANAJUATO","11DPT0001Q",100,"HEPM8111294E4","HEPM811129HGTRRG03","MIGUEL ANGEL HERNANDEZ PEREZ",3,"26.0",1130,3102,0,28,"PB","26.0",280040,3,null,20160701,20160930,35048.65,0]
[null,"GUANAJUATO","11DPT0002P",120,"HERA4412086H0","HERA441208HGTRSL07","ALFREDO HERRERA ROSALES",3,"10.0",1130,3102,0,29,"PA","10.0",290042,3,null,20160701,20160930,1820.51,0]
[null,"GUANAJUATO","11DPT0002P",100,"HERA5904202S0","HERA590420HGTRSN04","JOSE ANTONIO HERRERA  ROSALES",3,"10.0",1130,3102,0,29,"PB","10.0",290076,3,null,20160701,20160930,24026.640000000003,0]
[null,"GUANAJUATO","11DPT0013V",120,"HERA790726J96","HERA790726MGTRMN07","ANA VERONICA HERNANDEZ RAMIREZ",3,"21.0",1130,3102,3,2,"PA","21.0",302018,3,null,20160701,20160930,5140.5]
[null,"GUANAJUATO","11DPT0002P",100,"HERD520203ADO","HERD520203MSLRSB04","DEBORA HERN RUSSEL",3,"30.0",1130,3102,0,29,"PA","30.0",290038,3,null,20160701,20160930,30843,0]
[null,"GUANAJUATO","11DPT0002P",120,"HERG630310IB0","HERG630310MGTRMB03","MARIA GABRIELA SUSANA HERRERA ZUBIETA ROMERO",3,"25.0",1130,3102,0,29,"PC","25.0",290043,3,null,20160701,20160930,67732.559999999983,0]
[null,"GUANAJUATO","11DPT0004N",120,"HERN811104FB8","HERN811104MMNRJB02","NUBIA VANNESA HERNANDEZ ROJAS",3,"30.0",1130,3102,1,28,"PB","30.0",128042,3,null,20160701,20160930,7786.57,0]
[null,"GUANAJUATO","11DPT0002P",100,"HERR700403DUO","HERR700403HGTRMC07","RICARDO MARTIN HERNANDEZ RAMIREZ",3,"12.0",1130,3102,0,29,"PB","12.0",290040,3,null,20160701,20160930,65673.959999999977,0]
[null,"GUANAJUATO","11DPT0009I",100,"IACC631023AI2","IACC631023HGTBNH06","CUAUHTEMOC IBARRA CANO",3,"27.0",1130,3102,1,74,"PB","27.0",740016,3,null,20160701,20160930,98333.619999999981]
[null,"GUANAJUATO","11DPT0003O",120,"IUMM800617VC2","IUMM800617MGTSRY06","MYRNA DENISSE ISUSQUIZA MARTÍNEZ",3,"25.0",1130,3102,0,30,"PB","25.0",28,3,null,20160701,20160930,2345.73,0]
[null,"GUANAJUATO","11DPT0012W",120,"JAAM590516MH6","JAAM590516HGTMRN03","MANUEL JAIME ARELLANO",3,"24.0",1130,3102,4,2,"PA","24.0",270001,3,null,20160701,20160930,10311.119999999999]
[null,"GUANAJUATO","11DPT0006L",100,"JAMJ8502091S3","JAMJ850209HDFSRL04","JULIO CESAR JASSO MARTINEZ",3,"19.0",1130,3102,10,63,"PB","19.0",163021,3,null,20160701,20160930,18871.75,0]
[null,"GUANAJUATO","11DPT0002P",120,"JAOP740625985","JAOP740625MGTMLT05","PATRICIA JAIME  OLVERA",3,"25.0",1130,3102,0,29,"PA","25.0",290140,3,null,20160701,20160930,39363.75,0]
[null,"GUANAJUATO","11DPT0006L",100,"JAPM610407F53","JAPM610407HGTSRR00","MARCELINO JASSO PEREZ",3,"20.0",1130,3102,10,63,"PA","20.0",163022,3,null,20160701,20160930,35350,0]
[null,"GUANAJUATO","11DPT0001Q",120,"JIEC831030A73","JIEC831030MGTMSR07","MARIA CRISTHIAN JIMENEZ ESQUEDA",3,"16.0",1130,3102,0,28,"PA","16.0",280156,3,null,20160701,20160930,5140.5,0]
[null,"GUANAJUATO","11DPT0001Q",100,"JISS660630UT8","JISS660630HGTMNR01","SERGIO JIMENEZ SANCHEZ",3,"21.0",1130,3102,0,28,"PA","21.0",280042,3,null,20160701,20160930,25982.25,0]
[null,"GUANAJUATO","11DPT0002P",120,"JOSJ820529NC7","JOSJ820529HNTYNN07","JONATHAN JOYA DE LA SANCHA",3,"20.0",1130,3102,0,29,"PC","20.0",290140,3,null,20160701,20160930,13336.5,0]
[null,"GUANAJUATO","11DPT0010Y",120,"JUBE7310241I6","JUBE731024MGTRLL05","ELIDUVINA JUAREZ BALANDRÁN",3,"15.0",1130,3102,2,4,"TA","15.0",204028,3,null,20160701,20160930,13748.98,0]
[null,"GUANAJUATO","11DPT0008J",120,"JULA7109296W5","JULA710929HGTRNL01","ALEJANDRO JUAREZ LEON",3,"23.0",1130,3102,2,33,"PA","23.0",523326,3,null,20160701,20160930,81156.950000000012]
[null,"GUANAJUATO","11DPT0008J",120,"JULB700329347","JULB700329HGTRNN09","BENITO JUAREZ LEON",3,"20.0",1130,3102,2,33,"PB","20.0",1130,3,null,20160701,20160930,55622]
[null,"GUANAJUATO","11DPT0008J",120,"LACD700106TJ4","LACD700106HMCGRV02","DAVID LAGUNA CARRANCO",3,"15.0",1130,3102,2,33,"PC","15.0",523328,3,null,20160701,20160930,70016.729999999981]
[null,"GUANAJUATO","11DPT0003O",120,"LAGG811206L76","LAGG811206MGTRND04","MARIA GUADALUPE LARA GONZALEZ",3,"25.0",1130,3102,0,30,"PB","25.0",28,3,null,20160701,20160930,20798.099999999999,0]
[null,"GUANAJUATO","11DPT0001Q",100,"LAML7310086Z6","LAML731008MGTRNR00","LAURA LARA MANCERA",3,"20.0",1130,3102,0,28,"PC","20.0",280044,3,null,20160701,20160930,93355.5,0]
[null,"GUANAJUATO","11DPT0007K",120,"LAMV790816C4A","LAMV790816MGTRNN04","VANESSA GEOVANNA LARIOS MINJARES",3,"12.0",1130,3102,2,3,"PB","12.0",203137,3,null,20160701,20160930,18876,0]
[null,"GUANAJUATO","11DPT0002P",120,"LARJ570720TF2","LARJ570720HGTGDR08","JORGE ARTURO LAGUNA RODIGUEZ",3,"16.0",1130,3102,0,29,"PC","16.0",290044,3,null,20160701,20160930,21338.400000000001,0]
[null,"GUANAJUATO","11DPT0005M",120,"LEGR710831DD0","LEGR710831HGTSNL02","RAUL LESSO GONZALEZ ",3,"14.0",1130,3102,0,72,"PC","14.0",1130,3,null,20160701,20160930,32229.599999999991,0]
[null,"GUANAJUATO","11DPT0009I",100,"LEHM650906984","LEHM650906HGTNRG07","MIGUEL ANGEL DE LEON HURTADO",3,"10.0",1130,3102,1,74,"TA","10.0",740010,3,null,20160701,20160930,5500.16]
[null,"GUANAJUATO","11DPT0007K",120,"LELJ740926PK3","LELJ740926HJCNPN01","JUAN ANTONIO LEON LOPEZ",3,"15.0",1130,3102,2,3,"PC","15.0",203046,3,null,20160701,20160930,43663.099999999991,0]
[null,"GUANAJUATO","11DPT0001Q",100,"LOBA7910123P2","LOBA791012HJCPRL00","ALEJANDRO LOPEZ BRIONES",3,"15.0",1130,3102,0,28,"PB","15.0",280045,3,null,20160701,20160930,60661.229999999981,0]
[null,"GUANAJUATO","11DPT0004N",100,"LOBL610801UA2","LOBL610801HGTPDS05","LUIS LOPEZ BEDOLLA",3,"12.0",1130,3102,1,28,"PB","12.0",128019,3,null,20160701,20160930,28067.830000000005,0]
[null,"GUANAJUATO","11DPT0002P",120,"LOCJ790515Q78","LOCJ790515HGTPHN00","JUAN ANDRES LOPEZ CHAVEZ ",3,"26.0",1130,3102,0,29,"PA","26.0",290127,3,null,20160701,20160930,26730.6,0]
[null,"GUANAJUATO","11DPT0003O",120,"LOGG700109MF1","LOGG700109MGTPRD02","MA. GUADALUPE LOPEZ GARCIA",3,"30.0",1130,3102,0,30,"PB","30.0",28,3,null,20160701,20160930,20798.099999999999,0]
[null,"GUANAJUATO","11DPT0001Q",100,"LOGJ711211E25","LOGJ711211HGTMVN07","JUAN LOMAS GUEVARA",3,"20.0",1130,3102,0,28,"PB","20.0",280098,3,null,20160701,20160930,48730.6,0]
[null,"GUANAJUATO","11DPT0008J",120,"LOGS791206JH1","LOGS791206HGTPPR07","SERGIO LOPEZ GUAPO",3,"25.0",1130,3102,2,33,"PA","25.0",523331,3,null,20160701,20160930,77494.13]
[null,"GUANAJUATO","11DPT0006L",100,"LOHE8811064TA","LOHE881106MJCPRD00","EDITH LOPEZ HERNANDEZ",3,"12.0",1130,3102,10,63,"TA","12.0",163067,3,null,20160701,20160930,16781.8,0]
[null,"GUANAJUATO","11DPT0001Q",120,"LOJR7312299QW","LOJR731229HGTPRC05","RICARDO LOPEZ JUAREZ",3,"25.0",1130,3102,0,28,"PB","25.0",280140,3,null,20160701,20160930,8724.76,0]
[null,"GUANAJUATO","11DPT0004N",120,"LOLB790114RE0","LOLB790114MGTPPR08","BERENICE LOPEZ LOPEZ",3,"16.0",1130,3102,1,28,"PB","16.0",128019,3,null,20160701,20160930,2334.0100000000002,0]
[null,"GUANAJUATO","11DPT0006L",100,"LOMA671109LL9","LOMA671109MGTPLL00","ALEJANDRA LOPEZ MELGAREJO",3,"17.0",1130,3102,10,63,"PC","17.0",163023,3,null,20160701,20160930,38381.799999999996,0]
[null,"GUANAJUATO","11DPT0004N",100,"LOOE660716UY7","LOOE660716HGTPJD01","EDUARDO LOPEZ OJEDA",3,"8.0",1710,3102,1,28,"PB","8.0",128021,3,null,20160701,20160930,19197.29,0]
[null,"GUANAJUATO","11DPT0010Y",100,"LORC760609NB1","LORC760609MDFPVL08","CLAUDETTE LÓPEZ DE LA RIVA",3,"20.0",1130,3102,2,4,"PC","20.0",204030,3,null,20160701,20160930,31097.5,0]
[null,"GUANAJUATO","11DPT0007K",120,"LORF540804250","LORF540804HJCPLR09","FRANCISCO JAVIER LOPEZ RUELAS",3,"20.0",1130,3102,2,3,"PC","20.0",203047,3,null,20160701,20160930,57791.5,0]
[null,"GUANAJUATO","11DPT0013V",120,"LORM590406948","LORM590406MGTPDD05","MA GUADALUPE LOPEZ RODRIGUEZ",3,"30.0",1130,3102,3,2,"PB","30.0",302020,3,null,20160701,20160930,5777.25]
[null,"GUANAJUATO","11DPT0010Y",120,"LOVJ660127MI1","LOVJ660127HGTPLN03","JUAN LÓPEZ VALENCIA",3,"30.0",1130,3102,2,4,"PB","30.0",204032,3,null,20160701,20160930,40440.75,0]
[null,"GUANAJUATO","11DPT0008J",120,"LOVT730719N69","LOVT730719MGTPLR04","MARIA TERESITA LOPEZ VILLAGOMEZ",3,"25.0",1130,3102,2,33,"PB","25.0",523333,3,null,20160701,20160930,33700.660000000003]
[null,"GUANAJUATO","11DPT0008J",120,"LOVV821208K16","LOVV821208HGTPZC03","VICTOR HUGO LOPEZ VAZQUEZ",3,"22.0",1130,3102,2,33,"PA","22.0",523332,3,null,20160701,20160930,104362.29999999999]
[null,"GUANAJUATO","11DPT0011X",100,"LUCF7002115Q9","LUCF700211HGTLND05","FIDEL  LULE  CONTRERAS ",3,"12.0",1130,3102,2,49,"PC","12.0",249028,3,null,20160701,20160930,27292.979999999992,0]
[null,"GUANAJUATO","11DPT0006L",100,"LUWR540208FX7","LUWR540208MDFNRB04","REBECA LUNA WIARCO",3,"22.0",1130,3102,10,63,"PB","22.0",163024,3,null,20160701,20160930,60913.25,0]
[null,"GUANAJUATO","11DPT0003O",120,"MAAJ840617R99","MAAJ840617HGTRLN05","JUAN GUILLERMO MARTIN DEL CAMPO ALMENDARIZ",3,"20.0",1130,3102,0,30,"PA","20.0",28,3,null,20160701,20160930,21210,0]
[null,"GUANAJUATO","11DPT0005M",120,"MABG7804019Z5","MABG780401MGTCRL00","GLORIA ELENA MACIEL  BARAJAS",3,"15.0",1130,3102,0,72,"PB","15.0",1130,3,null,20160701,20160930,69873.84,0]
[null,"GUANAJUATO","11DPT0001Q",100,"MACM811125AAA","MACM811125MGTSRR00","MARLENE SELENE MASCOTTE CRUZ",3,"19.0",1130,3102,0,28,"PB","19.0",280115,3,null,20160701,20160930,40825.959999999992,0]
[null,"GUANAJUATO","11DPT0005M",120,"MAGD5812285Y1","MAGD581228MGTRRL00","MARIA DOLORES MARTINEZ  GARCIA",3,"9.0",1130,3102,0,72,"PA","9.0",1130,3,null,20160701,20160930,5101.9800000000005,0]
[null,"GUANAJUATO","11DPT0006L",100,"MAGM780331EF7","MAGM780331MGTRZR08","MARIANA MARIN GUZMAN",3,"23.0",1130,3102,10,63,"PA","23.0",163027,3,null,20160701,20160930,39410.5,0]
[null,"GUANAJUATO","11DPT0011X",100,"MAHA821225TQ5","MAHA821225MGTRRL02","ALEJANDRA  MARTINEZ  HERNANDEZ ",3,"15.0",1130,3102,2,49,"PB","15.0",249030,3,null,20160701,20160930,78357.02,0]
[null,"GUANAJUATO","11DPT0007K",120,"MAHE740312EP4","MAHE740312MJCLRR09","ERIKA GUADALUPE MALDONADO HERNANDEZ",3,"18.0",1130,3102,2,3,"PC","18.0",203051,3,null,20160701,20160930,107300.69999999995,0]
[null,"GUANAJUATO","11DPT0004N",100,"MAHS851214LA6","MAHS851214MGTRRN01","SANDRA MARTINEZ HERNANDEZ",3,"20.0",1130,3102,1,28,"PB","20.0",128050,3,null,20160701,20160930,34800.42,0]
[null,"GUANAJUATO","11DPT0006L",100,"MAJT7906215T2","MAJT790621MGTNRR01","TERESA MANDUJANO JURADO",3,"19.0",1130,3102,10,63,"PB","19.0",163026,3,null,20160701,20160930,33875.479999999996,0]
[null,"GUANAJUATO","11DPT0009I",100,"MALS720215M37","MALS720215MGTRPR06","SARA MARTINEZ LOPEZ",3,"20.0",1130,3102,1,74,"PB","20.0",740020,3,null,20160701,20160930,79886.45]
[null,"GUANAJUATO","11DPT0006L",100,"MAMA660610965","MAMA660610HGTRLR00","ARMANDO MARTINEZ MALDONADO",3,"14.0",1130,3102,10,63,"PC","14.0",163028,3,null,20160701,20160930,58771.499999999985,0]
[null,"GUANAJUATO","11DPT0001Q",100,"MAMA711017CPA","MAMA711017HGTRNR02","ARTURO MARTINEZ MONCADA",3,"24.0",1130,3102,0,28,"PB","24.0",280051,3,null,20160701,20160930,22916.46,0]
[null,"GUANAJUATO","11DPT0001Q",100,"MAMA770820UT0","MAMA770820MGTRRN06","ANA LILIA MARTINEZ MARTINEZ",3,"20.0",1130,3102,0,28,"PC","20.0",280050,3,null,20160701,20160930,31118.5,0]
[null,"GUANAJUATO","11DPT0008J",120,"MAMG691216UYA","MAMG691216HGTRRD04","JOSE GUADALUPE RAUL MARTINEZ MORENO",3,"20.0",1130,3102,2,33,"PA","20.0",523335,3,null,20160701,20160930,49490]
[null,"GUANAJUATO","11DPT0005M",120,"MARJ690613N97","MARJ690613HGTGYN00","JUAN MIGUEL MAGAÑA  RAYA",3,"30.0",1130,3102,0,72,"PA","30.0",1130,3,null,20160701,20160930,60537,0]
[null,"GUANAJUATO","11DPT0013V",120,"MARM860927B16","MARM860927MGTRVN09","MARIA MONTSERRAT MARES RIVERA",3,"15.0",1130,3102,3,2,"PB","15.0",302093,3,null,20160701,20160930,8122.99]
[null,"GUANAJUATO","11DPT0001Q",100,"MARR660925MG9","MARR660925MGTRDC04","ROCIO MARTINEZ RODRIGUEZ",3,"17.0",1130,3102,0,28,"PB","17.0",280052,3,null,20160701,20160930,3273.78,0]
[null,"GUANAJUATO","11DPT0006L",100,"MASE831216GZ4","MASE831216MGTNTL05","ELIA MANDUJANO SOTO",3,"20.0",1130,3102,10,63,"PA","20.0",163068,3,null,20160701,20160930,28280,0]
[null,"GUANAJUATO","11DPT0001Q",100,"MASJ651012DZ4","MASJ651012HVZRNN09","JUAN CARLOS MARTINEZ SANTOS",3,"23.0",1130,3102,0,28,"PB","23.0",280053,3,null,20160701,20160930,53921.069999999992,0]
[null,"GUANAJUATO","11DPT0002P",100,"MASS590809U18","MASS590809HGTRTL08","SALVADOR MARTINEZ SOTO",3,"31.0",1130,3102,0,29,"TA","31.0",290052,3,null,20160701,20160930,23431.38,0]
[null,"GUANAJUATO","11DPT0002P",100,"MAST621028SCA","MAST621028MGTRTT12","MA TERESA MARTINEZ SOTO",3,"16.0",1130,3102,0,29,"PB","16.0",290051,3,null,20160701,20160930,18487.2,0]
[null,"GUANAJUATO","11DPT0009I",100,"MATG681016SW7","MATG681016HGTGFR08","GERARDO MAGAÑA TAFOYA",3,"30.0",1130,3102,1,74,"PA","30.0",740019,3,null,20160701,20160930,85473.5]
[null,"GUANAJUATO","11DPT0004N",120,"MATJ861103RG1","MATJ861103MGTRPZ09","JAZMIN MONSERRAT MARTINEZ TAPIA",3,"12.0",1710,3102,1,28,"PA","12.0",128073,3,null,20160701,20160930,2742.47,0]
[null,"GUANAJUATO","11DPT0002P",120,"MATM690314EG4","MATM690314MGTRRT12","MATILDE MARTINEZ TORRES",3,"16.0",1130,3102,0,29,"PC","16.0",290053,3,null,20160701,20160930,65359.200000000019,0]
[null,"GUANAJUATO","11DPT0010Y",100,"MAVR720809AXA","MAVR720809MGTNZS05","ROSA BEATRIZ MANJARREZ VAZQUEZ",3,"6.0",1130,3102,2,4,"PC","6.0",204033,3,null,20160701,20160930,7996.5,0]
[null,"GUANAJUATO","11DPT0009I",100,"MEAA781114FWA","MEAA781114MGTDRD01","ADRIANA MEDEL ARROYO",3,"20.0",1130,3102,1,74,"PA","20.0",740021,3,null,20160701,20160930,73479]
[null,"GUANAJUATO","11DPT0007K",120,"MEGL640103827","MEGL640103MGTLTT08","MA. LETICIA MELENDEZ GUTIERREZ",3,"29.0",1130,3102,2,3,"PB","29.0",203056,3,null,20160701,20160930,74891.05,0]
[null,"GUANAJUATO","11DPT0009I",100,"MEGM731204L93","MEGM731204MGTNZR02","MARISA MENDEZ GUZMAN",3,"16.0",1130,3102,1,74,"PB","16.0",740022,3,null,20160701,20160930,21568.400000000001]
[null,"GUANAJUATO","11DPT0012W",120,"MEGR720113GQ8","MEGR720113HMNRNM02","RAMIRO MERCADO  GONZALEZ",3,"15.0",1130,3102,4,2,"PB","15.0",27018,3,null,20160701,20160930,46218.079999999994]
[null,"GUANAJUATO","11DPT0001Q",120,"MEHE811224IH7","MEHE811224HGTNRM08","EMMANUEL MENDOZA HERNANDEZ",3,"15.0",1130,3102,0,28,"PB","15.0",280148,3,null,20160701,20160930,7070,0]
[null,"GUANAJUATO","11DPT0011X",100,"MERA6410168B4","MERA641016HGTDZL14","ALEJANDRO MEDINA REZA",3,"14.0",1130,3102,2,49,"PC","14.0",249033,3,null,20160701,20160930,44937.899999999987,0]
[null,"GUANAJUATO","11DPT0003O",120,"MESF820630A32","MESF820630HGTNLR02","FRANCISCO JAVIER MENDOZA SOLORZANO",3,"28.0",1130,3102,0,30,"TA","28.0",28,3,null,20160701,20160930,24017.200000000001,0]
[null,"GUANAJUATO","11DPT0007K",120,"MESM670501FH5","MESM670501HDFNGR03","MARCO ALFREDO MENDOZA SEGURA",3,"25.0",1130,3102,2,3,"PA","25.0",203057,3,null,20160701,20160930,215599.80000000005,0]
[null,"GUANAJUATO","11DPT0007K",120,"MEZJ750302AC9","MEZJ750302HGTNPR00","JORGE MENDOZA ZAPATA",3,"19.0",1130,3102,2,3,"PC","19.0",203152,3,null,20160701,20160930,8446.4599999999991]
[null,"GUANAJUATO","11DPT0009I",100,"MOCM7012151Q9","MOCM701215MGTRNN01","MANUELA MORALES CENDEJAS",3,"10.0",1130,3102,1,74,"PC","10.0",740025,3,null,20160701,20160930,27313.860000000004]
[null,"GUANAJUATO","11DPT0001Q",100,"MOHD5903208E0","MOHD590320HMCCRL05","JOSE DOLORES GUADALUPE MOCTEZUMA HERNANDEZ",3,"22.0",1130,3102,0,28,"PB","22.0",280054,3,null,20160701,20160930,29656.550000000003,0]
[null,"GUANAJUATO","11DPT0012W",120,"MOHS911002127","MOHS911002HMCNRR00","SERGIO MONTES DE OCA HURTADO",3,"10.0",1130,3102,4,2,"TA","10.0",270015,3,null,20160701,20160930,2786.3199999999997]
[null,"GUANAJUATO","11DPT0001Q",100,"MOPL8106219G5","MOPL810621MGTRLD07","LIDIA MORENO PALOALTO",3,"24.0",1130,3102,0,28,"PB","24.0",280055,3,null,20160701,20160930,72793.420000000013,0]
[null,"GUANAJUATO","11DPT0003O",120,"MOQR840307NN2","MOQR840307HGTRRC01","RICARDO MORALES QUIROZ",3,"20.0",1130,3102,0,30,"PA","20.0",28,3,null,20160701,20160930,14140,0]
[null,"GUANAJUATO","11DPT0010Y",100,"MORA600920UJ0","MORA600920MGTSVN08","MARÍA DE LOS ÁNGELES MOSQUEDA RUVALCABA",3,"26.0",1130,3102,2,4,"PC","26.0",204041,3,null,20160701,20160930,40426.75,0]
[null,"GUANAJUATO","11DPT0007K",120,"MORB790906FV5","MORB790906MGTNSR05","BERTHA ALICIA MONJARAZ RIOS",3,"17.0",1130,3102,2,3,"PC","17.0",203182,3,null,20160701,20160930,11232.76]
[null,"GUANAJUATO","11DPT0013V",120,"MORJ631227S89","MORJ631227HGTTMN01","JUAN  MOTA RAMIREZ",3,"16.0",1130,3102,3,2,"PB","16.0",302025,3,null,20160701,20160930,7913.86]
[null,"GUANAJUATO","11DPT0010Y",100,"MORR630513CT2","MORR630513HGTSVD06","RODOLFO MOSQUEDA RUVALCABA",3,"20.0",1130,3102,2,4,"PC","20.0",204042,3,null,20160701,20160930,94293.5,0]
[null,"GUANAJUATO","11DPT0011X",100,"MOSA681126R27","MOSA681126MGTNRN06","MA ANGELES  MONTERO  SIERRA ",3,"24.0",1130,3102,2,49,"PC","24.0",249023,3,null,20160701,20160930,100755.20000000004,0]
[null,"GUANAJUATO","11DPT0007K",120,"MOVJ75111289A","MOVJ751112HJCRRR01","JORGE ARMANDO MORALES VARGAS",3,"20.0",1130,3102,2,3,"PC","20.0",203060,3,null,20160701,20160930,57791.5]
[null,"GUANAJUATO","11DPT0007K",120,"MOVM841118881","MOVM841118MGTNRR09","MARIELA MONTIEL  VERA",3,"20.0",1130,3102,2,3,"PC","20.0",203143,3,null,20160701,20160930,8891]
[null,"GUANAJUATO","11DPT0003O",120,"MUCE6604088C8","MUCE660408HGTXRL04","ELIAS MUÑOZ CORTES",3,"12.0",1130,3102,0,30,"PB","12.0",28,3,null,20160701,20160930,30760.979999999992,0]
[null,"GUANAJUATO","11DPT0003O",120,"MUCM5811195T2","MUCM580119HGTXMR09","JOSE MARIO MUÑOZ CAMPUSANO",3,"10.0",1130,3102,0,30,"PB","10.0",28,3,null,20160701,20160930,14029.859999999999,0]
[null,"GUANAJUATO","11DPT0012W",100,"MUIM8412058X9","MUIM841205MQTXBR03","MARIANA MUÑOZ IBARRA",3,"35.0",1130,3102,4,2,"PB","35.0",270020,3,null,20160701,20160930,175168.62,0]
[null,"GUANAJUATO","11DPT0003O",120,"MUMJ581102LE9","MUMJ581102HGTXRM09","JAIME MUÑOZ MARTINEZ",3,"22.0",1130,3102,0,30,"PC","22.0",28,3,null,20160701,20160930,26673,0]
[null,"GUANAJUATO","11DPT0011X",100,"NAFE720728918","NAFE720728MDFVRV08","EVANGELINA NAVARRETE FARFAN",3,"25.0",1130,3102,2,49,"PA","25.0",249037,3,null,20160701,20160930,56386.89,0]
[null,"GUANAJUATO","11DPT0007K",120,"NAGM7308014C0","NAGM730801MGTJZR05"," MARCELA NAJERA GUZMAN ",3,"30.0",1130,3102,2,3,"PB","30.0",203064,3,null,20160701,20160930,215164.82000000004]
[null,"GUANAJUATO","11DPT0003O",120,"NAJE70071623A","NAJE700716HGTVMN08","ENRIQUE NAVARRETE JIMENEZ",3,"23.0",1130,3102,0,30,"PA","23.0",28,3,null,20160701,20160930,74865.600000000006,0]
[null,"GUANAJUATO","11DPT0002P",120,"OASF640805DW4","OASF640805HGTCTR00","FRANCISCO JAVIER OCAMPO SOTO",3,"10.0",1130,3102,0,29,"PC","10.0",290057,3,null,20160701,20160930,13932.780000000002,0]
[null,"GUANAJUATO","11DPT0012W",120,"OAVO8206077E6","OAVO820607HMNCZ08","OMAR ANTONIO  OCAMPO  VAZQUEZ",3,"23.0",1130,3102,4,2,"PA","23.0",27021,3,null,20160701,20160930,27587.35]
[null,"GUANAJUATO","11DPT0007K",120,"OEGR7911068I7","OEGR791106MGTRMS01"," ROSA MARIA ORNELAS  GOMEZ",3,"14.0",1130,3102,2,3,"PC","14.0",203157,3,null,20160701,20160930,25339.380000000005]
[null,"GUANAJUATO","11DPT0007K",120,"OELL840306742","OELL840306MGTRNR06","LAURA DEL ROCIO ORNELAS LUNA",3,"14.0",1130,3102,2,3,"PA","14.0",203199,3,null,20160701,20160930,2474.5]
[null,"GUANAJUATO","11DPT0007K",120,"OIAE780131HL9","OIAE780131HGTNLD06","EDGAR JIONEL ONTIVEROS ALCALA",3,"16.0",1130,3102,2,3,"PC","16.0",203156,3,null,20160701,20160930,56020.240000000013]
[null,"GUANAJUATO","11DPT0001Q",100,"OIBM740215HY9","OIBM740215MGTRRR07","MIRIAM ORTIZ BARROSO",3,"20.0",1130,3102,0,28,"PC","20.0",280059,3,null,20160701,20160930,71241.659999999989,0]
[null,"GUANAJUATO","11DPT0002P",120,"OIGE810723LS4","OIGE810723MVZRRD02","EDITH ORTIZ GARCIA",3,"25.0",1130,3102,0,29,"PC","25.0",290089,3,null,20160701,20160930,67865.939999999988,0]
[null,"GUANAJUATO","11DPT0012W",120,"OIMG610814NA3","OIMG610814MGTRLD00","MA. GUADALUPE ORTIZ MELENDEZ",3,"20.0",1130,3102,4,2,"PC","20.0",27026,3,null,20160701,20160930,124474]
[null,"GUANAJUATO","11DPT0013V",120,"OINM651022J76","OINM651022HGTRVR07","MARTIN ORTIZ NAVARRO",3,"15.0",1130,3102,3,2,"PC","15.0",302111,3,null,20160701,20160930,8913.24]
[null,"GUANAJUATO","11DPT0006L",100,"OISA541015SQ0","OISA541015HGTRLL00","ALEJANDRO ORTIZ SILVA",3,"17.0",1130,3102,10,63,"PC","17.0",163031,3,null,20160701,20160930,44724.480000000003,0]
[null,"GUANAJUATO","11DPT0002P",120,"OIZG5306099RR","OIZG530609HGTRFL01","GUILLERMO ORTIZ ZAFRA",3,"29.0",1130,3102,0,29,"PC","29.0",290093,3,null,20160701,20160930,12177.86,0]
[null,"GUANAJUATO","11DPT0004N",100,"OOOC810927BA9","OOOC810927MGTRRL05","CLAUDIA KARINA OROZCO OROZCO",3,"15.0",1130,3102,1,28,"PB","15.0",128024,3,null,20160701,20160930,41078.660000000003,0]
[null,"GUANAJUATO","11DPT0008J",120,"OOSJ630117DK1","OOSJ630117HGTRNN00","JUAN MANUEL OROPEZA SANCHEZ",3,"25.0",1130,3102,2,33,"PC","25.0",523339,3,null,20160701,20160930,41280.679999999993]
[null,"GUANAJUATO","11DPT0005M",120,"PAAM820226JB0","PAAM820226HGTRGR02","MARTIN PRADO AGUILAR",3,"30.0",1130,3102,0,72,"PA","30.0",1130,3,null,20160701,20160930,15421.5,0]
[null,"GUANAJUATO","11DPT0012W",120,"PABJ671110D69","PABJ671110HJCLRS08","JOSE DE JESUS PLASCENCIA BARAJAS",3,"23.0",1130,3102,4,2,"PC","23.0",27031,3,null,20160701,20160930,36913.310000000005]
[null,"GUANAJUATO","11DPT0011X",100,"PACM790918HT8","PACM790918HGTNRR13","MAURICIO  PANIAGUA  CARRILLO ",3,"15.0",1130,3102,2,49,"PC","15.0",249040,3,null,20160701,20160930,46677.819999999992,0]
[null,"GUANAJUATO","11DPT0003O",120,"PAHF740428HK9","PAHF740428HGTDRR00","FRANCISCO JAVIER PADILLA HERNÁNDEZ",3,"20.0",1130,3102,0,30,"PB","20.0",28,3,null,20160701,20160930,11055.759999999998,0]
[null,"GUANAJUATO","11DPT0004N",120,"PARA650525ER4","PARA650525HGTNYR08","ARMANDO PANTOJA REYES",3,"18.0",1710,3102,1,28,"PB","18.0",128080,3,null,20160701,20160930,3656.63,0]
[null,"GUANAJUATO","11DPT0003O",120,"PARH580204E82","PARH580204HDFDYC09","HECTOR PADILLA REYES",3,"10.0",1130,3102,0,30,"PB","10.0",28,3,null,20160701,20160930,24026.640000000003,0]
[null,"GUANAJUATO","11DPT0006L",100,"PASM631104DP4","PASM631104MDFDNR08","MARTHA ROCIO PADILLA SANDOVAL",3,"16.0",1130,3102,10,63,"PA","16.0",163032,3,null,20160701,20160930,66835.199999999983,0]
[null,"GUANAJUATO","11DPT0011X",100,"PATF850801UJA","PATF850801HGTLPR02","FRANCISCO EVERARDO  PLAZA  TAPIA ",3,"24.0",1130,3102,2,49,"PA","24.0",249043,3,null,20160701,20160930,42848.679999999986,0]
[null,"GUANAJUATO","11DPT0004N",100,"PEAA590708RJ5","PEAA590708HDFRLD08","JOSE ADRIAN ARTURO PEREZ ALVAREZ",3,"9.0",1130,3102,1,28,"PB","9.0",128026,3,null,20160701,20160930,10962.42,0]
[null,"GUANAJUATO","11DPT0012W",120,"PEBG910930PM0","PEBG910930MQTRCD18","MARIA GUADALUPE PEREZ BECERRA",3,"10.0",1130,3102,4,2,"TA","10.0",270013,3,null,20160701,20160930,5588.33]
[null,"GUANAJUATO","11DPT0006L",100,"PEBJ680711PC1","PEBJ680711MGTRRN00","JUANA PEREZ BERNAL",3,"15.0",1130,3102,10,63,"PC","15.0",163034,3,null,20160701,20160930,26673.040000000005,0]
[null,"GUANAJUATO","11DPT0004N",100,"PEEJ780324IC1","PEEJ780324HMNRSN01","JUAN FERNANDO PEREZ ESPINO",3,"19.0",1130,3102,1,28,"PC","19.0",128027,3,null,20160701,20160930,29562.609999999997,0]
[null,"GUANAJUATO","11DPT0009I",100,"PEFD7301136V8","PEFD730113HGTRLV06","DAVID PEREZ FELIPE",3,"16.0",1130,3102,1,74,"TA","16.0",740027,3,null,20160701,20160930,29744.609999999997]
[null,"GUANAJUATO","11DPT0012W",120,"PEGA8608144V9","PEGA860814MGTRTD07","MARIA AIDA PEREZ  GUTIERREZ ",3,"35.0",1130,3102,4,2,"PA","35.0",27029,3,null,20160701,20160930,86607.5]
[null,"GUANAJUATO","11DPT0012W",120,"PEGR750725A34","PEGR750725HDFRTC00","RICARDO PEREZ GUTIERREZ",3,"18.0",1130,3102,4,2,"PA","18.0",270011,3,null,20160701,20160930,3084.3]
[null,"GUANAJUATO","11DPT0001Q",100,"PEGR811217KS9","PEGR811217HGTRRC00","RICARDO PEREZ GARCIA",3,"16.0",1130,3102,0,28,"PA","16.0",280062,3,null,20160701,20160930,58783.199999999997,0]
[null,"GUANAJUATO","11DPT0011X",100,"PEHS851206000","PEHS851206HGTXRL09","JOSE SALUD PEÑA HERNANDEZ",3,"19.0",1130,3102,2,49,"PB","19.0",249042,3,null,20160701,20160930,77645.470000000016,0]
[null,"GUANAJUATO","11DPT0003O",120,"PEJE510902DF6","PEJE510902HOCRRS08","ESTEBAN PEREZ JUAREZ",3,"20.0",1130,3102,0,30,"PC","20.0",28,3,null,20160701,20160930,17782,0]
[null,"GUANAJUATO","11DPT0012W",100,"PEQP6003137R3","PEQP600313MQTRNT01","PATRICIA ANTONIA PEREZ  QUINTERO ",3,"29.0",1130,3102,4,2,"PC","29.0",27030,3,null,20160701,20160930,45121.86,0]
[null,"GUANAJUATO","11DPT0009I",100,"PESA790927U25","PESA790927MGTRTN06","ANDREA MAGDALENA PEREZ SOTO",3,"30.0",1130,3102,1,74,"PB","30.0",740028,3,null,20160701,20160930,118481.65]
[null,"GUANAJUATO","11DPT0001Q",120,"PIZM740723DV9","PIZM740723MGTZMR06","MIRYAM PIZANO ZAMORA",3,"15.0",1130,3102,0,28,"PA","15.0",280147,3,null,20160701,20160930,2570.25,0]
[null,"GUANAJUATO","11DPT0008J",120,"QUMN8108073JA","QUMN810807MGTNRR05","NEIRA JENNIFER QUINTERO MORENO",3,"27.0",1130,3102,2,33,"PB","27.0",523341,3,null,20160701,20160930,75022.709999999992]
[null,"GUANAJUATO","11DPT0006L",100,"RAAG811213NX5","RAAG811213MGTMGD09","MARIA GUADALUPE RAMIREZ AGUIRRE",3,"22.0",1130,3102,10,63,"PB","22.0",163036,3,null,20160701,20160930,16946.599999999999,0]
[null,"GUANAJUATO","11DPT0005M",120,"RAAL791208PR9","RAAL791208MGTZNL07","LILIA CONCEPCION RAZO ANGELES",3,"30.0",1130,3102,0,72,"PA","30.0",1130,3,null,20160701,20160930,26673,0]
[null,"GUANAJUATO","11DPT0006L",100,"RABS681021GFA","RABS681021MGTMRL03","MA SOLEDAD RAMIREZ BERMUDEZ",3,"21.0",1130,3102,10,63,"PC","21.0",163037,3,null,20160701,20160930,19259.12,0]
[null,"GUANAJUATO","11DPT0010Y",100,"RACM561219L8A","RACM561219HGTMNR07","MARIO RAMÍREZ CONTRERAS",3,"9.0",1130,3102,2,4,"PB","9.0",204056,3,null,20160701,20160930,18081.280000000002,0]
[null,"GUANAJUATO","11DPT0008J",120,"RAFB620409PS9","RAFB620409MNLMNL08","BLANCA ESTHELA RAMOS FUENTES",3,"21.0",1130,3102,2,33,"PC","21.0",523342,3,null,20160701,20160930,33699.75]
[null,"GUANAJUATO","11DPT0011X",120,"RAGE851021JI8","RAGE851021MGTYML08","ELVIA SUSANA RAYA GOMEZ",3,"25.0",1130,3102,2,49,"PA","25.0",249101,3,null,20160701,20160930,11353.75,0]
[null,"GUANAJUATO","11DPT0001Q",100,"RAGM860115N6A","RAGM860115HGTMRR00","MAURO RAMIREZ GARCIA",3,"20.0",1130,3102,0,28,"PA","20.0",280063,3,null,20160701,20160930,31185.699999999997,0]
[null,"GUANAJUATO","11DPT0001Q",100,"RALG600418P69","RALG600418MGTMPD09","MARIA GUADALUPE RAMOS LOPEZ",3,"20.0",1130,3102,0,28,"PC","20.0",280068,3,null,20160701,20160930,124474,0]
[null,"GUANAJUATO","11DPT0006L",120,"RAMO6702175A0","RAMO670217MMNNJL07","OLGA OFELIA RANGEL MEJIA",3,"18.0",1130,3102,10,63,"PA","18.0",163098,3,null,20160701,20160930,6265.8,0]
[null,"GUANAJUATO","11DPT0012W",100,"RANS8002268Z7","RASN800226HGTNRS07","NESTOR  RANGEL  SUAREZ ",3,"31.0",1130,3102,4,2,"TA","31.0",27035,3,null,20160701,20160930,27336.61,0]
[null,"GUANAJUATO","11DPT0003O",120,"RAPA580921FZ2","RAPA580921HGTMDR04","AURELIO RAMIREZ PADRON",3,"20.0",1130,3102,0,30,"PB","20.0",28,3,null,20160701,20160930,18487.2,0]
[null,"GUANAJUATO","11DPT0010Y",100,"RARM6206207M6","RARM620620HGTMDN03","MANUEL RAMÍREZ RODRÍGUEZ",3,"10.0",1130,3102,2,4,"PA","10.0",204057,3,null,20160701,20160930,12708.849999999999,0]
[null,"GUANAJUATO","11DPT0009I",100,"RARM770914S13","RARM770914HGTNYR07","MAURICIO RANGEL REYES",3,"19.0",1130,3102,1,74,"PA","19.0",740029,3,null,20160701,20160930,45579.100000000013]
[null,"GUANAJUATO","11DPT0010Y",120,"RASA6006139AA","RASA600613HGTMLN04","ANTONIO RAMÍREZ SOLÍS",3,"16.0",1130,3102,2,4,"PA","16.0",204058,3,null,20160701,20160930,38987.199999999997,0]
[null,"GUANAJUATO","11DPT0007K",120,"RAVM831112KP8","RAVM831112MGTMLN01","MONICA DE LA LUZ RAMIREZ VILLANUEVA",3,"30.0",1130,3102,2,3,"PC","30.0",203195,3,null,20160701,20160930,6878.25]
[null,"GUANAJUATO","11DPT0013V",120,"REDA870319HH9","REDA870319HGTGVR03","ARTURO REGALADO DAVILA",3,"16.0",1130,3102,3,2,"PA","16.0",302094,3,null,20160701,20160930,2741.6]
[null,"GUANAJUATO","11DPT0012W",120,"RERE660715NDA","RERE660715HGTYMN06","ENRIQUE REYES ROMERO",3,"21.0",1130,3102,4,2,"PC","21.0",27036,3,null,20160701,20160930,95940.46]
[null,"GUANAJUATO","11DPT0007K",120,"RICE740107C14","RICE740107MGTVSR06","ERIKA ADRIANA RIVERA CISNEROS   ",3,"24.0",1130,3102,2,3,"PB","24.0",203072,3,null,20160701,20160930,221119.33999999988]
[null,"GUANAJUATO","11DPT0007K",120,"RICM7009187Q5","RICM700918HGTVSG07","MIGUEL ANGEL RIVERA CISNEROS",3,"18.0",1130,3102,2,3,"PC","18.0",203215,3,null,20160701,20160930,4126.95]
[null,"GUANAJUATO","11DPT0014U",100,"RIMF850611721","RIMF850611MGTNJB09","FABIOLA RINCON  MOJICA",3,"23.0",1130,3102,3,3,"PB","23.0",30313,3,null,20160701,20160930,10388.73]
[null,"GUANAJUATO","11DPT0009I",100,"RIRG760502K16","RIRG760502MGTVDW04","GWENDOLYNE ERENDIRA RIVAS RODRIGUEZ",3,"10.0",1130,3102,1,74,"PB","10.0",740030,3,null,20160701,20160930,19860.600000000002]
[null,"GUANAJUATO","11DPT0011X",100,"RISA740722842","RISA740722MGTCNL08","ALEJANDRA  RICALDE  SANCHEZ ",3,"20.0",1130,3102,2,49,"PB","20.0",249045,3,null,20160701,20160930,68411.489999999991,0]
[null,"GUANAJUATO","11DPT0013V",120,"ROAA890923NX1","ROAA890923MGTMLR00","ARACELI ROMERO ALDERETE",3,"10.0",1130,3102,3,2,"PB","10.0",302115,3,null,20160701,20160930,7090.8899999999994]
[null,"GUANAJUATO","11DPT0009I",100,"ROCC7912019U3","ROCC791201HGTDHS03","CESAR ADRIAN RODRIGUEZ CHAVEZ",3,"18.0",1130,3102,1,74,"PA","18.0",740032,3,null,20160701,20160930,43862.91]
[null,"GUANAJUATO","11DPT0012W",100,"ROEL820326QF8","ROEL820326MGTCSZ05","MARIA DE LA LUZ ROCHA  ESCOBAR ",3,"35.0",1130,3102,4,2,"PB","35.0",270040,3,null,20160701,20160930,95850.16,0]
[null,"GUANAJUATO","11DPT0007K",120,"ROHO780227K98","ROXH780227MGTCXN02","HONORINA PAOLA * ROCHA",3,"18.0",1130,3102,2,3,"PC","18.0",203126,3,null,20160701,20160930,7683.35]
[null,"GUANAJUATO","11DPT0008J",120,"ROJL7510077S9","ROJL751007MGTJMR17","LAURA MARICELA ROJAS JIMENEZ",3,"24.0",1130,3102,2,33,"PC","24.0",523347,3,null,20160701,20160930,37342.199999999997]
[null,"GUANAJUATO","11DPT0005M",120,"ROLM821117536","ROLM821117HGTDPN05","MANUEL CHRISTIAN JARED RODRIGUEZ  LOPEZ",3,"12.0",1130,3102,0,72,"PB","12.0",1130,3,null,20160701,20160930,74201.940000000031,0]
[null,"GUANAJUATO","11DPT0010Y",100,"ROMR620310CS2","ROMR620310MDFMNC01","ROCÍO ROMERO MENA",3,"20.0",1130,3102,2,4,"PC","20.0",204065,3,null,20160701,20160930,62195,0]
[null,"GUANAJUATO","11DPT0008J",120,"RONE740321QJ6","RONE740321MGTJTS01","MARIA ESTHER ROJAS NIETO",3,"20.0",1130,3102,2,33,"PC","20.0",523348,3,null,20160701,20160930,31118.5]
[null,"GUANAJUATO","11DPT0008J",120,"ROQJ571205C63","ROQJ571205HGTBNV03","JAVIER ROBLES QUINTANILLA",3,"20.0",1130,3102,2,33,"TA","20.0",523344,3,null,20160701,20160930,49304.709999999992]
[null,"GUANAJUATO","11DPT0012W",120,"RORE431022TB0","RORE431022HGTDMD08","EDILBERTO RODRIGUEZ ROMERO",3,"20.0",1130,3102,4,2,"PC","20.0",270130,3,null,20160701,20160930,13336.5]
[null,"GUANAJUATO","11DPT0012W",120,"RORJ620506HP8","RORJ620506HTLDMN05","JUAN RODRIGUEZ ROMERO",3,"16.0",1130,3102,4,2,"PB","16.0",27043,3,null,20160701,20160930,24649.600000000002]
[null,"GUANAJUATO","11DPT0001Q",120,"RORL820606UU0","RORL820606HGTDBS06","LUIS FERNANDO RODRIGUEZ ROBLES",3,"20.0",1130,3102,0,28,"PC","20.0",280149,3,null,20160701,20160930,4445.5,0]
[null,"GUANAJUATO","11DPT0007K",120,"RORL860709G29","RORL860709MGTDML06","LILIA BERENICE RODRIGUEZ RAMIREZ",3,"19.0",1130,3102,2,3,"PA","19.0",203191,3,null,20160701,20160930,3255.65]
[null,"GUANAJUATO","11DPT0003O",120,"RORM440730KM9","RORM440730HGTDYR01","MARGARITO RODRIGUEZ REYES",3,"28.0",1130,3102,0,30,"PB","28.0",28,3,null,20160701,20160930,48102.48,0]
[null,"GUANAJUATO","11DPT0006L",100,"RORM6503108B9","RORM650310MGTSDL03","MILAGROS ROSAS RODRIGUEZ",3,"20.0",1130,3102,10,63,"PA","20.0",163040,3,null,20160701,20160930,28280,0]
[null,"GUANAJUATO","11DPT0009I",100,"ROVA6201238U9","ROVA620123HGTDGL01","ALFONSO RODRIGUEZ VEGA",3,"25.0",1130,3102,1,74,"PA","25.0",740033,3,null,20160701,20160930,79476.25]
[null,"GUANAJUATO","11DPT0007K",120,"ROZA8409121VA","ROZA840912MGTDXL02","ALMA ROSARIO RODRIGUEZ ZUÑIGA",3,"13.0",1130,3102,2,3,"PC","13.0",203202,3,null,20160701,20160930,2926.58]
[null,"GUANAJUATO","11DPT0004N",120,"ROZS831101KUA","ROZS831101MMNSVN07","SANDRA ROSAS ZAVALA",3,"18.0",1710,3102,1,28,"PB","18.0",128081,3,null,20160701,20160930,3656.63,0]
[null,"GUANAJUATO","11DPT0007K",120,"RUBS800124TR0","RUBS800124HGTZRL06","SAUL RUIZ BERBENA",3,"20.0",1130,3102,2,3,"PC","20.0",203189,3,null,20160701,20160930,17061.559999999998]
[null,"GUANAJUATO","11DPT0004N",100,"RUDJ780213NV6","RUDJ780213HGTZZN04","JUAN CARLOS RUIZ DIAZ",3,"17.0",1320,3102,1,28,"PB","17.0",128029,3,null,20160701,20160930,92388.73000000001,0]
[null,"GUANAJUATO","11DPT0005M",120,"RURL700528JKA","RURL700528MGTZDZ03","LUZ MARIA RUIZ RODRIGUEZ",3,"30.0",1130,3102,0,72,"PB","30.0",1130,3,null,20160701,20160930,58927.98,0]
[null,"GUANAJUATO","11DPT0011X",100,"SACF740918BK7","SACF740918HJCNML11","FELIX SANCHEZ CAMPOS",3,"18.0",1130,3102,2,49,"TA","18.0",249049,3,null,20160701,20160930,51990.119999999974,0]
[null,"GUANAJUATO","11DPT0014U",100,"SACG751101985","SACG751101HDFNRR03","GERARDO JAVIER SANCHEZ CARRANZA",3,"30.0",1130,3102,3,3,"TA","30.0",303016,3,null,20160701,20160930,11337.75]
[null,"GUANAJUATO","11DPT0011X",100,"SACM860807000","SACM860807HGTMMN00","JOSE MANUEL SAMANO CAMARGO",3,"26.0",1130,3102,2,49,"PB","26.0",249085,3,null,20160701,20160930,12952.95,0]
[null,"GUANAJUATO","11DPT0004N",100,"SADF620323P95","SADF620323HDGNVD00","FIDEL SANCHEZ DAVILA",3,"12.0",1130,3102,1,28,"PB","12.0",128031,3,null,20160701,20160930,29230.95,0]
[null,"GUANAJUATO","11DPT0003O",120,"SAGJ781103MJ3","SAGJ781103HGTLRR06","JORGE ARMANDO SALAS GUARDADO",3,"20.0",1130,3102,0,30,"PB","20.0",28,3,null,20160701,20160930,20798.099999999999,0]
[null,"GUANAJUATO","11DPT0006L",100,"SAMC7308072M6","SAMC730807MGTNRR25","MA. DEL CARMEN SANCHEZ MORENO",3,"24.0",1130,3102,10,63,"PB","24.0",163045,3,null,20160701,20160930,18487.2,0]
[null,"GUANAJUATO","11DPT0014U",100,"SAMJ8108157T3","SAMJ810815HGTNTR06","JORGE ADRIAN SANCHEZ MATEHUALA",3,"10.0",1130,3102,3,3,"PB","10.0",303031,3,null,20160701,20160930,5342.65]
[null,"GUANAJUATO","11DPT0006L",100,"SAMM791219U15","SAMM791219MGTVDG08","MARIA MAGDALENA SAAVEDRA MEDRANO",3,"10.0",1130,3102,10,63,"PA","10.0",163041,3,null,20160701,20160930,7262.2,0]
[null,"GUANAJUATO","11DPT0005M",120,"SAMR641029MF0","SAMR641029HGTMNB09","ROBERTO SANTOYO MENDOZA",3,"20.0",1130,3102,0,72,"PA","20.0",1130,3,null,20160701,20160930,83544,0]
[null,"GUANAJUATO","11DPT0014U",100,"SAPG841029F61","SAPG841029HGTNRD01","JOSE GUADALUPE SANDOVAL PEREZ",3,"30.0",1130,3102,3,3,"TA","30.0",303027,3,null,20160701,20160930,11359.98]
[null,"GUANAJUATO","11DPT0013V",120,"SAPJ7305052R5","SAPJ730505HGTNRN06","JUAN CARLOS SANCHEZ PEREZ",3,"24.0",1130,3102,3,2,"PB","24.0",302035,3,null,20160701,20160930,4621.8]
[null,"GUANAJUATO","11DPT0009I",100,"SAPR691204HS9","SAPR691204MGTNRS09","ROSA ELIA SANDOVAL PRADO",3,"26.0",1130,3102,1,74,"PB","26.0",740035,3,null,20160701,20160930,70097.299999999988]
[null,"GUANAJUATO","11DPT0006L",100,"SARP720603511","SARP720603HGTNMD03","PEDRO SANCHEZ RAMIREZ",3,"20.0",1130,3102,10,63,"PB","20.0",163046,3,null,20160701,20160930,31784,0]
[null,"GUANAJUATO","11DPT0012W",120,"SATE820405F51","SATE820405MGTNRV00","EVA MARIA DEL ROSARIO SANCHEZ TURRUBIARTES",3,"20.0",1130,3102,4,2,"PA","20.0",27047,3,null,20160701,20160930,49490]
[null,"GUANAJUATO","11DPT0009I",100,"SATJ701026RC3","SATJ701026HGTNFS09","JOSE SANCHEZ TAFOYA",3,"15.0",1130,3102,1,74,"PC","15.0",740034,3,null,20160701,20160930,20004.780000000002]
[null,"GUANAJUATO","11DPT0004N",100,"SAVE451129SN8","SAVE451129HGTLRL03","ELIGIO SALGADO VARGAS",3,"12.0",1130,3102,1,28,"PB","12.0",128030,3,null,20160701,20160930,24302.099999999995,0]
[null,"GUANAJUATO","11DPT0011X",100,"SIPH640527P81","SIPH640527HGTRRG09","HUGO EVERARDO  SIERRA  PARADA ",3,"27.0",1130,3102,2,49,"PC","27.0",249052,3,null,20160701,20160930,73128.510000000009,0]
[null,"GUANAJUATO","11DPT0006L",100,"SOAE851129KH7","SOAE851129MGTTCS09","ESPERANZA SOTO ACEVEDO",3,"10.0",1130,3102,10,63,"PB","10.0",163047,3,null,20160701,20160930,15406,0]
[null,"GUANAJUATO","11DPT0002P",100,"SOAO850607U46","SOAO850607HGGTGM04","OMAR DAVID SOTO AGUIRRE",3,"15.0",1130,3102,0,29,"TA","15.0",290067,3,null,20160701,20160930,12396.9,0]
[null,"GUANAJUATO","11DPT0004N",120,"SOGE770916E73","SOGE770916MDFLNL08","MARIA ELENA SOLIS GONZALEZ",3,"16.0",1130,3102,1,28,"PC","16.0",128054,3,null,20160701,20160930,10224.66,0]
[null,"GUANAJUATO","11DPT0004N",100,"SOGY851206464","SOGY851206MMNSZN01","YANETH SOSA GUZMÁN",3,"15.0",1130,3102,1,28,"PB","15.0",128046,3,null,20160701,20160930,20220.410000000003,0]
[null,"GUANAJUATO","11DPT0007K",120,"SOMJ5508087H2","SOMJ550808MGTTRN02","JUANA SOTO MORAN",3,"21.0",1130,3102,2,3,"PB","21.0",203081,3,null,20160701,20160930,105146.08000000003]
[null,"GUANAJUATO","11DPT0009I",100,"SOSP630208MC6","SOSP630208HGTTCD07","PEDRO SOTO SAUCEDO",3,"10.0",1130,3102,1,74,"PA","10.0",740036,3,null,20160701,20160930,35131.109999999993,0]
[null,"GUANAJUATO","11DPT0010Y",120,"SUCG780821BZ7","SUCG780821HGTRSL03","GUILLERMO SUÁREZ CASTRO",3,"16.0",1130,3102,2,4,"PC","16.0",204068,3,null,20160701,20160930,49756,0]
[null,"GUANAJUATO","11DPT0007K",120,"TAGL820524R17","TAGL820524MGTPMZ06"," MARIA DE LA LUZ TAPIA GOMEZ     ",3,"15.0",1130,3102,2,3,"PC","15.0",203084,3,null,20160701,20160930,75197.72]
[null,"GUANAJUATO","11DPT0009I",100,"TEAC711130CQ2","TEAC711130MGTJDL00","CLAUDIA ELENA TEJEDA ADAME",3,"11.0",1130,3102,1,74,"PC","11.0",740037,3,null,20160701,20160930,17115.210000000003,0]
[null,"GUANAJUATO","11DPT0009I",100,"TEAR801024C6A","TEAR801024MGTJDS18","ROSA BEATRIZ TEJEDA ADAME",3,"15.0",1130,3102,1,74,"PB","15.0",740038,3,null,20160701,20160930,40440.82,0]
[null,"GUANAJUATO","11DPT0007K",120,"TIEA7005021TA","TIEA700502MDFHSN02"," ANGELICA THIRION ESCUDER  ",3,"27.0",1130,3102,2,3,"PC","27.0",203085,3,null,20160701,20160930,143591.24]
[null,"GUANAJUATO","11DPT0004N",100,"TITC671201BBA","TITC671201HMNNNR07","CRESCENCIANO TINOCO TINOCO",3,"17.0",1130,3102,1,28,"PC","17.0",128058,3,null,20160701,20160930,17950,0]
[null,"GUANAJUATO","11DPT0009I",100,"TOAB770225NZ9","TOAB770225MGTRRR00","BERENICE TORRES ARROYO",3,"25.0",1130,3102,1,74,"PA","25.0",740040,3,null,20160701,20160930,30931.25,0]
[null,"GUANAJUATO","11DPT0008J",120,"TOLJ711229Q89","TOLJ711229HGTRPV00","JAVIER TORRES LOPEZ",3,"22.0",1130,3102,2,33,"PC","22.0",523350,3,null,20160701,20160930,31118.5]
[null,"GUANAJUATO","11DPT0005M",120,"TOVJ770823IY6","TOVJ770823HGTRRM05","JUAN MANUEL TORRES  VERA",3,"30.0",1130,3102,0,72,"PA","30.0",1130,3,null,20160701,20160930,73263,0]
[null,"GUANAJUATO","11DPT0007K",120,"UIRA650703JZ5","UIRA650703MDFRML07"," MARIA ALEJANDRA URIBE RAMIREZ  ",3,"20.0",1130,3102,2,3,"PC","20.0",203086,3,null,20160701,20160930,115583]
[null,"GUANAJUATO","11DPT0006L",100,"VAAJ751004U60","VAAJ751004MGTLRN04","JUANA YANET VALDEZ ARGUELLO",3,"5.0",1130,3102,10,63,"PC","5.0",163048,3,null,20160701,20160930,5007.88,0]
[null,"GUANAJUATO","11DPT0005M",120,"VAFI6312015P7","VAFI631201MGTRLR02","IRMA VARGAS  FLORES",3,"20.0",1130,3102,0,72,"PC","20.0",1130,3,null,20160701,20160930,46677.78,0]
[null,"GUANAJUATO","11DPT0004N",120,"VAGC680720SK4","VAGC680720MDFZTL03","CLAUDIA IVONNE VAZQUEZ GUTIERREZ",3,"18.0",1710,3102,1,28,"PA","18.0",128088,3,null,20160701,20160930,3656.63,0]
[null,"GUANAJUATO","11DPT0008J",120,"VALS820325LX7","VALS820325MGTLNL09","SILVIA NANCY VALADEZ LEON",3,"27.0",1130,3102,2,33,"PC","27.0",523355,3,null,20160701,20160930,114705.57]
[null,"GUANAJUATO","11DPT0012W",100,"VAMG850109N64","VAMG850109MBSZNB01","GABRIELA VAZQUEZ MONJARAZ",3,"27.0",1130,3102,4,2,"PB","27.0",270052,3,null,20160701,20160930,36396.71,0]
[null,"GUANAJUATO","11DPT0006L",100,"VAMM770825UBA","VAMM770825HGTLLG05","JOSE MIGUEL VALDEZ MALDONADO",3,"20.0",1130,3102,10,63,"PA","20.0",163050,3,null,20160701,20160930,55696,0]
[null,"GUANAJUATO","11DPT0009I",100,"VASD820426CR9","VASD820426HGTRTV05","DAVID VARGAS SOTO",3,"20.0",1130,3102,1,74,"PB","20.0",740041,3,null,20160701,20160930,27811,0]
[null,"GUANAJUATO","11DPT0003O",120,"VASR930322QX5","VASR930322HGTLGL04","RAUL VALDIVIA SEGOVIANO",3,"10.0",1130,3102,0,30,"TA","10.0",28,3,null,20160701,20160930,1390.84,0]
[null,"GUANAJUATO","11DPT0005M",120,"VASY830412F80","VASY830412MMMLNN08","YUNNUEN VALENZUELA SANCHEZ",3,"6.0",1130,3102,0,72,"PB","6.0",1130,3,null,20160701,20160930,8002.1400000000012,0]
[null,"GUANAJUATO","11DPT0003O",120,"VAWS480907T05","VAWS480907MDFRSY01","SILVIA VARGAS WASHINGTON",3,"18.0",1130,3102,0,30,"TA","18.0",28,3,null,20160701,20160930,13798.02,0]
[null,"GUANAJUATO","11DPT0014U",120,"VEFF790430A24","VEFF790430MGTNLT05","FATIMA NOHEMI VENEGAS FLORES",3,"22.0",1130,3102,3,3,"PB","22.0",30339,3,null,20160701,20160930,15582.18]
[null,"GUANAJUATO","11DPT0003O",120,"VEMJ891002000","VEMJ891002HGTLÑN02","JUAN MANUEL VELAZQUEZ MUÑOZ",3,"21.0",1130,3102,0,30,"TA","21.0",28,3,null,20160701,20160930,2519.5,0]
[null,"GUANAJUATO","11DPT0003O",120,"VESE620331G87","VESE620331HGTRLF03","EFREN VERA SALGADO",3,"13.0",1130,3102,0,30,"PB","13.0",28,3,null,20160701,20160930,19569.440000000002,0]
[null,"GUANAJUATO","11DPT0006L",100,"VESJ58011884A","VESJ580118HGTGNN01","JUAN CARLOS VEGA SANCHEZ",3,"20.0",1130,3102,10,63,"PA","20.0",163055,3,null,20160701,20160930,28280,0]
[null,"GUANAJUATO","11DPT0010Y",100,"VESX850703GKA","VESX850703MGTLLC16","XOCHITL TOMASA VELÁZQUEZ SILVA",3,"24.0",1130,3102,2,4,"PA","24.0",204071,3,null,20160701,20160930,28786.800000000003,0]
[null,"GUANAJUATO","11DPT0013V",120,"VEVS430308H18","VEVS430308MGTRLL04","MA SOLEDAD VERA VALTIERRA",3,"23.0",1130,3102,3,2,"PC","23.0",302038,3,null,20160701,20160930,5112.33]
[null,"GUANAJUATO","11DPT0013V",120,"VIBM750212ED8","VIBM750212MDFLRN06","MONICA VILCHIS BARCENAS",3,"24.0",1130,3102,3,2,"PB","24.0",302039,3,null,20160701,20160930,4814.38]
[null,"GUANAJUATO","11DPT0007K",120,"VIBM7702283A2","VIBM770228HDFLRR01","MAURICIO VILCHIS BARCENAS ",3,"17.0",1130,3102,2,3,"PC","17.0",203093,3,null,20160701,20160930,186480.05999999982]
[null,"GUANAJUATO","11DPT0004N",120,"VIMC900724PHA","VIMC900724MGTLNR08","MARIA CRISTINA VILLAGOMEZ MONTES",3,"8.0",1710,3102,1,28,"PA","8.0",128068,3,null,20160701,20160930,2742.47,0]
[null,"GUANAJUATO","11DPT0010Y",120,"VIMU840526EL5","VIMU840526HDFLRR00","URIEL ALEJANDRO VILLÁGOMEZ MARTÍNEZ",3,"30.0",1130,3102,2,4,"PB","30.0",204072,3,null,20160701,20160930,40440.75,0]
[null,"GUANAJUATO","11DPT0004N",100,"VIRD850905EA2","VIRD850905MGTLDY04","DEYSI VILLANUEVA RODRIGUEZ",3,"15.0",1130,3102,1,28,"PB","15.0",128035,3,null,20160701,20160930,54456.360000000008,0]
[null,"GUANAJUATO","11DPT0005M",120,"VITF791111L77","VITF791111HGTLVR01","FRANCISCO VILLAFAÑA  TAVERA",3,"25.0",1130,3102,0,72,"PB","25.0",1130,3,null,20160701,20160930,24682.230000000003,0]
[null,"GUANAJUATO","11DPT0005M",120,"VIZM6610296H8","VIZM661029MMNLRN03","MONICA VILLAGOMEZ  ZARATE",3,"24.0",1130,3102,0,72,"PB","24.0",1130,3,null,20160701,20160930,28605.599999999999,0]
[null,"GUANAJUATO","11DPT0012W",120,"ZABA871015J40","ZABA871015HGTRCM04","AMANDO ZARAZUA BECERRA",3,"15.0",1130,3102,4,2,"TA","15.0",270015,3,null,20160701,20160930,1972.44]
[null,"GUANAJUATO","11DPT0006L",100,"ZAGG741211FF0","ZAGG741211MMNCND04","MARIA GUADALUPE ZACARIAS GONZALEZ",3,"19.0",1130,3102,10,63,"PB","19.0",163056,3,null,20160701,20160930,29733.119999999995,0]
[null,"GUANAJUATO","11DPT0004N",100,"ZAHR840210PN9","ZAHR840210HGTVRD05","RODOLFO ANTONIO ZAVALA HERNANDEZ",3,"10.0",1710,3102,1,28,"PB","10.0",128039,3,null,20160701,20160930,44487.940000000017,0]
[null,"GUANAJUATO","11DPT0002P",100,"ZAMD580804XH2","ZAMD580804HGTRRV01","DAVID ZARAGOZA MARTINEZ",3,"20.0",1130,3102,0,29,"PB","20.0",290071,3,null,20160701,20160930,23838,0]
[null,"GUANAJUATO","11DPT0011X",100,"ZAMJ740416EMO","ZAMJ740416HDFMXR00","JORGE ZAMORA MUÑIZ",3,"18.0",1130,3102,2,49,"PB","18.0",249056,3,null,20160701,20160930,45832.849999999991,0]
[null,"GUANAJUATO","11DPT0004N",100,"ZAPJ830703848","ZAPJ830703HGTMRN07","JUAN MARCIAL ZAMUDIO PEREZ",3,"10.0",1130,3102,1,28,"PB","10.0",128037,3,null,20160701,20160930,42083.37000000001,0]
[null,"GUANAJUATO","11DPT0007K",120,"ZARG760122LM0","ZARG760122MGTRDR05","  GRACIELA ZARAGOZA RODRIGUEZ ",3,"32.0",1130,3102,2,3,"PC","32.0",203096,3,null,20160701,20160930,95368]
[null,"GUANAJUATO","11DPT0012W",100,"ZARI821025R29","ZARI821025MGTRBG09","MARIA IGNACIA ZARAZUA  RUBIO ",3,"15.0",1130,3102,4,2,"PB","15.0",27054,3,null,20160701,20160930,40440.82,0]
[null,"GUANAJUATO","11DPT0006L",100,"ZASJ710817C96","ZASJ710817MGTVLL06","JULIA XIOMARA ZAVALA SALAS",3,"12.0",1130,3102,10,63,"PC","12.0",163058,3,null,20160701,20160930,21338.399999999998,0]
[null,"GUANAJUATO","11DPT0004N",100,"ZAVN851206BB5","ZAVN851206MGTMLR06","NORMA ANGELICA ZAMUDIO VILLALOBOS",3,"12.0",1130,3102,1,28,"PA","12.0",128038,3,null,20160701,20160930,14870.239999999998,0]
[null,"GUANAJUATO","11DPT0004N",120,"ZAZA820724CP3","ZAZA820724MGTVML06","ALMA CRISTINA ZAVALA ZAMUDIO",3,"8.0",1710,3102,1,28,"PB","8.0",128072,3,null,20160701,20160930,1828.31,0]
[null,"Total Personas : ",null,919,null,null,null,null,null,null,null,null,null,"Total Plazas : ",null,919,null,null,"Total Pto. Federal",null,{"$f":"SUBTOTAL(109,Tabla12[Percepciones pagadas en el Periodo de Comisión con Presupuesto Federal*])","v":44568149.409999974}]
[]
[null,null,null,null,null,null,null,null,null,null,null,null,null,null,null,null,null,null,"Total Ppto. Otras Fuentes:",null,null,{"$f":"SUM(V16:V936)","v":0}]
[]
[null,"*Total de Percepciones reportadas por la Entidad Federativa como pagadas al trabajador durante la comisión."]
[null,"Fuente : Información proporcionada por las Entidades Federativas"]

{"sheet":"II D) 2","index":6,"n_rows":25,"n_cols":19,"rows_kept":25,"cut":false,"hidden":false,"merged":[[8,1,8,9],[11,0,12,0],[11,1,12,1],[11,5,12,5],[11,2,12,2],[11,3,12,3],[11,4,12,4],[11,16,12,16],[11,15,12,15],[11,17,12,17],[11,18,12,18],[11,6,11,12],[11,13,12,13],[11,14,12,14]]}
[]
[]
[]
[]
[]
[]
[]
[null,"Formato: Movimientos de Plazas"]
[null,{"$f":"IF('Caratula Resumen'!D22=\"Elige el Periodo…\",\"\",'Caratula Resumen'!D22)","v":"Fondo de Aportaciones para la Educación Tecnológica y de Adultos/Colegio Nacional de Educación Profesional Técnica (FAETA/CONALEP)"}]
[null,null,null,null,null,null,null,null,null,null,null,null,null,null,null,null,null,"3er. Trimestre 2016"]
[]
[null,"Entidad Federativa","RFC","CURP","Nombre","Origen Presupuestal\n de la plazas","Clave Presupuestal",null,null,null,null,null,null,"Clave de nivel de puesto","Clave de nivel de sueldo","Zona Económica","Tipo de movimiento","Quincena Inicial","Quincena Final"]
[null,null,null,null,null,null,"Partida Presupuestal","Código de Pago","Clave de Unidad","Clave de Sub Unidad","Clave de Categoría","Horas Semana Mes ","Número de Plaza"]
[]
[null,"Entidad Federativa","RFC","CURP","Nombbre","Origen Presupuestal\n de la plazas","Partida Presupuestal","Código de Pago","Clave de Unidad","Clave de Sub Unidad","Clave de Categoría","Horas semana mes","Número de plaza","Clave de nivel de puesto","Clave de nivel de sueldo","Zona Económica","Tipo de movimiento","Quincena Inicial","Quincena Final"]
[]
[]
[]
[]
[]
[null,"Total Personas : ",null,null,null,null,null,null,null,null,"Total Plazas : "]
[]
[]
[]
[null,"Fuente : Información proporcionada por las Entidades Federativas"]

{"sheet":"II D) 4","index":7,"n_rows":23,"n_cols":17,"rows_kept":23,"cut":false,"hidden":false,"merged":[[19,13,19,14],[12,0,13,0],[12,6,13,6],[12,7,12,13],[12,14,12,15],[12,2,13,2],[12,1,13,1],[12,16,13,16],[12,5,13,5],[12,4,13,4],[12,3,13,3],[9,1,9,9]]}
[]
[]
[]
[]
[]
[]
[]
[]
[null,"Formato: Trabajadores Jubilados en el Periodo"]
[null,{"$f":"IF('Caratula Resumen'!D22=\"Elige el Periodo…\",\"\",'Caratula Resumen'!D22)","v":"Fondo de Aportaciones para la Educación Tecnológica y de Adultos/Colegio Nacional de Educación Profesional Técnica (FAETA/CONALEP)"}]
[null,null,null,null,null,null,null,null,null,null,null,null,null,null,null,"3er. Trimestre 2016"]
[]
[null,"Entidad Federativa","R.F.C.","CURP","NOMBRE","Clave CT","Última(s) ó Penultima(s) Plaza(s) Ocupada(s)\n(*)","Clave Presupuestal de la Jubilación",null,null,null,null,null,null,"Periodo ocupado",null,"Quincena de inicio de jubilación"]
[null,null,null,null,null,null,null,"Partida Presupuestal","Código de Pago","Clave de Unidad","Clave de Sub Unidad","Clave de Categoría","Horas Semana Mes ","Número de Plaza","Inicio","Conclusión"]
[]
[null,"Entidad Federativa","R.F.C.","CURP","NOMBRE","Clave Centro de Trabajo","Última(s) ó Penultima(s) Plaza(s) Ocupada(s)\n(*)","Partida Presupuestal","Código de Pago","Clave de Unidad","Clave de Sub Unidad","Clave de Categoría","Horas Semana Mes ","Número de Plaza","Periodo ocupado\nInicio","Periodo ocupado\nConclusión","Quincena de inicio de jubilación"]
[null,"GUANAJUATO","EIMJ620524ID9","EIMJ620524HGTLRS02","JOSE ELIAS MORENO","11DPT0009I",1,1130,3102,"02","33","CF33206","00.0",14311,198610,201616,201616]
[null,"Total Personas : ",1,null,null,null,null,null,null,null,null,"Total Plazas : ",null,1]
[]
[]
[]
[null,"Fuente : Información proporcionada por las Entidades Federativas"]
[null,"(*) Si  el trabajador se jubila con más de una clave presupuestal, por cada plaza se debe llenar un registro hasta que se haya informado acerca de todas las plazas del trabajador."]

{"sheet":"II D) 4 A","index":8,"n_rows":26,"n_cols":18,"rows_kept":26,"cut":false,"hidden":false,"merged":[[20,13,20,14],[9,1,9,7],[22,13,22,14],[12,17,13,17],[12,1,13,1],[12,2,13,2],[12,3,13,3],[12,4,13,4],[12,5,13,5],[12,6,12,12],[12,13,12,14],[12,15,13,15],[12,16,13,16]]}
[]
[]
[]
[]
[]
[]
[]
[]
[null,"Formato: Trabajadores que Tramitaron Licencia Prejubilatoria en el Periodo"]
[null,{"$f":"IF('Caratula Resumen'!D22=\"Elige el Periodo…\",\"\",'Caratula Resumen'!D22)","v":"Fondo de Aportaciones para la Educación Tecnológica y de Adultos/Colegio Nacional de Educación Profesional Técnica (FAETA/CONALEP)"}]
[null,null,null,null,null,null,null,null,null,null,null,null,null,null,null,null,null,"3er. Trimestre 2016"]
[]
[null,"Entidad Federativa","R.F.C.","CURP","NOMBRE","Clave integrada","Clave Presupuestal",null,null,null,null,null,null,"Periodo Licencia",null,"Percepciones pagadas con Presupuesto Federal en el  Periodo reportado*","Percepciones pagadas con Presupuesto de otra Fuente en el  Periodo reportado*","Clave CT Origen"]
[null,null,null,null,null,null,"Partida Presupuestal","Código de Pago","Clave de Unidad","Clave de Sub Unidad","Clave de Categoría","Horas Semana Mes ","Número de Plaza","Inicio","Conclusión"]
[]
[null,"Entidad Federativa","R.F.C.","CURP","NOMBRE","Clave integrada","Partida Presupuestal","Código de Pago","Clave de Unidad","Clave de Sub Unidad","Clave de Categoría","Horas Semana Mes ","Número de Plaza","Periodo Licencia\nInicio","Periodo Licencia\nConclusión","Percepciones pagadas con Presupuesto Federal en el  Periodo reportado*","Percepciones pagadas con Presupuesto de otra Fuente en el  Periodo reportado*","Clave CT Origen"]
[]
[]
[]
[]
[null,"Total Personas : ",4,null,null,null,null,null,null,null,"Total Plazas : ",null,4,"Total Pto. Federal",null,{"$f":"SUBTOTAL(109,Tabla5[Percepciones pagadas con Presupuesto Federal en el  Periodo reportado*])","v":0}]
[]
[null,null,null,null,null,null,null,null,null,null,null,null,null,"Total Ppto. Otras Fuentes",null,null,{"$f":"SUM(Q17:Q22)","v":0}]
[]
[null,"*Total de Percepciones reportadas por la Entidad Federativa como pagadas en el periodo "]
[null,"Fuente : Información proporcionada por las Entidades Federativas"]

{"sheet":"II D) 6","index":9,"n_rows":28,"n_cols":13,"rows_kept":28,"cut":false,"hidden":false,"merged":[[10,1,10,6],[13,12,14,12],[13,9,13,10],[13,11,14,11],[13,1,14,1],[13,2,14,2],[13,3,14,3],[13,4,14,4],[13,5,14,5],[13,6,14,6],[13,7,13,8]]}
[]
[]
[]
[]
[]
[]
[]
[]
[]
[null,"Formato: Trabajadores Contratados por Honorarios en el Periodo"]
[null,{"$f":"IF('Caratula Resumen'!D22=\"Elige el Periodo…\",\"\",'Caratula Resumen'!D22)","v":"Fondo de Aportaciones para la Educación Tecnológica y de Adultos/Colegio Nacional de Educación Profesional Técnica (FAETA/CONALEP)"}]
[null,null,null,null,null,null,null,null,null,null,null,null,"3er. Trimestre 2016"]
[]
[null,"Entidad Federativa","Clave Centro de Trabajo","R.F.C.","CURP","Nombre","Identificador del Contrato","Equivalencia",null,"Periodo de Contratación",null,"Función","Percepciones pagadas dentro del periodo reportado"]
[null,null,null,null,null,null,null,"Clave de Categoría","Horas Semana Mes ","Inicio","Conclusión"]
[]
[null,"Entidad Federativa","Clave Centro de Trabajo","R.F.C.","CURP","Nombre","Identificador del Contrato","Clave de Categoría","Horas Semana Mes ","Periodo de Contratación\nInicio","Periodo de Contratación\nConclusión","Función","Percepciones pagadas dentro del periodo reportado"]
[]
[]
[]
[]
[]
[null,"Total Entidad Federativa Personas : ",null,null,null,null,null,null,null,null,null,"Subtotal Monto Pagado en el Periodo:"]
[]
[]
[null,null,null,null,null,null,null,null,null,"Total   Percepciones :"]
[]
[null,"Fuente : Información proporcionada por las Entidades Federativas"]

{"sheet":"II D) 7 1","index":10,"n_rows":50,"n_cols":19,"rows_kept":50,"cut":false,"hidden":false,"merged":[[46,16,46,17],[12,18,13,18],[12,13,13,13],[12,14,13,14],[12,15,13,15],[12,16,13,16],[8,17,8,18],[9,1,9,9],[12,6,13,6],[12,7,12,9],[12,10,13,10],[12,11,13,11],[12,12,13,12],[12,1,13,1],[12,2,13,2],[12,3,13,3],[12,4,13,4],[12,5,13,5],[12,17,13,17]]}
[]
[]
[]
[]
[]
[]
[]
[]
[null,"Formato: Analítico de Categorías / Plazas Autorizadas con su Tabulador",null,null,null,null,null,null,null,null,null,null,null,null,null,null,"Entidad Federativa:",{"$f":"IF('Caratula Resumen'!D21=\"Elige el Periodo…\",\"\",'Caratula Resumen'!D21)","v":" GUANAJUATO "}]
[null,{"$f":"IF('Caratula Resumen'!D22=\"Elige el Periodo…\",\"\",'Caratula Resumen'!D22)","v":"Fondo de Aportaciones para la Educación Tecnológica y de Adultos/Colegio Nacional de Educación Profesional Técnica (FAETA/CONALEP)"}]
[null,null,null,null,null,null,null,null,null,null,null,null,null,null,null,null,null,null,"3er. Trimestre 2016"]
[]
[null,"Clave Tipo educativo","Clave Nivel educativo","Clave Subnivel educativo","Descripción Nivel / Subnivel","Tipo Financiamiento","Partida Presupuestal","CATEGORIA",null,null,"Zona Económica","Nivel Puesto","Nivel Sueldo","Tipo Contratación","Monto mensual\npor plaza jornada","Monto mensual\nPor Plaza HSM","Número de Plazas Jornada","Número de Plazas HSM","Monto total autorizado"]
[null,null,null,null,null,null,null,"Tipo de Categoría"," Categoría","Descripción"]
[]
[null,"Clave Tipo educativo","Clave Nivel educativo","Clave Subnivel educativo","Descripción Nivel / Subnivel","Tipo Financiamiento","Partida Presupestal","Tipo de Categoría"," Categoría","Descripción","Zona Económica","Nivel Puesto","Nivel Sueldo","Tipo Contratación","Monto mensual\npor plaza jornada","Monto mensual\nPor Plaza HSM","Número de Plazas Jornada","Número de Plazas HSM","Monto total autorizado"]
[null,3,32,31,"LICENCIATURA UNIVERSITARIA",1,1130,3,"000000PC","PROFESIONISTA INSTRUCTOR TIPO \"C\"","C","000000D1",1,"H",0,458.55,0,2073.5,950803.43]
[null,3,32,31,"LICENCIATURA UNIVERSITARIA",1,1130,3,"000000PB","PROFESIONISTA INSTRUCTOR TIPO \"B\"","C","000000D2",2,"H",0,397.3,0,2700,1072710]
[null,3,32,31,"LICENCIATURA UNIVERSITARIA",1,1130,3,"000000PA","PROFESIONISTA INSTRUCTOR TIPO \"A\"","C","000000D3",3,"H",0,353.5,0,3197.5,1130316.25]
[null,2,21,20,"PROFESIONAL TÉCNICO",1,1130,3,"000000TA","TÉCNICO INSTRUCTOR \"A\"","C","000000D4",4,"H",0,259.89999999999998,0,2304,598809.59999999998]
[null,1,12,4,"PRIMARIA GENERAL",1,1540,2,"00S01201","ASISTENTE DE SERV. BASICOS","C",2,2,"P",6778.6,0,68,0,460944.8]
[null,1,12,4,"PRIMARIA GENERAL",1,1540,2,"0CF18201","AUXILIAR DE SEGURIDAD","C",2,2,"P",6220.4,0,15,0,90456.75]
[null,1,12,4,"PRIMARIA GENERAL",1,1540,2,"0CF18202","OPERADOR DE SERVICIOS BÁSICOS","C",2,2,"P",6220.4,0,1,0,6030.45]
[null,1,13,7,"SECUNDARIA GENERAL",1,1540,2,"00S01202","AUXILIAR DE SERV. GENERALES","C",4,4,"P",6778.6,0,54,0,354866.4]
[null,1,13,7,"SECUNDARIA GENERAL",1,1540,2,"0CF34202","PROMOTOR CULTURAL Y DEP.","C",5,5,"P",7059.85,0,9,0,61598.25]
[null,1,13,7,"SECUNDARIA GENERAL",1,1540,2,"00A03202","SECRETARIA \"C\"","C",5,5,"P",7059.85,0,32,0,219016]
[null,2,22,22,"BACHILLERATO GENERAL",1,1540,2,"0CF34201","TECNICO BIBLIOTECARIO","C",6,6,"P",7343.6,0,12,0,82131]
[null,2,22,22,"BACHILLERATO GENERAL",1,1540,2,"0ED01201","TECNICO EN MAT. DIDÁCTICOS","C",6,6,"P",7343.6,0,11,0,78312.850000000006]
[null,2,22,22,"BACHILLERATO GENERAL",1,1540,2,"0CF19201","TUTOR ESCOLAR","C",6,6,"P",7343.6,0,15,0,106790.25]
[null,2,22,22,"BACHILLERATO GENERAL",1,1540,2,"0CF21202","ASISTENTE ESCOLAR Y S.","C",7,7,"P",7630.45,0,14,0,103564.3]
[null,2,22,22,"BACHILLERATO GENERAL",1,1540,2,"0CF04201","SECRETARIA \"B\"","C",7,7,"P",7630.45,0,14,0,103564.3]
[null,2,22,22,"BACHILLERATO GENERAL",1,1540,2,"00T08201","TECNICO EN GRAFICACIÓN","C",8,8,"P",7918.45,0,5,0,38383.25]
[null,2,22,22,"BACHILLERATO GENERAL",1,1540,2,"0CF33202","TECNICO EN CONTABILIDAD","C",9,9,"P",8210.9500000000007,0,7,0,55721.4]
[null,2,22,22,"BACHILLERATO GENERAL",1,1540,2,"0CF33203","TECNICO FINANCIERO","C",9,9,"P",8210.9500000000007,0,9,0,71641.8]
[null,2,22,22,"BACHILLERATO GENERAL",1,1540,2,"0CF18203","SUPERVISOR DE MTTO","C",9,9,"P",8210.9500000000007,0,19,0,151243.79999999999]
[null,2,22,22,"BACHILLERATO GENERAL",1,1540,2,"00A01801","ADMINISTRATIVO TEC. ESP.","C",11,11,"P",8804.25,0,10,0,85354]
[null,2,22,22,"BACHILLERATO GENERAL",1,1540,2,"0CF33204","SUBJEFE TECNICO ESP.","C",13,13,"P",14521.7,0,60,0,844695]
[null,3,32,31,"LICENCIATURA UNIVERSITARIA",1,1540,2,"0CF33206","JEFE DE PROYECTO","C",15,15,"P",22390.75,0,80,0,1736560]
[null,3,32,31,"LICENCIATURA UNIVERSITARIA",1,1540,5,"0CF02105","COORDINADOR EJECUTIVO","C",21,21,"P",25707.4,0,10,0,257073.9]
[null,3,32,31,"LICENCIATURA UNIVERSITARIA",1,1540,5,"0CF01601","JEFE DE UNIDAD","C",22,22,"P",29719.360000000001,0,7,0,208035.52000000002]
[null,3,32,31,"LICENCIATURA UNIVERSITARIA",1,1540,5,"0CF11102","DIRECTOR DE CENTRO","C",24,24,"P",37686.910000000003,0,3,0,113060.73000000001]
[null,3,32,31,"LICENCIATURA UNIVERSITARIA",1,1540,5,"0CF02100","SUBCOORDINADOR","C",25,25,"P",37378.76,0,1,0,37378.76]
[null,3,32,31,"LICENCIATURA UNIVERSITARIA",1,1540,5,"0CF02104","DIRECTOR DE PLANTEL \"D\" Y \"E\"","C",26,26,"P",29695.829999999998,0,5,0,148479.15000000002]
[null,3,32,31,"LICENCIATURA UNIVERSITARIA",1,1540,5,"0CF02103","DIRECTOR DE PLANTEL \"B\" Y \"C\"","C",27,27,"P",30324.81,0,8,0,242598.39999999999]
[null,3,32,31,"LICENCIATURA UNIVERSITARIA",1,1540,5,"0CF02102","DIRECTOR DE PLANTEL \"A\"","C",28,28,"P",30374.93,0,1,0,30374.94]
[null,3,32,31,"LICENCIATURA UNIVERSITARIA",1,1540,5,"0CF11100","REPRESENTANTE","C",30,30,"P",79876.2,0,1,0,79876.210000000006]
[null,null,null,null,null,null,null,null,null,null,null,null,null,"Total Jornada:",{"$f":"SUBTOTAL(109,Tabla15[Monto mensual\npor plaza jornada])","v":456441.59999999998},null,"Total Autorizado:",null,{"$f":"SUBTOTAL(109,Tabla15[Monto total autorizado])","v":9520391.4900000002}]
[null,null,null,null,null,null,null,null,null,null,null,null,null,"Total HSM",{"$f":"SUM(Tabla15[Monto mensual\nPor Plaza HSM])","v":1469.25}]
[]
[null,"Fuente : Información proporcionada por las Entidades Federativas"]

{"sheet":"II D) 7 2 ","index":11,"n_rows":53,"n_cols":18,"rows_kept":53,"cut":false,"hidden":false,"merged":[[14,8,15,8],[14,9,14,13],[14,14,14,16],[10,16,10,17],[11,1,11,9],[14,1,15,1],[14,2,15,2],[14,3,15,3],[14,17,15,17],[14,6,15,6],[14,7,15,7],[14,4,15,4],[14,5,15,5]]}
[]
[]
[]
[]
[]
[]
[]
[]
[]
[]
[null,"Formato: Catálogo de Categorías y Tabuladores",null,null,null,null,null,null,null,null,null,null,null,null,null,"Entidad Federativa:",{"$f":"IF('Caratula Resumen'!D21=\"Elige el Periodo…\",\"\",'Caratula Resumen'!D21)","v":" GUANAJUATO "}]
[null,{"$f":"IF('Caratula Resumen'!D22=\"Elige el Periodo…\",\"\",'Caratula Resumen'!D22)","v":"Fondo de Aportaciones para la Educación Tecnológica y de Adultos/Colegio Nacional de Educación Profesional Técnica (FAETA/CONALEP)"}]
[null,null,null,null,null,null,null,null,null,null,null,null,null,null,null,null,null,"3er. Trimestre 2016"]
[]
[null,"Identificador origen presupuestal de la plaza","Clave de categoría","Descripción de la categoría","Tipo de contratación","Tipo de categoría","Clave de concepto de pago","Clave de nivel de puesto","Clave de nivel de sueldo","Sueldo asignado por zona económica",null,null,null,null,"Datos adicionales de horas",null,null,"Fecha de actualización"]
[null,null,null,null,null,null,null,null,null,"Inicio de vigencia del sueldo","Fin de vigencia del sueldo","Monto Mensual Jornada ó de HSM\nZona A","Monto Mensual Jornada ó de HSM\nZona B","Monto Mensual Jornada ó de HSM\nZona C","Horas \nde compatibilidad","Horas de servicio (HSM)","Horas de docencia"]
[]
[null,"Identificador origen presupuestal de la plaza","Clave de categoría","Descripción de la categoría","Tipo de contratación","Tipo de categoría","Clave de concepto de pago","Clave de nivel de puesto","Clave de nivel de sueldo","Inicio de vigencia del sueldo","Fin de vigencia del sueldo","Monto Mensual Jornada ó de HSM\nZona A","Monto Mensual Jornada ó de HSM\nZona B","Monto Mensual Jornada ó de HSM\nZona C","Horas \nde compatibilidad","Horas de servicio (HSM)","Horas de docencia","Fecha de actualización"]
[null,1,"0CF02105","COORDINADOR EJECUTIVO II","P",5,1003,21,21,"201601",999999,0,0,25707.39,8,0,"00.0","20160901"]
[null,1,"0CF01601","JEFE DE UNIDAD","P",5,1003,22,22,"201601",999999,0,0,29719.360000000001,8,0,"00.0","20160901"]
[null,1,"0CF11102","DIRECTOR DE CENTRO","P",5,1003,24,24,"201601",999999,0,0,37686.910000000003,8,0,"00.0","20160901"]
[null,1,"0CF02100","SUBCOORDINADOR","P",5,1003,25,25,"201601",999999,0,0,37378.76,8,0,"00.0","20160901"]
[null,1,"0CF02104","DIRECTOR DE PLANTEL \"D\" Y \"E\" II","P",5,1003,26,26,"201601",999999,0,0,29695.83,8,0,"00.0","20160901"]
[null,1,"0CF02103","DIRECTOR DE PLANTEL \"B\" Y \"C\" II","P",5,1003,27,27,"201601",999999,0,0,30324.799999999999,8,0,"00.0","20160901"]
[null,1,"0CF02102","DIRECTOR DE PLANTEL \"A\" II","P",5,1003,28,28,"201601",999999,0,0,30374.94,8,0,"00.0","20160901"]
[null,1,"0CF11100","REPRESENTANTE","P",5,1003,30,30,"201601",999999,0,0,79876.210000000006,8,0,"00.0","20160901"]
[null,1,"000000TA","DOCENTE TIPO 'TA'","H",1,1001,"000000D4",4,"201601",999999,0,0,259.89999999999998,0,0,20,"20160901"]
[null,1,"000000PA","DOCENTE TIPO 'PA'","H",1,1001,"000000D3",3,"201601",999999,0,0,353.5,0,0,20,"20160901"]
[null,1,"000000PB","DOCENTE TIPO 'PB'","H",1,1001,"000000D2",2,"201601",999999,0,0,397.3,0,0,20,"20160901"]
[null,1,"000000PC","DOCENTE TIPO 'PC'","H",1,1001,"000000D1",1,"201601",999999,0,0,458.55,0,0,20,"20160901"]
[null,1,"00S01201","ASISTENTE DE SERVICIOS BASICOS","P",2,1003,2,2,"201601",999999,0,0,6778.6,8,0,"00.0","20160901"]
[null,1,"0CF18201","AUXILIAR DE SEGURIDAD","P",2,1003,2,2,"201601",999999,0,0,6220.4,8,0,"00.0","20160901"]
[null,1,"0CF18202","OPERADOR DE SERVICIOS BASICOS","P",2,1003,2,2,"201601",999999,0,0,6220.4,8,0,"00.0","20160901"]
[null,1,"00S01202","AUXILIAR DE SERVICIOS GENERALES","P",2,1003,4,4,"201601",999999,0,0,6778.6,8,0,"00.0","20160901"]
[null,1,"0CF34202","PROMOTOR CULTURAL Y DEP","P",2,1003,5,5,"201601",999999,0,0,7059.85,8,0,"00.0","20160901"]
[null,1,"00A03202","SECRETARIA 'C'","P",2,1003,5,5,"201601",999999,0,0,7059.85,8,0,"00.0","20160901"]
[null,1,"0CF34201","TECNICO BIBILIOTECARIO","P",2,1003,6,6,"201601",999999,0,0,7343.6,8,0,"00.0","20160901"]
[null,1,"0ED01201","TECNICO DE MATS DIDACTICOS","P",2,1003,6,6,"201601",999999,0,0,7343.6,8,0,"00.0","20160901"]
[null,1,"0CF19201","TUTOR ESCOLAR","P",2,1003,6,6,"201601",999999,0,0,7343.6,8,0,"00.0","20160901"]
[null,1,"0CF21202","ASISTENTE ESCOLAR Y SOCIAL","P",2,1003,7,7,"201601",999999,0,0,7630.45,8,0,"00.0","20160901"]
[null,1,"0CF04201","SECRETARIA   B","P",2,1003,7,7,"201601",999999,0,0,7630.45,8,0,"00.0","20160901"]
[null,1,"00T08201","TECNICO EN GRAFICACION","P",2,1003,8,8,"201601",999999,0,0,7918.45,8,0,"00.0","20160901"]
[null,1,"0CF33202","TECNICO EN CONTABILIDAD","P",2,1003,9,9,"201601",999999,0,0,8210.9500000000007,8,0,"00.0","20160901"]
[null,1,"0CF33203","TECNICO FINANCIERO","P",2,1003,9,9,"201601",999999,0,0,8210.9500000000007,8,0,"00.0","20160901"]
[null,1,"0CF18203","SUPERVISOR DE MANTENIMIENTO","P",2,1003,9,9,"201601",999999,0,0,8210.9500000000007,8,0,"00.0","20160901"]
[null,1,"00A01801","ADMINISTRATIVO TECNICO ESPECIALISTA","P",2,1003,11,11,"201601",999999,0,0,8804.25,8,0,"00.0","20160901"]
[null,1,"0CF33204","SUBJEFE TECNICO ESPECIALISTA","P",2,1003,13,13,"201601",999999,0,0,14521.7,8,0,"00.0","20160901"]
[null,1,"0CF33206","JEFE DE PROYECTO","P",2,1003,15,15,"201601",999999,0,0,22390.75,8,0,"00.0","20160901"]
[null,null,null,null,null,null,null,null,null,null,"Total Zona A:",{"$f":"SUBTOTAL(109,Tabla16[Monto Mensual Jornada ó de HSM\nZona A])","v":0}]
[null,null,null,null,null,null,null,null,null,null,null,"Total Zona B:",{"$f":"SUM(M19:M49)","v":0}]
[null,null,null,null,null,null,null,null,null,null,null,null,"Total Zona C:",{"$f":"SUM(N19:N50)","v":457910.85}]
[]
[null,"Fuente : Información proporcionada por las Entidades Federativas"]

{"sheet":"II D) 7 3","index":12,"n_rows":84,"n_cols":11,"rows_kept":84,"cut":false,"hidden":false,"merged":[[9,1,9,7],[8,9,8,10]]}
[]
[]
[]
[]
[]
[]
[]
[]
[null,"Formato: Catálogo de Percepciones y Deducciones",null,null,null,null,null,null,"Entidad Federativa:",{"$f":"IF('Caratula Resumen'!D21=\"Elige el Periodo…\",\"\",'Caratula Resumen'!D21)","v":" GUANAJUATO "}]
[null,{"$f":"IF('Caratula Resumen'!D22=\"Elige el Periodo…\",\"\",'Caratula Resumen'!D22)","v":"Fondo de Aportaciones para la Educación Tecnológica y de Adultos/Colegio Nacional de Educación Profesional Técnica (FAETA/CONALEP)"}]
[null,null,null,null,null,null,null,null,null,null,"3er. Trimestre 2016"]
[]
[null,"Identificador origen presupuestal de la plaza","Tipo de concepto de pago ","Origen de financiamiento del concepto de percepciones.","Porcentaje de participación federal por fuente de recursos","Grupo al que pertenece concepto de pago (Percepción y/o Deducción)","Clave de concepto de pago","Descripción del concepto de pago ","Partida presupuestal","Fecha del","Fecha  al"]
[]
[null,"Identificador origen presupuestal de la plaza","Tipo de concepto de pago ","Origen de financiamiento del concepto de percepciones.","Porcentaje de participación federal por fuente de recursos","Grupo al que pertenece concepto de pago (Percepción y/o Deducción)","Clave de concepto de pago","Descripción del concepto de pago ","Partida presupuestal","Fecha del","Fecha  al"]
[null,1,"P","F",100,"P0",1003,"Salario Base",1130,20160101,20161231]
[null,1,"P","F",100,"P1",2517,"Estímulo de Productividad",1540,20160101,20161231]
[null,1,"P","F",100,"P1",2800,"Despensa",1540,20160101,20161231]
[null,1,"P","F",100,"P1",1602,"Desarrollo y Capacitación",1540,20160101,20161231]
[null,1,"P","F",100,"P1",2766,"Prima de Antigüedad",1540,20160101,20161231]
[null,1,"P","F",100,"P1",2754,"Ayuda de Guardería",1540,20160101,20161231]
[null,1,"P","F",100,"P1",2615,"Canastilla Materna",1540,20160101,20161231]
[null,1,"P","F",100,"P1",2600,"Estímulo por Puntualidad y Asistencia",1540,20160101,20161231]
[null,1,"P","F",100,"P1",2680,"Anteojos  y/o Lentes de contacto",1540,20160101,20161231]
[null,1,"P","F",100,"P1",3503,"Pago por Defunción",1540,20160101,20161231]
[null,1,"P","F",100,"P1",1624,"Prima Dominical",1320,20160101,20161231]
[null,1,"P","F",100,"P1",3623,"Prima Vacacional",1320,20160101,20161231]
[null,1,"P","F",100,"P1",2850,"Labores en Condiciones Insalubres",1540,20160101,20161231]
[null,1,"P","F",100,"P1",2655,"Aparatos Ortopédicos",1540,20160101,20161231]
[null,1,"P","F",100,"P1",2627,"Estímulo por día de la Madres",1540,20160101,20161231]
[null,1,"P","F",100,"P1",2810,"Ayuda para Titulación",1540,20160101,20161231]
[null,1,"P","F",100,"P1",2625,"Ayuda para Utiles Escolares",1540,20160101,20161231]
[null,1,"P","F",100,"P1",1601,"Apoyo por contraer Nupcias",1540,20160101,20161231]
[null,1,"P","F",100,"P1",1603,"Compensación",1340,20160101,20161231]
[null,1,"P","F",100,"P1",5050,"Exceso del credito al salario",1130,20160101,20161231]
[null,1,"P","F",100,"P1",2553,"Días económicos",1540,20160101,20161231]
[null,1,"P","F",100,"P1",2565,"Ajuste salarial",1540,20160101,20161231]
[null,1,"P","F",100,"P1",2573,"Días de descanso obligatorio",1540,20160101,20161231]
[null,1,"P","F",100,"P1",1002,"subsidio al empleo",1130,20160101,20161231]
[null,1,"D",null,0,"D1",5045,"I.S.P.T. a Retener",0,20160101,20161231]
[null,1,"D",null,0,"D1",2920,"Seguro de Retiro",0,20160101,20161231]
[null,1,"D",null,0,"D1",2735,"Seg.Vida METLIFE de MEXICO",0,20160101,20161231]
[null,1,"D",null,0,"D2",8135,"Prestamo Issste",0,20160101,20161231]
[null,1,"D",null,0,"D1",8523,"Cuota Sindical Local",0,20160101,20161231]
[null,1,"D",null,0,"D1",6250,"Seg.Salud T.Activo",0,20160101,20161231]
[null,1,"D",null,0,"D1",6251,"Seg.Salud T.Pensionado",0,20160101,20161231]
[null,1,"D",null,0,"D1",6252,"Seg.Invalidez y Vida",0,20160101,20161231]
[null,1,"D",null,0,"D1",6253,"S.Sociales y Cult.",0,20160101,20161231]
[null,1,"D",null,0,"D1",6254,"S.Ret.Cesantia Avzda",0,20160101,20161231]
[null,1,"D",null,0,"D2",8095,"Cred. Hip. Creciente",0,20160101,20161231]
[null,1,"D",null,0,"D2",1927,"Seg. da%os Fovissste",0,20160101,20161231]
[null,1,"D",null,0,"D2",8580,"Pension Alimenticia",0,20160101,20161231]
[null,1,"D",null,0,"D3",2950,"Otras deducciones",0,20160101,20161231]
[null,1,"P","F",100,"P0",1001,"Salario Base del personal docente",1130,20160101,20161231]
[null,1,"P","F",100,"P1",1002,"subsidio al empleo del personal docente",3301,20160101,20161231]
[null,1,"P","F",100,"P1",1019,"Bonificación (graba para ISPT) del personal docente",1590,20160101,20161231]
[null,1,"P","F",100,"P1",1020,"Bonificación (no graba para ISPT) del personal docente",1590,20160101,20161231]
[null,1,"P","F",100,"P1",1021,"Prima Vacacional",1320,20160101,20161231]
[null,1,"P","F",100,"P1",1005,"Estimulo al desempeño docente",1710,20160101,20161231]
[null,1,"P","F",100,"P1",1006,"Horas recuperadas",1540,20160101,20161231]
[null,1,"D",null,0,"D1",2001,"I.S.P.T. a Retener del personal docente",0,20160101,20161231]
[null,1,"D",null,0,"D2",2002,"Cuota Sindical Local del personal docente",0,20160101,20161231]
[null,1,"D",null,0,"D2",2003,"Seg. de salud activo para el personal docente",0,20160101,20161231]
[null,1,"D",null,0,"D2",2004,"Seg. de salud t. pensionado del personal docente",0,20160101,20161231]
[null,1,"D",null,0,"D2",2005,"Seg. invalidez y vida del personal docente",0,20160101,20161231]
[null,1,"D",null,0,"D2",2006,"S. social y cultural del personal docente",0,20160101,20161231]
[null,1,"D",null,0,"D2",2007,"S.Ret.Cesantia Avzda del personal docente",0,20160101,20161231]
[null,1,"D",null,0,"D2",2008,"Horas no impartidas del personal docente",0,20160101,20161231]
[null,1,"D",null,0,"D2",2009,"Pensión alimenticia del personal docente",0,20160101,20161231]
[null,1,"D",null,0,"D3",2010,"Otros descuentos del personal docente",0,20160101,20161231]
[null,1,"D",null,0,"D2",2011,"Descuento por retardos del personal docente",0,20160101,20161231]
[null,1,"D",null,0,"D2",2015,"Crédito hipotecario del personal docente",0,20160101,20161231]
[null,1,"D",null,0,"D2",2014,"Préstamo personal del personal docente",0,20160101,20161231]
[null,1,"D",null,0,"D2",2021,"Ahorro solidario del personal docente",0,20160101,20161231]
[null,1,"P","F",100,"P1",2805,"Previsión Múltiple",1540,20160101,20161231]
[null,1,"P","F",100,"P1",1022,"Asesorías Complementarias",1130,20160101,20161231]
[null,1,"P","F",100,"P1",1023,"Interinatos",1130,20160101,20161231]
[null,1,"D",null,100,"D2",2010,"Ajuste por pago indebido",0,20160101,20161231]
[null,1,"D",null,100,"D2",2016,"Seguro de Daños de Fovissste",0,20160101,20161231]
[null,1,"D",null,100,"D2",2017,"Cuota Sindical para Docentes TD",0,20160101,20161231]
[null,1,"D",null,100,"D2",2022,"Seguro de Vida",0,20160101,20161231]
[null,1,"P","F",100,"P1",1004,"Aguinaldo Personal Docente",1320,20160101,20161231]
[null,1,"P","F",100,"P1",3613,"Aguinaldo",1320,20160101,20161231]
[null,"Fuente : Información proporcionada por las Entidades Federativas"]

{"sheet":"E)","index":13,"n_rows":26,"n_cols":8,"rows_kept":26,"cut":false,"hidden":false,"merged":[[9,1,9,5],[12,1,14,1],[12,2,14,2],[13,7,14,7],[12,3,14,3],[12,4,14,4],[12,5,12,7],[13,5,14,5],[13,6,14,6]]}
[]
[]
[]
[]
[]
[]
[]
[]
[null,"Formato: Trabajadores que Cobran con RFC / CURP con Formato Incorrecto"]
[null,{"$f":"IF('Caratula Resumen'!D22=\"Elige el Periodo…\",\"\",'Caratula Resumen'!D22)","v":"Fondo de Aportaciones para la Educación Tecnológica y de Adultos/Colegio Nacional de Educación Profesional Técnica (FAETA/CONALEP)"}]
[null,null,null,null,null,null,null,"3er. Trimestre 2016"]
[]
[null,"Entidad Federativa","RFC","CURP","NOMBRE TRABAJADOR","Motivo"]
[null,null,null,null,null,"Sin RFC o erroneo","RFC Sin Homoclave","Sin CURP o Erronea"]
[]
[]
[null,"Entidad Federativa","RFC","CURP","NOMBRE TRABAJADOR","Sin RFC o erroneo","RFC Sin Homoclave","Sin CURP o Erronea"]
[]
[]
[]
[]
[]
[null,"Total Personas : ",null,null,"Total Sin RFC o Erroneo:"]
[null,null,null,null,null,"Total RFC Sin Homoclave:"]
[null,null,null,null,null,null,"Total Sin CURP o Erroneo:"]
[null,"Fuente : Información proporcionada por las Entidades Federativas"]

{"sheet":"G)","index":14,"n_rows":28,"n_cols":20,"rows_kept":28,"cut":false,"hidden":false,"merged":[[13,19,14,19],[13,13,14,13],[13,14,14,14],[13,15,13,16],[13,17,14,17],[13,18,14,18],[10,1,10,8],[12,5,12,11],[13,1,14,1],[13,2,14,2],[13,3,14,3],[13,4,14,4],[13,5,14,5],[13,6,13,12]]}
[]
[]
[]
[]
[]
[]
[]
[]
[]
[null,"Formato: Trabajadores Cuyo Salario Básico Supere los Ingresos Promedio de un Docente en la Categoría más Alta del Tabulador Salarial Correspondiente a Cada Entidad"]
[null,{"$f":"IF('Caratula Resumen'!D22=\"Elige el Periodo…\",\"\",'Caratula Resumen'!D22)","v":"Fondo de Aportaciones para la Educación Tecnológica y de Adultos/Colegio Nacional de Educación Profesional Técnica (FAETA/CONALEP)"}]
[null,null,null,null,null,null,null,null,null,null,null,null,null,null,null,null,null,null,null,"3er. Trimestre 2016"]
[]
[null,"Entidad Federativa","R.F.C.","CURP","Nombre","Clave integrada","Clave Presupuestal Integrada y Categoria aparte",null,null,null,null,null,null,"Clave CT Origen","Nombre CT","Periodo",null,"Monto de Remuneraciones Mensuales ","Monto de referencia","Diferencia\n(R-S)"]
[null,null,null,null,null,null,"Partida Presupuestal","Código de Pago","Clave de Unidad","Clave de Sub Unidad","Clave de Categoría","Horas Semana Mes ","Número de Plaza",null,null,"Desde","Hasta"]
[]
[null,"Entidad Federativa","R.F.C.","CURP","Nombre","Clave integrada","Partida Presupuestal","Código de Pago","Clave de Unidad","Clave de Sub Unidad","Clave de Categoría","Horas Semana Mes ","No. de plaza","CT","Nombre CT","Periodo\nDesde","Periodo\nHasta","Monto de Remuneraciones Mensuales ","Monto de referencia","Diferencia\n(R-S)"]
[]
[]
[]
[]
[]
[]
[null,"Total Personas : ",null,null,null,null,null,null,null,null,null,null,null,null,"Total Remuneraciones Mensuales:"]
[]
[null,null,null,null,null,null,null,null,null,null,null,null,null,null,null,null,null,"Total Diferencia:"]
[]
[null,"Fuente : Información proporcionada por las Entidades Federativas"]

{"sheet":"F) 1","index":15,"n_rows":26,"n_cols":19,"rows_kept":26,"cut":false,"hidden":false,"merged":[[9,1,9,6],[12,15,13,15],[12,16,13,16],[12,17,12,18],[12,1,13,1],[12,2,13,2],[12,3,13,3],[12,4,13,4],[12,5,13,5],[12,6,13,6],[12,7,13,7],[12,8,12,14]]}
[]
[]
[]
[]
[]
[]
[]
[]
[null,"Formato: Trabajadores con Doble Asignación Salarial en Municipios no Colindantes Geográficamente"]
[null,{"$f":"IF('Caratula Resumen'!D22=\"Elige el Periodo…\",\"\",'Caratula Resumen'!D22)","v":"Fondo de Aportaciones para la Educación Tecnológica y de Adultos/Colegio Nacional de Educación Profesional Técnica (FAETA/CONALEP)"}]
[null,null,null,null,null,null,null,null,null,null,null,null,null,null,null,null,null,null,"3er. Trimestre 2016"]
[]
[null,"Entidad Federativa","Municipio","Localidad","RFC","CURP","Nombre del Trabajador","Clave integrada","Clave Presupuestal",null,null,null,null,null,null,"Clave CT","Nombre CT","Periodo en el CT"]
[null,null,null,null,null,null,null,null,"Partida Presupuestal","Código de Pago","Clave de Unidad","Clave de Sub Unidad","Clave de Categoría","Horas Semana Mes ","Número de Plaza",null,null,"Desde","Hasta"]
[]
[null,"Entidad Federativa","Municipio","Localidad","RFC","CURP","Nombre del Trabajador","Clave integrada","Partida Presupuestal","Código de Pago","Clave de Unidad","Clave de Sub Unidad","Clave de Categoría","Horas semana mes","Número de Plaza","Clave CT","Nombre CT","Periodo en el CT\nDesde","Periodo en el CTH\nasta"]
[]
[]
[]
[]
[]
[null,"Total Personas : ",null,null,null,null,null,null,null,null,null,null,"Total Plazas : "]
[]
[]
[null,"Fuente : Información proporcionada por las Entidades Federativas"]
[null,"Importante: Listar Sólo los Municipios no Colindantes"]

{"sheet":"F) 2","index":16,"n_rows":26,"n_cols":20,"rows_kept":26,"cut":false,"hidden":false,"merged":[[13,3,14,3],[13,4,14,4],[13,5,14,5],[10,1,10,9],[13,19,14,19],[13,18,14,18],[13,6,13,12],[13,13,14,13],[13,14,14,14],[13,15,14,15],[13,16,13,17],[13,1,14,1],[13,2,14,2]]}
[]
[]
[]
[]
[]
[]
[]
[]
[]
[null,"Formato: Trabajadores Ocupando Plazas que Superan el Número de Horas de Compatibilidad Autorizadas"]
[null,{"$f":"IF('Caratula Resumen'!D22=\"Elige el Periodo…\",\"\",'Caratula Resumen'!D22)","v":"Fondo de Aportaciones para la Educación Tecnológica y de Adultos/Colegio Nacional de Educación Profesional Técnica (FAETA/CONALEP)"}]
[null,null,null,null,null,null,null,null,null,null,null,null,null,null,null,null,null,null,"3er. Trimestre 2016"]
[]
[null,"Entidad Federativa","RFC","CURP","Nombre","Clave integrada","Clave Presupuestal",null,null,null,null,null,null,"CT","Nombre CT","Turno CT","Periodo",null,"Total de Horas en el CT","Horas de compatibilidad de la categoría"]
[null,null,null,null,null,null,"Partida Presupuestal","Código de Pago","Clave de Unidad","Clave de Sub Unidad","Clave de Categoría","Horas Semana Mes ","Número de Plaza",null,null,null,"Desde","Hasta"]
[]
[null,"Entidad Federativa","RFC","CURP","Nombre","Clave integrada","Partida Presupuestal","Código de Pago","Clave de Unidad","Clave de Sub Unidad","Clave de Categoría","Horas semana mes","Número de plaza","CT","Nombre CT","Turno CT","Periodo\nDesde","Periodo\nHasta","Total de Horas en el CT","Horas de compatibilidad de la categoría"]
[]
[]
[]
[]
[]
[null,"Total Personas : ",null,null,null,null,null,null,null,null,"Total Plazas : "]
[]
[]
[null,"Fuente : Información proporcionada por las Entidades Federativas"]

{"sheet":"Listas","index":17,"n_rows":42,"n_cols":8,"rows_kept":42,"cut":false,"hidden":true,"merged":[]}
[]
[]
[]
[null,"Elige un Fondo…"]
[null,"Fondo de Aportaciones para la Educación Básica y Normal (FAEB)"]
[null,"Fondo de Aportaciones para la Educación Tecnológica y de Adultos/Colegio Nacional de Educación Profesional Técnica (FAETA/CONALEP)"]
[null,"Fondo de Aportaciones para la Educación Tecnológica y de Adultos/Instituto Nacional para la Educación de los Adultos (FAETA/INEA)"]
[]
[]
[null,null,null,null,null,null,null,"Elige la Entidad Federativa…"]
[null,"Elige el Periodo…",null,null,null,null,null,"AGUASCALIENTES"]
[null,"1er. Trimestre",null,null,null,null,null,"BAJA CALIFORNIA"]
[null,"2do. Trimestre",null,null,null,null,null,"BAJA CALIFORNIA SUR"]
[null,"3er. Trimestre",null,null,null,null,null,"CAMPECHE"]
[null,"4to. Trimestre",null,null,null,null,null,"COAHUILA "]
[null,null,null,"Elige el Año…",null,null,null,"COLIMA "]
[null,null,null,2013,null,null,null,"CHIAPAS "]
[null,null,null,2014,null,null,null,"CHIHUAHUA "]
[null,null,null,2015,null,null,null,"DISTRITO FEDERAL"]
[null,null,null,2016,null,null,null," DURANGO "]
[null,null,null,2017,null,null,null," GUANAJUATO "]
[null,null,null,2018,null,null,null," GUERRERO "]
[null,null,null,null,null,null,null," HIDALGO"]
[null,null,null,null,null,null,null," JALISCO "]
[null,null,null,null,null,null,null," MEXICO "]
[null,null,null,null,null,null,null," MICHOACAN "]
[null,null,null,null,null,null,null," MORELOS "]
[null,null,null,null,null,null,null," NAYARIT "]
[null,null,null,null,null,null,null," NUEVO LEON"]
[null,null,null,null,null,null,null," OAXACA "]
[null,null,null,null,null,null,null," PUEBLA "]
[null,null,null,null,null,null,null," QUERETARO "]
[null,null,null,null,null,null,null," QUINTANA ROO"]
[null,null,null,null,null,null,null," SAN LUIS"]
[null,null,null,null,null,null,null," SINALOA "]
[null,null,null,null,null,null,null," SONORA "]
[null,null,null,null,null,null,null," TABASCO "]
[null,null,null,null,null,null,null," TAMAULIPAS "]
[null,null,null,null,null,null,null," TLAXCALA "]
[null,null,null,null,null,null,null," VERACRUZ"]
[null,null,null,null,null,null,null," YUCATÁN "]
[null,null,null,null,null,null,null," ZACATECAS "]