{"text_format":"1","workbook":"xlsx","n_sheets":18,"sheets":["Caratula Resumen","A Y  II D3","B)","A Y II D4","II B) Y 1","II C y 1_","II D) 2","II D) 4","II D) 4 A","II D) 6","II D) 7 1","II D) 7 2 ","II D) 7 3","F) 1","E)","F) 2","G)","Listas"],"not_rendered":{"charts":0,"images":17,"macros":1,"external_links":0,"defined_names":17,"comments":16,"pivot_tables":0},"unopened":[],"bounds":{"document_bytes":16777216,"sheet_cells":100000,"rows_first":2000,"rows_last":500,"rows_between":2000,"halvings":0,"cell_chars":16384,"cell_head_chars":4096},"cells_cut":0,"cells_raw":0,"read":"whole","date_system":"1900"}

{"sheet":"Caratula Resumen","index":0,"n_rows":73,"n_cols":18,"rows_kept":73,"cut":false,"hidden":false,"merged":[[69,2,69,5],[71,2,71,5],[72,2,72,5],[73,2,73,5],[20,3,20,14],[21,3,21,14],[22,3,22,14],[49,3,49,6],[62,2,62,5],[63,2,63,5],[65,2,65,5],[66,2,66,5],[68,2,68,5],[43,3,43,6],[44,3,44,6],[45,3,45,6],[46,3,46,6],[47,3,47,6],[48,3,48,6],[37,3,37,6],[38,3,38,6],[39,3,39,6],[40,3,40,6],[41,3,41,6],[42,3,42,6],[36,3,36,6],[10,3,10,18],[11,3,11,18],[12,3,12,18],[34,3,34,6],[35,3,35,6]]}
[]
[]
[]
[]
[]
[]
[]
[]
[]
[]
[]
[null,null,null,"FORMATOS ENTREGADOS PARA DAR CUMPLIMIENTO AL ARTICULO 73 DE \"LA LEY GENERAL DE CONTABILIDAD GUBERNAMENTAL\""]
[]
[]
[]
[]
[]
[]
[]
[]
[null,null,"Entidad Federativa :"," GUANAJUATO "]
[null,null,"Fondo :","Fondo de Aportaciones para la Educación Tecnológica y de Adultos/Colegio Nacional de Educación Profesional Técnica (FAETA/CONALEP)"]
[null,null,"Periodo :","1er. Trimestre"]
[]
[]
[]
[]
[]
[]
[]
[]
[null,null,null,null,null,null,null,"TOTAL REGISTROS ",null,"Num. de Paginas",null,"TOTAL PERSONAS",null,"TOTAL PLAZAS",null,"Total Pto. Federal",null,"Total Ppto. Otras Fuentes"]
[]
[]
[null,1,"A Y II D3","Personal Comisionado",null,null,null,{"$f":"+'A Y  II D3'!C64","v":47},null,2,null,{"$f":"+'A Y  II D3'!M64","v":45},null,40,null,{"$f":"'A Y  II D3'!P64","v":3592315.8},null,0]
[null,2,"A Y II D4","Personal con Licencia",null,null,null,35,null,1,null,35,null,35,null,{"$f":"'A Y II D4'!P53","v":658966.29},null,0]
[null,3,"B)   ","Registro Federal de Contribuyentes de Trabajadores con Pagos Retroactivos con un Periodo Mayor a 45 días",null,null,null,0,null,1,null,0,null,0,null,"N/A",null,"N/A"]
[null,4,"II B) Y 1","Plaza / Función",null,null,null,1175,null,21,null,1175,null,"N/A",null,"N/A",null,"N/A"]
[null,5,"II C y 1_","Personal Federalizado por Registro Federal de Contribuyentes",null,null,null,1175,null,20,null,1175,null,477,null,{"$f":"'II C y 1_'!U1191","v":42012175.270000115},null,0]
[null,6,"II D) 2","Movimientos de Plazas",null,null,null,0,null,1,null,0,0,0,null,"N/A",null,"N/A"]
[null,7,"II D) 4","Trabajadores Jubilados en el Periodo",null,null,null,3,null,1,null,3,6,3,null,"N/A",null,"N/A"]
[null,8,"II D) 4 A","Trabajadores que Tramitaron Licencia Prejubilatoria en el Periodo",null,null,null,0,null,1,null,0,null,0,null,{"$f":"'II D) 4 A'!P21","v":0},null,0]
[null,9,"II D) 6","Trabajadores Contratados por Honorarios en el Periodo",null,null,null,0,null,1,null,0,null,"N/A",null,"N/A",null,"N/A"]
[null,10,"II D) 7 1 ","Analítico de Categorías / Plazas Autorizadas con su Tabulador",null,null,null,30,null,1,null,"N/A",null,"N/A",null,"N/A",null,"N/A"]
[null,11,"II D) 7 2 ","Catálogo de Categorías y Tabuladores",null,null,null,30,null,1,null,"N/A",null,"N/A",null,"N/A",null,"N/A"]
[null,12,"II D) 7 3 ","Catálogo de Percepciones y Deducciones",null,null,null,84,null,2,null,"N/A",null,"N/A",null,"N/A",null,"N/A"]
[null,13,"E)","Trabajadores que Cobran con RFC / CURP con Formato Incorrecto",null,null,null,0,null,1,null,0,null,"N/A",null,"N/A",null,"N/A"]
[null,14,"F) 1","Trabajadores con Doble Asignación Salarial en Municipios no Colindantes Geográficamente",null,null,null,0,null,1,null,0,null,"N/A",null,"N/A",null,"N/A"]
[null,15,"F) 2","Trabajadores Ocupando Plazas que Superan el Número de Horas de Compatibilidad Autorizadas",null,null,null,0,null,1,null,0,null,0,null,"N/A",null,"N/A"]
[null,16,"G)","Trabajadores Cuyo Salario Básico Supere los Ingresos Promedio de un Docente en la Categoría más Alta del Tabulador Salarial Correspondiente a Cada Entidad",null,null,null,0,null,1,null,0,null,"N/A",null,"N/A",null,"N/A"]
[]
[]
[]
[]
[]
[]
[]
[]
[]
[]
[]
[]
[null,null,"LIC. LUCIA GONZALEZ MUÑOZ"]
[null,null,"Nombre del  Responsable"]
[]
[null,null,"DIRECTORA DE ADMINISTRACION"]
[null,null,"Cargo"]
[]
[]
[null,null,"Firma"]
[]
[null,null,"2017-04-06"]
[null,null,"Fecha"]

{"sheet":"A Y  II D3","index":1,"n_rows":69,"n_cols":25,"rows_kept":69,"cut":false,"hidden":false,"merged":[[9,1,9,7],[12,6,12,12],[12,1,13,1],[12,2,13,2],[12,3,13,3],[12,4,13,4],[12,5,13,5],[65,12,65,14],[12,24,13,24],[12,13,12,14],[12,15,13,15],[12,16,13,16],[12,17,13,17],[12,18,12,19],[12,20,13,20],[63,13,63,14],[12,21,13,21],[12,22,13,22],[12,23,13,23]]}
[]
[]
[]
[]
[]
[]
[]
[]
[null,"Formato: Personal Comisionado"]
[null,{"$f":"IF('Caratula Resumen'!D22=\"Elige el Periodo…\",\"\",'Caratula Resumen'!D22)","v":"Fondo de Aportaciones para la Educación Tecnológica y de Adultos/Colegio Nacional de Educación Profesional Técnica (FAETA/CONALEP)"},null,null,null,null,null,null,null,null,null,null,null,null,null,null,null,null,null,null,null,null,null,"1er. Trimestre de 2017"]
[]
[]
[null,"Entidad Federativa","R.F.C.","CURP","Nombre","Clave integrada","Clave Presupuestal",null,null,null,null,null,null,"Fecha Comisión",null,"Percepciones pagadas en el Periodo de Comisión con Presupuesto Federal*","Percepciones pagadas en el Periodo de Comisión con Presupuesto de otra fuente*","Clave CT Origen","CT Destino dentro del sector",null,"Lugar de la comisión fuera del sector educativo","Tipo de Comisión","Función Específica","Objeto de la comision","No. Oficio"]
[null,null,null,null,null,null,"Partida Presupuestal","Código de Pago","Clave de Unidad","Clave de Sub Unidad","Clave de Categoría","Horas Semana Mes ","Número de Plaza","Inicio","Conclusión",null,null,null,"Clave","Turno"]
[]
[null,"Entidad Federativa","R.F.C.","CURP","Nombre","Clave integrada","Partida Presupuestal","Código de Pago","Clave de Unidad","Clave de Sub Unidad","Clave de Categoría","Horas Semana Mes ","Número de Plaza","Fecha Comisión\nInicio","Fecha Comisión\nConclusión","Percepciones pagadas en el Periodo de Comisión con Presupuesto Federal*","Percepciones pagadas en el Periodo de Comisión con Presupuesto de otra fuente*","Clave CT Origen","Clave","Turno","Lugar de la comisión fuera del sector educativo","Tipo de Comisión","Función Específica","Objeto de la comision","No. Oficio"]
[null,"GUANAJUATO","AECL710621SE4","AECL710621HGTRRS02","JOSE LUIS ARELLANO CRUZ","113010030000A0320200.010301",1130,"1003","00","00","A03202","00.0",10301,20141117,20171231,40340.559999999998,0,"11APT0001T","11DPT0010Y",100,"-------------------------------------------------------------","C","APOYO AL AREA DE CAPACITACION","APOYO AL AREA POR FALTA DE PERSONAL","976/2014"]
[null,"GUANAJUATO","BACJ850923PQ8","BACJ850923HGTRRS05","JESUS OMAR BARCENAS CORNEJO","113010030000CF0210500.014598",1130,"1003","00","00","CF02105","00.0",14598,20160921,20170131,26272.400000000001,0,"11APT0001T","11DPT0007K",100,"-------------------------------------------------------------","C","JEFE DE SERVICIOS ADMINISTRATIVOS","JEFE DE SERVICIOS ADMINISTRATIVOS","1439/2016"]
[null,"GUANAJUATO","PATR7101059J2","PATR710105MGTCRS08","ROSA ADRIANA MARCELA PACHECO TORRES","113010030000CF0210500.014598",1130,"1003","00","00","CF02105","00.0",14598,20170201,20171231,52544.800000000003,0,"11APT0001T","11DPT0007K",100,"-------------------------------------------------------------","C","JEFE DE SERVICIOS ADMINISTRATIVOS","JEFE DE SERVICIOS ADMINISTRATIVOS","191/2017"]
[null,"GUANAJUATO","GAGV930611G79","GAGV930611HGTRMC04","VICTOR HUGO GARCIA GOMEZ","113010030513S0120100.02502",1130,"1003","05",13,"S01201","00.0",2502,20160316,20171231,31033.110000000004,0,"11APT0001T","11DPT0003O",100,"-------------------------------------------------------------","C","ASISTENTE DE SERVICIOS BASICOS","APOYO ADMINISTRATIVO","0645/2016"]
[null,"GUANAJUATO","MOGM581228P96","MOGM581228MGTRNR09","MORENO GONZALEZ MARTHA DEL CARMEN","113010030000A0180100.018843",1130,"1003","00","00","A01801","00.0",18843,20080801,20171231,52628.89,0,"11APT0001T","11DPT0007K",100,"-------------------------------------------------------------","C","ADMINISTRATIVO TECNICO ESPECIALISTA","COLABORAR EN LAS ACTIVIDADES DEL PLANTEL LEON II","7292008"]
[null,"GUANAJUATO","HEGG810820ID3","HEGG810820HGTRMR07","GERARDO HERNANDEZ GOMEZ","113010030000CF3320400.03181",1130,"1003","00","00","CF33204","00.0","3181",20170216,20171231,23431.65,0,"11APT0001T","11DPT0010Y",100,"-------------------------------------------------------------","C","SUBJEFE TECNICO ESPECIALISTA","REALIZAR LAS ACTIVIDADES DEL DEPARTAMENTO DE INFORMATICA","231/2017"]
[null,"GUANAJUATO","PELI680925LM6","PELI680925MGTDPV03","IVONNE YOLANDA PEDROZA LOPEZ            ","113010030000CF3320600.010303",1130,"1003","00","00","CF33206","00.0",10303,20140829,20171231,132758.64000000001,0,"11APT0001T","11DPT0013V",100,"-------------------------------------------------------------","C","JEFE DE PROYECTO DE FORMACION TÉCNICA","REALIZA LABORES RELACIONADAS CON EL DEPARTAMENTO DE FORMACIÓN TÉCNICA","1206/2014"]
[null,"GUANAJUATO","EIPA861113S53","EIPA861113HGTSRB08","JOSE ABRAHAM ESPINOZA PORRAS","113010030705CF3420200.05581",1130,"1003","07","05","CF34202","00.0",5581,20080601,20171231,39979.200000000004,0,"11APT0001T","11APT0001T",100,"-------------------------------------------------------------","C","AREA DE ACADEMICOS","APOYO AL AREA POR FALTA DE PERSONAL","S/N"]
[null,"GUANAJUATO","GUJE870107661","GUJE870107MGTTRL01","ELIZABETH VERONICA GUTIERREZ JUAREZ","113010030705CF3320400.02546",1130,"1003","07","05","CF33204","00.0",2546,20090601,20171231,73186.049999999988,0,"11APT0001T","11APT0001T",100,"-------------------------------------------------------------","C","AREA DE PLANEACION","APOYO AL AREA POR FALTA DE PERSONAL","S/N"]
[null,"GUANAJUATO","MABM8602122N2","MABM860212MGTRRL21","MELISSA MARISELA MARTINEZ BARRIOS","113010030705S0120100.02647",1130,"1003","07","05","S01201","00.0",2647,20141116,20171231,35619.650000000009,0,"11APT0001T","11APT0001T",100,"-------------------------------------------------------------","C","APOYO EN EL AREA DE JURIDICO","APOYO AL AREA POR FALTA DE PERSONAL","S/N"]
[null,"GUANAJUATO","MANR8209073S1","MANR820907HGTCGT04","RITO MACIAS NEGRETE","113010030705CF0160100.011035",1130,"1003","07","05","CF01601","00.0",11035,20090901,20171231,95806.31,0,"11APT0001T","11APT0001T",100,"-------------------------------------------------------------","C","APOYO AL AREA DE PLANEACION","APOYO AL AREA POR FALTA DE PERSONAL","S/N"]
[null,"GUANAJUATO","PESE6410262J8","PESE641026HTSRNR02","ERNESTO PEREZ SANCHEZ","113010030705CF0160100.011098",1130,"1003","07","05","CF01601","00.0",11098,20130108,20171231,75710.899999999994,0,"11APT0001T","11APT0001T",100,"-------------------------------------------------------------","C","APOYO AL AREA DE PLANEACION","APOYO AL AREA POR FALTA DE PERSONAL","S/N"]
[null,"GUANAJUATO","VARG660927MXA","VARG660927MDFLSL01","GLORIA  GUADALUPE VALENZUELA RIOS","113010030705CF0160100.013322",1130,"1003","07","05","CF01601","00.0",13322,20130201,20171231,95806.31,0,"11APT0001T","11APT0001T",100,"-------------------------------------------------------------","C","EN EL AREA DE PROMOCION Y VINCULACION","APOYO AL AREA POR FALTA DE PERSONAL","S/N"]
[null,"GUANAJUATO","CAGX680903LH5","CXGA680903HGTHNL08","ALBERTO CHAO GONZALEZ","113010030029CF0210300.02103",1130,"1003","00",29,"CF02103","00.0","2103",20160101,20171231,97723.59,0,"11DPT0002P","11DPT0009I",100,"-------------------------------------------------------------","C","DIRECTOR DE PLANTEL \"B\" Y \"C\" II","CUBRIR LA DIRECCION DEL PLANTEL","S/N"]
[null,"GUANAJUATO","GATG451128UX1","GATG451128HDFYRS05","GUSTAVO GAYTAN TORRES","113010030029CF3320600.013248",1130,"1003","00","29","CF33206","00.0",13248,20120716,20171231,102396.77999999998,0,"11DPT0002P","11DPT0008J",100,"-------------------------------------------------------------","C","COORDINADOR EJECUTIVO","CUBRIR LA COORDINACION EJECUTIVA DEL PLANTEL CORTAZAR",16262012]
[null,"GUANAJUATO","MOFD741006FM4","MOFD741006HGTSLV05","DAVID MOSQUEDA FLORES","113010030029CF1820300.011914",1130,"1003","00","29","CF18203","00.0",11914,20150916,20171231,44348.71,0,"11DPT0002P","11DPT0016S",100,"-------------------------------------------------------------","C","SUPERVISOR DE MANTENIMIENTO","ACTIVIDADES RELATIVAS AL NOMBRAMIENTO ","1409/2015"]
[null,"GUANAJUATO","GOPR8103287J3","GOPR810328HDFMRB09","RUBEN GOMEZ PORTILLA","113010030030CF0210300.012664",1130,"1003","00",30,"CF02103","00.0",12664,20160301,20171231,97723.59,0,"11DPT0003O","11DPT0010Y",100,"-------------------------------------------------------------","C","DIRECTOR DE PLANTEL ","DIRECTOR DE PLANTEL ","S/N"]
[null,"GUANAJUATO","NIRA700123GK9","NIRA700123MGTTVN01","ANA LAURA NIETO RIVERA","113010030030CF3320600.014316",1130,"1003","00","30","CF33206","00.0",14316,20090816,20171231,131213.70000000001,0,"11DPT0003O","11APT0001T",100,"-------------------------------------------------------------","C","MEJORAMIENTO DE LOS PROCESOS DEL CAST","MEJORAMIENTO DE LOS PROCESOS EN CAST",16082009]
[null,"GUANAJUATO","PAPA810618AR6","PAPA810618HGTLLB03","ABRAHAM PALACIOS PALACIOS","113010030030S0120200.011099",1130,"1003","00","30","S01202","00.0",11099,20150101,20171231,35708.979999999996,0,"11DPT0003O","11APT0001T",100,"-------------------------------------------------------------","C","DESARROLLAR ACTIVIDADES EN DIRECCIÓN GENERAL","DESARROLLAR ACTIVIDADES EN DIRECCIÓN GENERAL","883/2015"]
[null,"GUANAJUATO","SAML830406CC2","SAML830406HDFNNS01","LUIS ENRIQUE SANCHEZ MENDOZA","113010030030CF3320600.013322",1130,"1003","00","30","CF33206",0,"13322",20170216,20171231,89392.36,0,"11DPT0003O","11APT0001T",100,"-------------------------------------------------------------","C","JEFE DE PROYECTO DE INFORMATICA","DESARROLLAR ACTIVIDADES EN DIRECCIÓN GENERAL","226/2017"]
[null,"GUANAJUATO","MORM731010QZ9","MORM731010MVZLZR03","MIRSA MOLGORA RAZO","113010030128CF0210400.012767",1130,"1003","01",28,"CF02104","00.0",12767,20140301,20171231,95731.82,0,"11DPT0004N","11DPT0005M",100,"-------------------------------------------------------------","C","DIRECTOR DE PLANTEL ","DIRECTOR DE PLANTEL ","S/N"]
[null,"GUANAJUATO","CARR771026IP3","CARR771026MDFRMS09","ROSANA CARRILLO RAMIREZ","113010030072CF0210500.014597",1130,"1003","00",72,"CF02105","00.0",14597,20160516,20171231,83101.77,0,"11DPT0005M","11DPT0011X",100,"_________________________________________","C","COORDINADOR EJECUTIVO","APOYO AL AREA POR FALTA DE PERSONAL","0804/2016"]
[null,"GUANAJUATO","JALS470121DUA","JALS470121HMNMPR04","SERGIO JAIMES LOPEZ","113010030163CF0210300.012618",1130,"1003","01",63,"CF02103","00.0",12618,20140701,20171231,97723.59,0,"11DPT0006L","11DPT0004N",100,"-------------------------------------------------------------","C","DIRECTOR DE PLANTEL ","DIRECTOR DE PLANTEL ","S/N"]
[null,"GUANAJUATO","MAZR720405LB8","MAZR720405HMNRTC01","RICARDO MARTINEZ ZETINA","113010030163CF3320400.07693",1130,"1003","01","63","CF33204","00.0",7693,20140216,20170228,27678.32,0,"11DPT0006L","11DPT0008J",100,"-------------------------------------------------------------","C","AREA DE FORMACION TECNICA","APOYO AL AREA POR FALTA DE PERSONAL","976/2014"]
[null,"GUANAJUATO","PAJJ830708SK1","PAJJ830708HQTTMR06","PATIÑO JIMÉNEZ JORGE ADALBERTO","113010030163CF3320400.07693",1130,"1003","01",63,"CF33204","00.0",7693,20170301,20171231,58042.350000000006,0,"11DPT0006L","11DPT0008J",100,"-------------------------------------------------------------","C","SUBJEFE TÉCNICO ESPECIALISTA","APOYO AL AREA POR FALTA DE PERSONAL","337/2015"]
[null,"GUANAJUATO","BAMJ651013MA3","BAMJ651013HGTRRN08","BARBOSA MORALES JUAN PEDRO","113010032300CF3320600.09201",1130,"1003","02","03","CF33206","00.0",9201,20170216,20171231,97545.46,0,"11DPT0007K","11FPT0001O",100,"-------------------------------------------------------------","C","JEFE DE PROYECTO","JEFE DE PROYECTO DE SERVICIOS ESCOLARES","283/2017"]
[null,"GUANAJUATO","IAVC761114FE1","IAVC761114MNTBLL00","IBARRA VILLANUEVA CLAUDIA ELIZABETH","113010032300CF3320600.013320",1130,"1003","02","03","CF33206","00.0",9201,20160701,20171231,120130.24000000001,0,"11DPT0007K","11FPT0001O",100,"-------------------------------------------------------------","C","COORDINADORA DE PRESUPUESTO","COORDINADORA DE PRESUPUESTO","971/2016"]
[null,"GUANAJUATO","MAMN910328KD9","MAMN910328HGTRDS06","MARTÍNEZ MEDINA NESTOR ISIDRO","113010032300CF33204  00.09201",1130,"1003","02","03","CF33204","00.0",9174,20170102,20171231,46802.79,0,"11DPT0007K","11FPT0001O",100,"-------------------------------------------------------------","C","APOYO EN EL ÁREA DE FINANZAS","APOYO EN EL ÁREA DE FINANZAS","S/N"]
[null,"GUANAJUATO","ROGF800428M80","ROGF800428HGTDZD06","FIDEL RODRIGUEZ GUZMAN                  ","113010030203CF3320400.09201",1130,"1003","02","03","CF33204","00.0",9201,20160418,20171231,59830.910000000011,0,"11DPT0007K","11APT0001T",100,"-------------------------------------------------------------","C","SUBJEFE TECNICO ESPECIALISTA","APOYO PARA CERTIFICACIONES","0642/2016"]
[null,"GUANAJUATO","POMR6708302N1","POMR670830MGTRNS05","PORRAS MANRIQUE ROSA MARÍA","113010032300CF33204  00.09201",1130,"1003","02","03","CF33204","00.0",2642,20170221,20171231,90297.41,0,"11DPT0007K","11FPT0001O",100,"-------------------------------------------------------------","C","SUBJEFE TECNICO ESPECIALISTA","APOYO EN EL AREA DE RH","0095/2017"]
[null,"GUANAJUATO","SACA791207U75","SACA791207MGTLSL02","MARIA ALEJANDRA SALAZAR CASTAÑEDA","1130100323CF0210500.012840",1130,"1003",2,3,"CF02105","00.0",12840,20160216,20171231,83101.77,0,"11DPT0007K","11APT0001T",100,"_________________________________________","C","COORDINADOR DE SERVICIOS ESCOLARES","COORDINA LOS PROCESOS ESCOLARES Y EXTRACURRICULARES DE ALUMNOS.","609/2016"]
[null,"GUANAJUATO","AAOL550422TB5","AAOL550422MGTRRZ00","LUZ VERONICA ARANDA OROZCO","11301003233CF0210500.014600",1130,"1003",2,33,"CF02105","00.0",14600,20170208,20170315,34906.930000000008,0,"11DPT0008J","11APT0001T",100,"_________________________________________","C","COORDINADOR EJECUTIVO","COORDINADOR EJECUTIVO","166/2017"]
[null,"GUANAJUATO","RASJ781020U88","RASJ781020MGTZSS02","JOSEFINA RAZO SOSA                      ","113010030233CF3320600.014312",1130,"1003","02",33,"CF33206","00.0",14312,20160516,20171231,88029.39,0,"11DPT0008J","11DPT0006L",100,"-------------------------------------------------------------","C","JEFE DE PROYECTO","RESPONSABLE DE FORMACIÓN TÉCNICA","0803/2016"]
[null,"GUANAJUATO","ZUGJ521022BB6","ZUGJ521022HGTXRV02","JAVIER ZUÑIGA GARCIA","113010030174CF0210300.012663",1130,"1003","01",74,"CF02103","00.0",12663,19920216,20171231,97723.59,0,"11DPT0009I","11DPT0014U",100,"-------------------------------------------------------------","C","DIRECTOR DE PLANTEL ","DIRECTOR DE PLANTEL ","S/N"]
[null,"GUANAJUATO","GUPD810705I4A","GUPD810705HQTRDM04","DOMINGO DANIEL GUERRERO PADILLA","113010030204CF0210400.012744",1130,"1003","02","04","CF02104","00.0",12744,20130116,20171231,95731.82,0,"11DPT0010Y","11DPT0006L",100,"-------------------------------------------------------------","C","DIRECTOR DE PLANTEL ","DIRECTOR DE PLANTEL ","S/N"]
[null,"GUANAJUATO","MAVR700118TS6","MAVR700118HGTRRB08","RUBEN MARTINEZ VARELA ","113010030204CF3320600.013251","1130","1003","02","04","CF33206","00.0",13251,20160701,20171231,135848.57999999999,0,"11DPT0010Y","11DPT0003O",100,"-------------------------------------------------------------","C","JEFE DE PROYECTO DE DIR. FORMACION TECNICA Y CAPACITACION","JEFE DE PROYECTO DE DIR. FORMACION TECNICA Y CAPACITACION","S/N"]
[null,"GUANAJUATO","RABR820601BH9","RABR820601HGTMND08","RODOLFO OSVALDO RAMIREZ BUENO ","113010030204CF3320600.0266022","1130","1003","02","04","CF33206","00.0",266022,20150204,20171231,104756.78000000001,0,"11DPT0010Y","11APT0001T",100,"-------------------------------------------------------------","C","JEFE DE PROYECTO DE NOMINA ","ACTIVIDADES RELATIVAS AL NOMBRAMIENTO ","520/2015"]
[null,"GUANAJUATO","GOLR590503HDA","GOLR590503HGTNDB04","ROBERTO GONZALEZ LEDESMA","113010030249CF3320600.014319",1130,"1003","02",49,"CF33206","00.0",14319,20160416,20171231,155697.04999999999,0,"11DPT0011X","11DPT0005M",100,"-------------------------------------------------------------","C","JEFE DE PROYECTO","APOYO AL AREA DE FORMACION TECNICA","532/2016"]
[null,"GUANAJUATO","MAJG650413GMA","MAJG650413HGTLRS08","GUSTAVO MALAGON JUAREZ","113010030249CF3320600.013689",1130,"1003","02",49,"CF33206","00.0",13689,20120816,20171231,131213.70000000001,0,"11DPT0011X","11DPT0006L",100,"-------------------------------------------------------------","C","MEJORAR LOS PROCESOS ","MEJORAMIENTO DE LOS PROCESOS DEL PLANTEL AL QUE FUE COMISIONADO ","1388/2012"]
[null,"GUANAJUATO","GAGY700725MG2","GAGY700725MGTRNS04","YESENIA GRANADOS GONZALEZ               ","113010030402CF0210200.012518",1130,"1003","04","02","CF02102","00.0",12518,19940601,20171231,97882.310000000012,0,"11DPT0012W","11DPT0002P",100,"-------------------------------------------------------------","C","DIRECTOR DE PLANTEL ","DIRECTOR DE PLANTEL ","S/N"]
[null,"GUANAJUATO","ROMR861218274","ROMR861218HGTDGC00","RICARDO RODRIGUEZ MAGDALENO","113010030302CF3320600.018849",1130,"1003","03","02","CF33206","00.0",18849,"20141117",20171231,100904.06999999999,0,"11DPT0013V","11APT0001T",100,"-------------------------------------------------------------","C","COLABORAR CON LOS PROYECTOS RELACIONADOS CON EL ÁREA DE FORMACIÓN TÉCNICA DE LA DIRECCIÓN GRAL.","COLABORAR CON LOS PROYECTOS RELACIONADOS CON EL ÁREA DE FORMACIÓN TÉCNICA DE LA DIRECCIÓN GRAL.","1618/2014"]
[null,"GUANAJUATO","RORA760321A25","RORA760321HGTDDL07","ALEXANDER DANIEL RODRIGUEZ RODRIGUEZ    ","113010030302CF0210400.018848",1130,"1003","03","02","CF02104","00.0",18848,20151201,20171231,35943.949999999997,0,"11DPT0013V","11DPT0003O",100,"-------------------------------------------------------------","C","DIRECTOR DE PLANTEL ","DIRECTOR DE PLANTEL ","S/N"]
[null,"GUANAJUATO","GAAE770204JK3","GAAE770204MDFYLL06","ELIA GAYTAN ALCARAZ","113010030303CF0210400.018883",1130,"1003","03","03","CF02104","00.0",18883,20130301,20171231,95731.82,0,"11DPT0014U","11DPT0012W",100,"-------------------------------------------------------------","C","DIRECTORA DEL PLANTEL","DIRECTORA DEL PLANTEL","S/N"]
[null,"GUANAJUATO","SECG740707K72","SECG740707MZSGML05","GUILLERMINA DE LA LUZ SEGURA CAMPOS","113010030303CF3320600.018864",1130,"1003","03","03","CF33206","00.0",18864,20160121,20171231,89708.689999999988,0,"11DPT0014U","11APT0001T",100,"-------------------------------------------------------------","C","OCUPACION PUESTO VACANTE ","OCUPACION PUESTO DE JEFE PROYECTO EN CAST LEON","0138/2016"]
[null,"GUANAJUATO","COAJ850104JY6","COAJ850104HGTNMN00","JUAN MAURICIO CONTRERAS AMARO","113010030705S0120100.02653",1130,1003,"07","05","S01201","00.0",2653,20161016,20171231,21959.4,0,"11APT001T","11DPT00003O",100,"-------------------------------------------------------------","C","OCUPACION PUESTO VACANTE ","OCUPACION PUESTO EN PLANTEL LEON I","S/N"]
[null,"GUANAJUATO","OISI790511DD8","OISI790511HHGLNS14","ISMAEL OLIVO SANCHEZ","113010030303CF3320400.018865",1130,1003,"03","03","CF33204",0,"18865",20160316,20171231,60920.040000000008,0,"11DPT0014U","11DPT0003O",100,"-------------------------------------------------------------","C","OCUPACION PUESTO VACANTE ","OCUPACION PUESTO DE SUBJEFE TECNICO ESPECIALISTA DEL PLANTEL LEON 1","644/2016"]
[null,"GUANAJUATO","GUAC730716AX1","GUAC730716MGTTRL04","CLAUDIA CECILIA GUTIERREZ ARAMBULA","113010030302CF3320600.013320",1130,1003,"03","02","CF33206","00.0",13320,20161101,20171231,11745.07,0,"11DPT0013V","11APT0001T",100,"-------------------------------------------------------------","C","OCUPACION PUESTO VACANTE ","OCUPACION PUESTO DE JEFE PROYECTO EN DIRECCION GENERAL","S/N"]
[null,"Total Personas : ",47,null,null,null,null,null,null,null,"Total Plazas : ",null,45,"Total Pto. Federal",null,{"$f":"SUM(Tabla1[Percepciones pagadas en el Periodo de Comisión con Presupuesto Federal*])","v":3592315.8}]
[]
[null,null,null,null,null,null,null,null,null,null,null,null,"Total Ppto. Otras Fuentes",null,null,null,{"$f":"SUM(Q17:Q65)","v":0}]
[]
[null,"*Total de Percepciones reportadas por la Entidad Federativa como pagadas al trabajador durante la comisión."]
[null,"Fuente : Información proporcionada por las Entidades Federativas."]

{"sheet":"B)","index":2,"n_rows":28,"n_cols":19,"rows_kept":28,"cut":false,"hidden":false,"merged":[[9,1,9,10],[12,1,13,1],[12,2,13,2],[12,3,13,3],[12,4,13,4],[12,5,12,11],[12,18,13,18],[12,12,13,12],[12,13,13,13],[12,14,13,14],[12,15,12,16],[12,17,13,17]]}
[]
[]
[]
[]
[]
[]
[]
[]
[null,"Formato: Registro Federal de Contribuyentes de Trabajadores con Pagos Retroactivos con un Periodo Mayor a 45 días",null,null,null,null,null,null,null,null,null,null,null,null,null,null,null,"Guanajuato"]
[null,{"$f":"IF('Caratula Resumen'!D22=\"Elige el Periodo…\",\"\",'Caratula Resumen'!D22)","v":"Fondo de Aportaciones para la Educación Tecnológica y de Adultos/Colegio Nacional de Educación Profesional Técnica (FAETA/CONALEP)"},null,null,null,null,null,null,null,null,null,null,null,null,null,null,null,"1er. Trimestre de 2017"]
[]
[]
[null,"Entidad Federativa","RFC","CURP","Nombre","Clave Presupuestal",null,null,null,null,null,null,"Clave de Centro de Trabajo","Fecha de emisión de pago","Motivo del Pago Retroactivo","Periodo pagado",null,"Días transcurridos para el pago","Percepciones pagadas en el periodo reportado *"]
[null,null,null,null,null,"Partida Presupuestal","Código de Pago","Clave de Unidad","Clave de Sub Unidad","Clave de Categoría","Horas Semana Mes ","Número de Plaza",null,null,null,"Desde","Hasta"]
[]
[null,"Entidad Federativa","RFC","CURP","Nombre","Partida Presupuestal","Código de Pago","Clave de Unidad","Clave de Sub Unidad","Clave de Categoría","Horas semana mes","Número de plaza","Clave de Centro de Trabajo","Fecha de emisión de pago","Motivo del Pago Retroactivo","Periodo pagado\nDesde","Periodo pagado\nHasta","Días transcurridos para el pago","Percepciones pagadas en el periodo reportado *"]
[]
[]
[]
[]
[]
[]
[null,"Total Personas : ",null,null,null,null,null,null,null,null,"Total Plazas : ",null,null,null,null,"Total Percepciones Pagadas:"]
[]
[]
[]
[null,"*Total de Percepciones reportadas por la Entidad Federativa como pagadas en el periodo "]
[null,"Fuente : Información proporcionada por las Entidades Federativas"]

{"sheet":"A Y II D4","index":3,"n_rows":58,"n_cols":21,"rows_kept":58,"cut":false,"hidden":false,"merged":[[9,1,9,6],[52,13,52,14],[12,16,13,16],[12,17,13,17],[12,20,13,20],[12,1,13,1],[12,3,13,3],[12,4,13,4],[12,5,13,5],[12,6,12,12],[12,13,12,14],[12,2,13,2],[12,18,12,19],[12,15,13,15]]}
[]
[]
[]
[]
[]
[]
[]
[]
[null,"Formato: Personal con Licencia"]
[null,{"$f":"IF('Caratula Resumen'!D22=\"Elige el Periodo…\",\"\",'Caratula Resumen'!D22)","v":"Fondo de Aportaciones para la Educación Tecnológica y de Adultos/Colegio Nacional de Educación Profesional Técnica (FAETA/CONALEP)"},null,null,null,null,null,null,null,null,null,null,null,null,null,null,null,null,null,null,"1er. Trimestre de 2017"]
[]
[]
[null,"Entidad Federativa","R.F.C.","CURP","NOMBRE","Clave integrada","Clave Presupuestal",null,null,null,null,null,null,"Periodo Licencia",null,"Percepciones pagadas en el Periodo de la Licencia con Presupuesto Federal*","Percepciones pagadas en el Periodo de la Licencia con Presupuesto de otra fuente*","Clave CT Origen","Licencia",null,"Descripción de la Licencia"]
[null,null,null,null,null,null,"Partida Presupuestal","Código de Pago","Clave de Unidad","Clave de Sub Unidad","Clave de Categoría","Horas Semana Mes ","Número de Plaza","Inicio","Conclusión",null,null,null,"Clave","Tipo"]
[]
[null,"Entidad Federativa","R.F.C.","CURP","NOMBRE","Clave integrada","Partida Presupuestal","Código de Pago","Clave de Unidad","Clave de Sub Unidad","Clave de Categoría","Horas Semana Mes ","Número de Plaza","Periodo Licencia\nInicio","Periodo Licencia\nConclusión","Percepciones pagadas en el Periodo de la Licencia con Presupuesto Federal*","Percepciones pagadas en el Periodo de la Licencia con Presupuesto de otra fuente*","Clave CT Origen","Licencia\nClave","Licencia\nTipo","Descripción de la Licencia"]
[null,"GUANAJUATO","MABM8602122N2","MABM860212MGTRRL21","MELISSA MARISELA MARTINEZ BARRIOS","113010030705S0120100.02647",1130,1003,"07","05","S01201","00.0","2647",20161213,20170312,35619.650000000009,0,"11APT0001T",25,"CON GOCE  DE SUELDO","POR GRAVIDEZ"]
[null,"GUANAJUATO","PEGL590326TB4","PEGL590326MGTRMZ05","LUZ ELENA PERALES GOMEZ","113010030000CF3320300.02575",1130,1003,"00","00","CF33203","00.0","2575",20170306,20170404,16009.81,0,"11APT0001T",22,"CON GOCE  DE SUELDO","POR INCAPACIDAD MEDICA O SU REFRENDO"]
[null,"GUANAJUATO","CACX831109CP9","CXCA831109MGTMHM07","AMERICA CAMPOS CHAGOYA","113010030204PB14.02040011",1130,1003,"02","04","PB","14.0","2040011",20170201,20170731,0,0,"11DPT0010Y",16,"SIN GOCE DE SUELDO ","SIN GOCE DE SUELDO O SU REFRENDO"]
[null,"GUANAJUATO","GAME651110B38","GAME651110HDFRRD00","EDUARDO GARCIA MORALES ","113010030204PA20.02040020",1130,1003,"02","04","PA","20.0","2040020",20170201,20170731,0,0,"11DPT0010Y",16,"SIN GOCE DE SUELDO ","SIN GOCE DE SUELDO O SU REFRENDO"]
[null,"GUANAJUATO","NIGC7311229F4","NIGC731122HGTLSC01","CECILIO NILA GASCA","113010030204PC05.02040046",1130,1003,"02","04","PC","05.0","2040046",20170201,20170731,0,0,"11DPT0010Y",16,"SIN GOCE DE SUELDO ","SIN GOCE DE SUELDO O SU REFRENDO"]
[null,"GUANAJUATO","PESJ720529I40","PESJ720529HGTRNN06","JUAN JOSE PEREZSANTIAGO ","113010030204PC15.02040052",1130,1003,"02","04","PC","15.0","2040052",20160801,20170731,0,0,"11DPT0010Y",16,"SIN GOCE DE SUELDO ","SIN GOCE DE SUELDO O SU REFRENDO"]
[null,"GUANAJUATO","VIMU840526EL5","VIMU840526HDFLRR00","URIEL ALEJANDRO VILLAGOMEZ MARTINEZ","113010030204PB10.02040072",1130,1003,"02","04","PB","10.0","2040072",20170201,20170731,0,0,"11DPT0010Y",16,"SIN GOCE DE SUELDO ","SIN GOCE DE SUELDO O SU REFRENDO"]
[null,"GUANAJUATO","CUTR610723JC8","CUTR610723MGTLTS06","ROSA MARIA CUELLAR TETUAN","113010030204CF3320600.013542",1130,1003,"02","04","CF33206","00.0",13542,20170301,20170531,49280.34,0,"11DPT0010Y",26,"CON GOCE  DE SUELDO","PREPENSIONARIA O SU REFRENDO"]
[null,"GUANAJUATO","SAOC521104BAA","SAOC521104HGTNLR02","CARLOS SANCHEZ OLIVA ","113010030204S0120200.09227",1130,1003,"02","04","S01202","00.0",9227,20170201,20170430,29999.599999999999,0,"11DPT0010Y",26,"CON GOCE  DE SUELDO","PREPENSIONARIA O SU REFRENDO"]
[null,"GUANAJUATO","AULJ800815441","AULJ800815HGTGPS08","JOSE AGUILAR LOPEZ","113010030163PA10.0630001",1130,1003,"01","63","PA","10.0",630001,20160801,20170731,0,0,"11DPT0006L",16,"SIN GOCE DE SUELDO ","SIN GOCE DE SUELDO O SU REFRENDO"]
[null,"GUANAJUATO","LOHE8811064TA","LOHE881106MJCPRD00","EDITH LÓPEZ HERNÁNDEZ","113010030163TA12630067",1130,1003,"01",63,"TA",12,630067,20170201,20170731,0,0,"11DPT0006L",16,"SIN GOCE DE SUELDO ","SIN GOCE DE SUELDO O SU REFRENDO"]
[null,"GUANAJUATO","GUSS851005CT6","GUSS851005MGTLNN08","SANDRA GUILLEN SANCHEZ","113010030163PB21630080",1130,1003,"01",63,"PB",21,630080,20170119,20170227,20756.37,0,"11DPT0006L",14,"CON GOCE  DE SUELDO","INCAPACIDAD MEDICA MAYOR A UNA QUINCENA O SU REFRENDO"]
[null,"GUANAJUATO","GARG881113FU7","GARG881113HGTRDL05","GUILLERMO GARCÍA RODRÍGUEZ","113010030003PC214",1130,1003,"00","03","PC",21,4,20170101,20170331,0,0,"11DPT0007K",16,"SIN GOCE DE SUELDO ","SIN GOCE DE SUELDO O SU REFRENDO"]
[null,"GUANAJUATO","RIOS5803272M4","RIOS580327MZSVLC03","MA. DEL SOCORRO RIVERA OLVERA","113010030003CF33204214",1130,1003,"00","03","CF33204",21,4,20170101,20170215,0,0,"11DPT0007K",16,"SIN GOCE DE SUELDO ","SIN GOCE DE SUELDO O SU REFRENDO"]
[null,"GUANAJUATO","ROZA560516SE3","ROZA560516HGTJPB08","ABEL ROJAS ZAPATERO","113010030233CF3320300.010178",1130,1003,"02",33,"CF33203","00.0",10178,20170101,20170331,65429.919999999998,0,"11DPT0008J",26,"CON GOCE  DE SUELDO","SIN GOCE DE SUELDO O SU REFRENDO"]
[null,"GUANAJUATO","GAJJ840319DY2","GAJJ840319MGTRMS02","JOSEFINA ELIZABETH GARCIA JIMENEZ ","113010030072PC00.0720025",1130,1003,"00",72,"PC","00.0",720025,20160816,99999999,0,0,"11DPT0005M",16,"SIN GOCE DE SUELDO ","SIN GOCE DE SUELDO O SU REFRENDO"]
[null,"GUANAJUATO","MAAA630105332","MAAA630105MGTRCN00","MARIA DE LOS ANGELES MARES ACOSTA ","113010030072PC00.0720035",1130,1003,"00",72,"PC","00.0",720035,20150201,99999999,0,0,"11DPT0005M",16,"SIN GOCE DE SUELDO ","SIN GOCE DE SUELDO O SU REFRENDO"]
[null,"GUANAJUATO","VITF791111L77","VITF791111HGTLVR01","VILLAFAÑA TAVERA FRANCISCO","113010030072PB00.0720052",1130,1003,"00",72,"PB","00.0",720052,20160816,20170131,0,0,"11DPT0005M",16,"SIN GOCE DE SUELDO ","SIN GOCE DE SUELDO O SU REFRENDO"]
[null,"GUANAJUATO","AAMR650620AB4","AAMR650620HGTLGB03","ROBERTO ALVARADO MAGAÑA","113010030249CF1920100.010606",1130,1003,"02",49,"CF19201","00.0",10606,20131016,20190930,50635.59,0,"11DPT0011X",12,"CON GOCE  DE SUELDO","COMISION SINDICAL O SU REFRENDO"]
[null,"GUANAJUATO","GOSA4507257Y0","GOXS450725HGTNXN07","SANTIAGO GONZALEZ","113010030249S01202010294",1130,1003,"02",49,"S01202",0,10294,20161101,20170131,17038.170000000002,0,"11DPT0011X",26,"CON GOCE  DE SUELDO","PREPENSIONARIA O SU REFRENDO"]
[null,"GUANAJUATO","SAJB8210296D0","SAJB821029HGTNMR03","BERNARDO SANCHEZ JIMENEZ ","113010030249PC205112490050",1130,1003,"02",49,"PC",20,5112490050,20160201,20170731,0,0,"11DPT0011X",16,"SIN GOCE DE SUELDO ","SIN GOCE DE SUELDO O SU REFRENDO"]
[null,"GUANAJUATO","GAMB800204HK9","GAMB800204MGTRRR01","BERENICE ELENA MARIA GARCIA MARQUEZ","113010030249PC205112490021",1130,1003,"02",49,"PC",20,5112490021,20160201,20170731,0,0,"11DPT0011X",16,"SIN GOCE DE SUELDO ","SIN GOCE DE SUELDO O SU REFRENDO"]
[null,"GUANAJUATO"," GAFM620222JY6","GAFM620222HGTRLN01","JOSE MANUEL GARCIA FLORES","113010030249PC205112490020",1130,1003,"02",49,"PC",20,5112490020,20160201,20170731,0,0,"11DPT0011X",16,"SIN GOCE DE SUELDO ","SIN GOCE DE SUELDO O SU REFRENDO"]
[null,"GUANAJUATO","AOGE690325D41","AOGE690325HGTBZM07","EMILIO ABONCE GUZMAN","113010030249PB205112490002",1130,1003,"02",49,"PB",20,5112490002,20160201,20170731,0,0,"11DPT0011X",16,"SIN GOCE DE SUELDO ","SIN GOCE DE SUELDO O SU REFRENDO"]
[null,"GUANAJUATO","ZAMJ740416IL1","ZAMJ740416HDFMXR00","JORGE ZAMORA MUÑIZ","113010030249PB205112490056",1130,1003,"02",49,"PB",20,5112490056,20160201,20170731,0,0,"11DPT0011X",16,"SIN GOCE DE SUELDO ","SIN GOCE DE SUELDO O SU REFRENDO"]
[null,"GUANAJUATO","ROMR681004UF2","ROMR681004HGTDRM02","RAMIRO RODRIGUEZ MARTINEZ","113010030028A0320200.0282300",1130,1003,"00",28,"A03202","00.0",282300,20170119,20170412,36118.559999999998,0,"11DPT0001Q",14,"CON GOCE  DE SUELDO","INCAPACIDAD MEDICA MAYOR A UNA QUINCENA O SU REFRENDO"]
[null,"GUANAJUATO","OAMC600520F43","OAMC600520HSLLLR01 ","CARLOS JAVIER OLAVEZ MELESIO","113010030028A0320200.0284145",1130,1003,"00",28,"A03202","00.0",284145,20170316,20170430,0,0,"11DPT0001Q",16,"SIN GOCE DE SUELDO ","SIN GOCE DE SUELDO O SU REFRENDO"]
[null,"GUANAJUATO","ROBI821220310","ROBI821220MDFDCT03","ITZEL RODRIGUEZ BECERRA","113010030028PA25.0280134",1130,1003,"00",28,"PA","25.0",280134,20170201,20170728,0,0,"11DPT0001Q",16,"SIN GOCE DE SUELDO ","SIN GOCE DE SUELDO O SU REFRENDO"]
[null,"GUANAJUATO","RONB7703042K6","RONB770304MGTDTT07 ","BEATRIZ RODRIGUEZ NIETO","113010030028PC10280072",1130,1003,"00",28,"PC",10,280072,20170201,20170728,0,0,"11DPT0001Q",16,"SIN GOCE DE SUELDO ","SIN GOCE DE SUELDO O SU REFRENDO"]
[null,"GUANAJUATO","PEGR811217KS9 ","PEGR811217HGTRRC00    ","RICARDO PEREZ GARCIA","113010030028PA15280062",1130,1003,"00",28,"PA",15,280062,20170304,20170331,5408.55,0,"11DPT0001Q",14,"CON GOCE  DE SUELDO","INCAPACIDAD MEDICA MAYOR A UNA QUINCENA O SU REFRENDO"]
[null,"GUANAJUATO","PEGR811217KS9 ","PEGR811217HGTRRC00    ","RICARDO PEREZ GARCIA","113010030028PA15280062",1130,1003,"00",28,"PA",15,280062,20170113,20170204,7046.43,0,"11DPT0001Q",14,"CON GOCE  DE SUELDO","INCAPACIDAD MEDICA MAYOR A UNA QUINCENA O SU REFRENDO"]
[null,"GUANAJUATO","LOLA590613UN8","LOLA590613HGTPPN00","ANTONIO LOPEZ LOPEZ","113010030033CF3320600.013500",1130,1003,"00",33,"CF33206","00.0",13500,20170201,20170430,140399.12,0,"11DPT0009I",26,"CON GOCE  DE SUELDO","PREPENSIONARIA O SU REFRENDO"]
[null,"GUANAJUATO","MATM660127GT0","MATM660127MGTGFN01","MONICA MAGAÑA TAFOYA","113010030033CF3320300.08091",1130,1003,"00",33,"CF33203","00.0",8091,20170101,20170320,57365.090000000004,0,"11DPT0009I",14,"CON GOCE  DE SUELDO","PREPENSIONARIA O SU REFRENDO"]
[null,"GUANAJUATO","COGB581101LL6","COGB581101HGTRMN07","BENJAMIN CORONA GOMEZ","113010030033511174000900.0740009",1130,1003,"00",33,5111740009,"00.0",740009,20170109,20170323,1234.5299999999993,0,"11DPT0009I",14,"CON GOCE  DE SUELDO","PREPENSIONARIA O SU REFRENDO"]
[null,"GUANAJUATO","BACA821115626","BACA821115MGTRRN05","MARIA DE LOS ANGELES BARRON CORONA","113010030033511174005000.0740050",1130,1003,"00",33,5111740050,"00.0",740050,20170101,20170731,34936.000000000007,0,"11DPT0009I",22,"CON GOCE  DE SUELDO","POR INCAPACIDAD MEDICA O SU REFRENDO"]
[null,"GUANAJUATO","VASS860602N16","VASS860602QMTLNN00","SANDRA YANET VALTIERRA SANCHEZ","113010030028CF3320600.0280034",1130,1003,"00",28,"CF33206","00.0",280034,20161217,20170319,91688.560000000012,0,"11DPT0012W",22,"CON GOCE  DE SUELDO","POR INCAPACIDAD MEDICA O SU REFRENDO"]
[null,"Total Personas : ",35,null,null,null,null,null,null,null,"Total Plazas : ",null,35,"Total Pto. Federal",null,{"$f":"SUBTOTAL(109,Tabla3[Percepciones pagadas en el Periodo de la Licencia con Presupuesto Federal*])","v":658966.29}]
[]
[null,null,null,null,null,null,null,null,null,null,null,null,null,"Total Ppto. Otras Fuentes",null,null,{"$f":"SUM(Q17:Q54)","v":0}]
[]
[null,"*Total de Percepciones reportadas por la Entidad Federativa como pagadas al trabajador durante la Licencia."]
[null,"Fuente : Información proporcionada por las Entidades Federativas."]

{"sheet":"II B) Y 1","index":4,"n_rows":1195,"n_cols":25,"rows_kept":1195,"cut":false,"hidden":false,"merged":[[12,24,14,24],[13,6,13,8],[13,9,13,11],[13,12,13,14],[13,15,13,17],[13,18,13,20],[12,6,12,20],[12,21,14,21],[12,22,14,22],[12,23,14,23],[12,4,14,4],[12,3,14,3],[12,2,14,2],[9,1,9,9],[1192,21,1192,23],[12,1,14,1],[12,5,14,5]]}
[]
[]
[]
[]
[]
[]
[]
[]
[null,"Formato: Plaza / Función"]
[null,{"$f":"IF('Caratula Resumen'!D22=\"Elige el Periodo…\",\"\",'Caratula Resumen'!D22)","v":"Fondo de Aportaciones para la Educación Tecnológica y de Adultos/Colegio Nacional de Educación Profesional Técnica (FAETA/CONALEP)"},null,null,null,null,null,null,null,null,null,null,null,null,null,null,null,null,null,null,null,null,null,"1er. Trimestre de 2017"]
[]
[]
[null,"Entidad Federativa","RFC","CURP","Nombre","Centros de Trabajo","Plazas por tipo de función",null,null,null,null,null,null,null,null,null,null,null,null,null,null,"Total plazas Jornada","Total \nHSM","Total de Honorarios","Total de recursos presupuestales ejercidos en servicios personales en el periodo\n(2)"]
[null,null,null,null,null,null,"Apoyo a la labor educativa",null,null,"Administrativo y de servicio",null,null,"Docente y Apoyo Técnico Pedagógico",null,null,"Directivos y Supervisión",null,null,"Mandos medios y superiores"]
[null,null,null,null,null,null,"Jornada","HSM","Honorarios","Jornada","HSM","Honorarios","Jornada","HSM","Honorarios","Jornada","HSM","Honorarios","Jornada","HSM","Honorarios"]
[]
[null,"Entidad Federativa","RFC","CURP","Nombre","Centros de Trabajo","Jornada","HSM","Honorarios","Jornada2","HSM3","Honorarios4","Jornada5","HSM6","Honorarios7","Jornada8","HSM9","Honorarios10","Jornada11","HSM12","Honorarios13","Total plazas Jornada","Total \nHSM","Total de Honorarios","Total de recursos presupuestales ejercidos en servicios personales en el periodo\n(2)"]
[null,"GUANAJUATO","RAMA640606EP1","RAMA640606HGTNXL06","ALBERTO RANGEL MUÑOZ","11APT0001T",0,0,0,1,0,0,0,0,0,0,0,0,0,0,0,0,0,0,49350.3]
[null,"GUANAJUATO","GOLA7812182KA","GOLA781218MQTMPN05","ANA GLORIA GOMEZ LOPEZ","11APT0001T",0,0,0,1,0,0,0,0,0,0,0,0,0,0,0,0,0,0,87234.580000000016]
[null,"GUANAJUATO","RAMD6103291R4","RAMD610329HGTMNV10","DAVID RAMIREZ MONJARAZ","11APT0001T",0,0,0,1,0,0,0,0,0,0,0,0,0,0,0,0,0,0,45826.590000000004]
[null,"GUANAJUATO","AAMD810413AX6","AAMD810413MGTNRN03","DIANA LORENA ANAYA MARTINEZ","11APT0001T",0,0,0,1,0,0,0,0,0,0,0,0,0,0,0,0,0,0,43193.86]
[null,"GUANAJUATO","ZALE620903MK9","ZALE620903HGTVND01","EDUARDO ZAVALA LEON","11APT0001T",0,0,0,1,0,0,0,0,0,0,0,0,0,0,0,0,0,0,85570.520000000019]
[null,"GUANAJUATO","GUJE870107661","GUJE870107MGTTRL01","ELIZABETH VERONICA GUTIERREZ JUAREZ","11APT0001T",0,0,0,1,0,0,0,0,0,0,0,0,0,0,0,0,0,0,73186.049999999988]
[null,"GUANAJUATO","ZAHE711130S69","ZAHE711130MDFMRR03","ERIKA DE LOS ANGELES ZAMORA HERNANDEZ","11APT0001T",0,0,0,1,0,0,0,0,0,0,0,0,0,0,0,0,0,0,122951.46000000002]
[null,"GUANAJUATO","PESE6410262W2","PESE641026HTSRNR02","ERNESTO PEREZ SANCHEZ","11APT0001T",0,0,0,0,0,0,0,0,0,0,0,0,0,1,0,0,0,0,75710.899999999994]
[null,"GUANAJUATO","VARG660927MXA","VARG660927MDFLSL01","GLORIA GUADALUPE VALENZUELA RIOS","11APT0001T",0,0,0,0,0,0,0,0,0,0,0,0,0,1,0,0,0,0,95806.31]
[null,"GUANAJUATO","EIPA861113S53","EIPA861113HGTSRB08","JOSE ABRAHAM ESPINOZA PORRAS","11APT0001T",0,0,0,1,0,0,0,0,0,0,0,0,0,0,0,0,0,0,39979.200000000004]
[null,"GUANAJUATO","COAJ850104JY6","COAJ850104HGTNMN00","JUAN MAURICIO CONTRERAS AMARO","11APT0001T",0,0,0,1,0,0,0,0,0,0,0,0,0,0,0,0,0,0,21959.4]
[null,"GUANAJUATO","OERL7305255H3","OERL730525HGTJDS00","LUIS ALBERTO OJEDA RODRIGUEZ","11APT0001T",0,0,0,0,0,0,0,0,0,0,0,0,0,1,0,0,0,0,121036.85]
[null,"GUANAJUATO","RALU580110A37","RAXL580110HGTMXS01","LUIS FERNANDO RAMOS","11APT0001T",0,0,0,0,0,0,0,0,0,0,0,0,0,1,0,0,0,0,83101.77]
[null,"GUANAJUATO","EAVG760111871","EAVG760111MGTSLD04","MA. GUADALUPE ESPARZA VALENCIA","11APT0001T",0,0,0,1,0,0,0,0,0,0,0,0,0,0,0,0,0,0,75422.36]
[null,"GUANAJUATO","MABM8602122N2","MABM860212MGTRRL21","MELISSA MARISELA MARTINEZ BARRIOS","11APT0001T",0,0,0,1,0,0,0,0,0,0,0,0,0,0,0,0,0,0,35619.650000000009]
[null,"GUANAJUATO","GONM790924B46","GONM790924HGTNVG00","MIGUEL ANGEL GONZALEZ NAVARRO","11APT0001T",0,0,0,1,0,0,0,0,0,0,0,0,0,0,0,0,0,0,86054.580000000016]
[null,"GUANAJUATO","MANR8209073S1","MANR820907HGTCGT04","RITO MACIAS NEGRETE","11APT0001T",0,0,0,0,0,0,0,0,0,0,0,0,0,1,0,0,0,0,95806.31]
[null,"GUANAJUATO","ZERY820116NN8","ZERY820116MGTNCD08","YADIRA BERENICE ZENDEJAS ROCHA","11APT0001T",0,0,0,1,0,0,0,0,0,0,0,0,0,0,0,0,0,0,58106.450000000012]
[null,"GUANAJUATO","JUPA730712HA3","JUPA730712MGTRRN04","ANA LAURA JUAREZ PEREZ","11DPT0006L",0,0,0,1,0,0,0,0,0,0,0,0,0,0,0,0,0,0,50877.77]
[null,"GUANAJUATO","AERG571209NWA","AERG571209HGTRML09","GILBERTO ARREOLA ROMERO","11DPT0006L",0,0,0,1,0,0,0,0,0,0,0,0,0,0,0,0,0,0,41529.53]
[null,"GUANAJUATO","EAMG8704104G8","EAMG870410MGTSRR00","GRECIA ROXANNA ESPARZA MARES","11DPT0006L",0,0,0,1,0,0,0,0,0,0,0,0,0,0,0,0,0,0,36439.56]
[null,"GUANAJUATO","EIMJ880812BK0","EIMJ880812MGTLRH07","JHOANA IVON ELIZALDE MARTINEZ","11DPT0006L",0,0,0,1,0,0,0,0,0,0,0,0,0,0,0,0,0,0,34823.72]
[null,"GUANAJUATO","PAJJ830708SK1","PAJJ830708HQTTMR06","JORGE ADALBERTO PATIÑO JIMENEZ","11DPT0006L",0,0,0,1,0,0,0,0,0,0,0,0,0,0,0,0,0,0,58042.350000000006]
[null,"GUANAJUATO","SIRO600318LE2","SIRO600318HGTRDC04","JOSE OCTAVIO SIERRA RODRIGUEZ","11DPT0006L",0,0,0,1,0,0,0,0,0,0,0,0,0,0,0,0,0,0,90198.399999999994]
[null,"GUANAJUATO","LOAP6711257L7","LOAP671125HGTPGB09","JOSE PABLO LOPEZ AGUIRRE","11DPT0006L",0,0,0,1,0,0,0,0,0,0,0,0,0,0,0,0,0,0,42181.899999999994]
[null,"GUANAJUATO","MAFJ5906036T8","MAFJ590603HGTRRN00","JUAN MANUEL MARTINEZ FRIAS","11DPT0006L",0,0,0,1,0,0,0,0,0,0,0,0,0,0,0,0,0,0,52787.1]
[null,"GUANAJUATO","MOSJ790615LD6","MOSJ790615HGTLNN00","JUAN MOLINA SANCHEZ","11DPT0006L",0,0,0,1,0,0,0,0,0,0,0,0,0,0,0,0,0,0,40653.699999999997]
[null,"GUANAJUATO","YEGL891123ML2","YEGL891123MGTPRR08","LAURA VERONICA YEPEZ GARCIA","11DPT0006L",0,0,0,1,0,0,0,0,0,0,0,0,0,0,0,0,0,0,34383.100000000006]
[null,"GUANAJUATO","AARL760126331","AARL760126HGTLMN06","LEONARDO ALVAREZ ROMO","11DPT0006L",0,0,0,1,0,0,0,0,0,0,0,0,0,0,0,0,0,0,34597.449999999997]
[null,"GUANAJUATO","AARL760126331","AARL760126HGTLMN14","LEONARDO ISRAEL ALVAREZ ROMO","11DPT0006L",0,0,0,1,0,0,0,0,0,0,0,0,0,0,0,0,0,0,9326.6]
[null,"GUANAJUATO","PAHM630123LJ6","PAHM630123HGTNRN05","MANUEL PANTOJA HERRERA","11DPT0006L",0,0,0,1,0,0,0,0,0,0,0,0,0,0,0,0,0,0,138423.48000000001]
[null,"GUANAJUATO","SAMG651113CLA","SAMG651113MGTVDD08","MARIA GUADALUPE SAAVEDRA MEDRANO","11DPT0006L",0,0,0,1,0,0,0,0,0,0,0,0,0,0,0,0,0,0,47200.020000000004]
[null,"GUANAJUATO","HEGN8708165Y4","HEGN870816MGTRRY05","NAYELI HERREJON GUERRERO","11DPT0006L",0,0,0,1,0,0,0,0,0,0,0,0,0,0,0,0,0,0,34072.080000000009]
[null,"GUANAJUATO","GUFO930509HR3","GUFO930509MGTVRL06","OLIVIA GUEVARA FARFAN","11DPT0006L",0,0,0,1,0,0,0,0,0,0,0,0,0,0,0,0,0,0,35869.07]
[null,"GUANAJUATO","COMP630327QN2","COMP630327HGTNRB00","PABLO GERARDO CONTRERAS MARTINEZ","11DPT0006L",0,0,0,1,0,0,0,0,0,0,0,0,0,0,0,0,0,0,138938.46000000002]
[null,"GUANAJUATO","CIGP680809983","CIGP680809HGTDRB07","PABLO MARTIN CID GARCIA","11DPT0006L",0,0,0,1,0,0,0,0,0,0,0,0,0,0,0,0,0,0,125369.7]
[null,"GUANAJUATO","TOMP701231IUA","TOMP701231MGTRJT08","PATRICIA TORRES MEJIA","11DPT0006L",0,0,0,1,0,0,0,0,0,0,0,0,0,0,0,0,0,0,50022.500000000007]
[null,"GUANAJUATO","MOSP780508DF7","MOSP780508HGTLND02","PEDRO MOLINA SANCHEZ","11DPT0006L",0,0,0,1,0,0,0,0,0,0,0,0,0,0,0,0,0,0,47531.810000000005]
[null,"GUANAJUATO","MAZR720405LB8","MAZR720405HMNRTC01","RICARDO MARTINEZ ZETINA","11DPT0006L",0,0,0,1,0,0,0,0,0,0,0,0,0,0,0,0,0,0,27678.32]
[null,"GUANAJUATO","NAVS621206356","NAVS621206MGTVLN00","SANDRA JUANA NAVA VELAZQUEZ","11DPT0006L",0,0,0,1,0,0,0,0,0,0,0,0,0,0,0,0,0,0,89686.399999999994]
[null,"GUANAJUATO","JALS470121DUA","JALS470121HMNMPR04","SERGIO JAIMES LOPEZ","11DPT0006L",0,0,0,0,0,0,0,0,0,0,0,0,0,1,0,0,0,0,97723.59]
[null,"GUANAJUATO","AALS670904235","AALS670904MGTNPL09","SILVIA ANAYA LOPEZ","11DPT0006L",0,0,0,1,0,0,0,0,0,0,0,0,0,0,0,0,0,0,85384.290000000008]
[null,"GUANAJUATO","QUDW870430HH4","QUDW870430MGTNMN07","WENDY YAZMIN QUINTANA DOMINGUEZ","11DPT0006L",0,0,0,1,0,0,0,0,0,0,0,0,0,0,0,0,0,0,43977.270000000004]
[null,"GUANAJUATO","LOLA870110SJ9","LOLA870110MGTPPL02","ALMA ALEJANDRA LOPEZ LOPEZ","11DPT0001Q",0,0,0,1,0,0,0,0,0,0,0,0,0,0,0,0,0,0,70020.31]
[null,"GUANAJUATO","LIRA890608KM8","LIRA890608MGTZZL06","ALMA ROSARIO LIZARRAGA RUIZ","11DPT0001Q",0,0,0,1,0,0,0,0,0,0,0,0,0,0,0,0,0,0,35148.840000000004]
[null,"GUANAJUATO","TIRA931025MA1","TIRA931025MGTRMN09","ANA CECILIA TIERRABLANCA ROMERO","11DPT0001Q",0,0,0,1,0,0,0,0,0,0,0,0,0,0,0,0,0,0,31527.940000000002]
[null,"GUANAJUATO","RIAA790529868","RIAA790529MMNSGN11","ANA KATHERINE RIOS AGUILAR","11DPT0001Q",0,0,0,0,0,0,0,0,0,0,0,0,0,1,0,0,0,0,83101.77]
[null,"GUANAJUATO","EICA780130NQ1","EICA780130MGTSRN03","ANA MARIA ESPINOZA CERVANTES","11DPT0001Q",0,0,0,1,0,0,0,0,0,0,0,0,0,0,0,0,0,0,41086.43]
[null,"GUANAJUATO","MOHA6909151AA","MOHA690915MGTRRN03","ANDREA MORALES HERNANDEZ","11DPT0001Q",0,0,0,1,0,0,0,0,0,0,0,0,0,0,0,0,0,0,37537.600000000006]
[null,"GUANAJUATO","MAGB8208194P2","MAGB820819MGTLRL08","BLANCA ELIA MALDONADO GARCIA","11DPT0001Q",0,0,0,1,0,0,0,0,0,0,0,0,0,0,0,0,0,0,73592.639999999999]
[null,"GUANAJUATO","OAMC600520F43","OAMC600520HSLLLR01","CARLOS JAVIER OLAVEZ MELESIO","11DPT0001Q",0,0,0,1,0,0,0,0,0,0,0,0,0,0,0,0,0,0,52104.12]
[null,"GUANAJUATO","ZALC5604237Q2","ZALC560423HGTVPR01","CARLOS ZAVALA LOPEZ","11DPT0001Q",0,0,0,1,0,0,0,0,0,0,0,0,0,0,0,0,0,0,45415.6]
[null,"GUANAJUATO","GALE770303QD2","GALE770303HGTRSD04","EDUARDO GARCIA LESSO","11DPT0001Q",0,0,0,1,0,0,0,0,0,0,0,0,0,0,0,0,0,0,67212.770000000019]
[null,"GUANAJUATO","RERE8505068T2","RERE850506HMNYMD04","EDUARDO REYES RAMIREZ","11DPT0001Q",0,0,0,1,0,0,0,0,0,0,0,0,0,0,0,0,0,0,35414.78]
[null,"GUANAJUATO","QUGE620101NK4","QUGE620101HGTNRF01","EFRAIN QUINTANA GARCIA","11DPT0001Q",0,0,0,1,0,0,0,0,0,0,0,0,0,0,0,0,0,0,37659.620000000003]
[null,"GUANAJUATO","NIHE721201VC3","NIHE721201HGTTRS04","EUSEBIO MIGUEL ANGEL NIETO HERNANDEZ","11DPT0001Q",0,0,0,1,0,0,0,0,0,0,0,0,0,0,0,0,0,0,37252.250000000007]
[null,"GUANAJUATO","AATE760606N24","AATE760606MGTLNV03","EVA ALMANZA TINOCO","11DPT0001Q",0,0,0,1,0,0,0,0,0,0,0,0,0,0,0,0,0,0,42937.74]
[null,"GUANAJUATO","TOCF910415931","TOCF910415MGTRRT00","FATIMA DEL ROSARIO TORRES CERVANTES","11DPT0001Q",0,0,0,1,0,0,0,0,0,0,0,0,0,0,0,0,0,0,39545.270000000004]
[null,"GUANAJUATO","GOMG8812289D6","GOMG881228HQTMLB01","GABRIEL GOMEZ MOLINERO","11DPT0001Q",0,0,0,1,0,0,0,0,0,0,0,0,0,0,0,0,0,0,67212.770000000019]
[null,"GUANAJUATO","RAAG5908278S6","RAAG590827HMNNBL08","GUILLERMO RANGEL ABURTO","11DPT0001Q",0,0,0,1,0,0,0,0,0,0,0,0,0,0,0,0,0,0,60602.340000000004]
[null,"GUANAJUATO","GAOH8102061G0","GAOH810206HDFLLM04","HUMBERTO ISRAEL GALVAN OLVERA","11DPT0001Q",0,0,0,1,0,0,0,0,0,0,0,0,0,0,0,0,0,0,38595.08]
[null,"GUANAJUATO","JAMJ591122Q73","JAMJ591122HGTRNV07","JAVIER JARALEÑO MANCERA","11DPT0001Q",0,0,0,1,0,0,0,0,0,0,0,0,0,0,0,0,0,0,45577.98]
[null,"GUANAJUATO","BEEJ790327230","BEEJ790327HGTLSN06","JUAN GUSTAVO BELMAN ESPINOSA","11DPT0001Q",0,0,0,1,0,0,0,0,0,0,0,0,0,0,0,0,0,0,38034.550000000003]
[null,"GUANAJUATO","GIAJ670517N7A","GIAJ670517HGTRLN07","JUAN MANUEL GRIMALDO ALFARO","11DPT0001Q",0,0,0,1,0,0,0,0,0,0,0,0,0,0,0,0,0,0,52063.920000000006]
[null,"GUANAJUATO","ROEJ700824751","ROEJ700824HVZMSL05","JULIO CESAR ROMERO ESCOBAR","11DPT0001Q",0,0,0,1,0,0,0,0,0,0,0,0,0,0,0,0,0,0,34910.080000000009]
[null,"GUANAJUATO","GOGK890902JT3","GOGK890902MGTNLR04","KARLA RAFAELA GONZALEZ GALLARDO","11DPT0001Q",0,0,0,1,0,0,0,0,0,0,0,0,0,0,0,0,0,0,79421.709999999992]
[null,"GUANAJUATO","MAGC661126AJ5","MAGC661126MGTLNR18","MA. CARMEN MALDONADO GONZALEZ","11DPT0001Q",0,0,0,1,0,0,0,0,0,0,0,0,0,0,0,0,0,0,123130.63]
[null,"GUANAJUATO","HEMM6706104M9","HEMM670610MGTRNR09","MA. MERCEDES HERRERA MANCERA","11DPT0001Q",0,0,0,1,0,0,0,0,0,0,0,0,0,0,0,0,0,0,132605.65]
[null,"GUANAJUATO","NUBS660923RQA","NUBS660923MGTXRL07","MA. SILVIA NUÑEZ BARRERA","11DPT0001Q",0,0,0,1,0,0,0,0,0,0,0,0,0,0,0,0,0,0,52006.7]
[null,"GUANAJUATO","SAGM730131V93","SAGM730131MDFNRR07","MARCELA SANCHEZ GARCIA","11DPT0001Q",0,0,0,1,0,0,0,0,0,0,0,0,0,0,0,0,0,0,103001.35]
[null,"GUANAJUATO","TEHM7408294G1","TEHM740829HGTLRR02","MARCO ANTONIO TELLEZ HERRERA","11DPT0001Q",0,0,0,1,0,0,0,0,0,0,0,0,0,0,0,0,0,0,32136.820000000003]
[null,"GUANAJUATO","FABC530210FR5","FABC530210MDFRRR00","MARIA DEL CARMEN FRANCO BOURET","11DPT0001Q",0,0,0,1,0,0,0,0,0,0,0,0,0,0,0,0,0,0,47559.22]
[null,"GUANAJUATO","SARR700714SU4","SARR700714MGTCMS06","MARIA DEL ROSARIO SAUCILLO RAMIREZ","11DPT0001Q",0,0,0,1,0,0,0,0,0,0,0,0,0,0,0,0,0,0,75030.289999999994]
[null,"GUANAJUATO","MUSF920131FC2","MUSF920131MGTXCR06","MARIA FERNANDA MUÑOZ SAUCILLO","11DPT0001Q",0,0,0,1,0,0,0,0,0,0,0,0,0,0,0,0,0,0,35624.25]
[null,"GUANAJUATO","CARM520206UK0","CARM520206HGTBCR09","MARIO CABRERA RICO","11DPT0001Q",0,0,0,0,0,0,0,0,0,0,0,0,0,1,0,0,0,0,97723.59]
[null,"GUANAJUATO","GAMM680220L32","GAMM680220MGTLRR01","MARTHA NORMA GALLEGOS MARISCAL","11DPT0001Q",0,0,0,1,0,0,0,0,0,0,0,0,0,0,0,0,0,0,51219.42]
[null,"GUANAJUATO","VAAM631105TU4","VAAM631105HGTLYR06","MARTIN VALENTE AYALA","11DPT0001Q",0,0,0,1,0,0,0,0,0,0,0,0,0,0,0,0,0,0,50844.87000000001]
[null,"GUANAJUATO","BACM8402274W0","BACM840227HGTRNG03","MIGUEL ANGEL BARRON CONEJO","11DPT0001Q",0,0,0,1,0,0,0,0,0,0,0,0,0,0,0,0,0,0,102396.77999999998]
[null,"GUANAJUATO","JOOM700802BM5","JOOM700802HGTYRG06","MIGUEL ANGEL JOYA ORTIZ","11DPT0001Q",0,0,0,1,0,0,0,0,0,0,0,0,0,0,0,0,0,0,126491.48000000001]
[null,"GUANAJUATO","AUDM660425P52","AUDM660425MGTGRR18","MIRIAM AGUILAR DURON","11DPT0001Q",0,0,0,1,0,0,0,0,0,0,0,0,0,0,0,0,0,0,133678.15]
[null,"GUANAJUATO","VEMM8610222D9","VEMM861022MGTRNR00","MIRIAM SOLEDAD VERA MENDIETA","11DPT0001Q",0,0,0,1,0,0,0,0,0,0,0,0,0,0,0,0,0,0,33871.880000000005]
[null,"GUANAJUATO","MEMM740704297","MEMM740704MDFDRR03","MIRNA MEDINA MARIN","11DPT0001Q",0,0,0,1,0,0,0,0,0,0,0,0,0,0,0,0,0,0,40426.839999999997]
[null,"GUANAJUATO","MELN680719F21","MELN680719MGTLDR00","NORMA LETICIA MELGOZA LEDESMA","11DPT0001Q",0,0,0,1,0,0,0,0,0,0,0,0,0,0,0,0,0,0,51537.66]
[null,"GUANAJUATO","RURO710818A13","RURO710818MGTZFL04","OLGA AMALIA RUIZ RUFINO","11DPT0001Q",0,0,0,1,0,0,0,0,0,0,0,0,0,0,0,0,0,0,65608.75]
[null,"GUANAJUATO","MIAO8312189C2","MIAO831218HDFLPM04","OMAR MILLAN APUD","11DPT0001Q",0,0,0,1,0,0,0,0,0,0,0,0,0,0,0,0,0,0,69344.3]
[null,"GUANAJUATO","PIOP550618BT2","PIOP550618HGTCLB08","PABLO PICHARDO OLVERA","11DPT0001Q",0,0,0,1,0,0,0,0,0,0,0,0,0,0,0,0,0,0,61578.41]
[null,"GUANAJUATO","GAAR6310249B2","GAAR631024HGTLRF01","RAFAEL GALLEGOS ARELLANO","11DPT0001Q",0,0,0,1,0,0,0,0,0,0,0,0,0,0,0,0,0,0,59264.160000000003]
[null,"GUANAJUATO","ROPR4911033YA","ROPR491103HGTDTF04","RAFAEL RODRIGUEZ PATIÑO","11DPT0001Q",0,0,0,1,0,0,0,0,0,0,0,0,0,0,0,0,0,0,40833.58]
[null,"GUANAJUATO","ROMR681004UF2","ROMR681004HGTDRM02","RAMIRO RODRIGUEZ MARTINEZ","11DPT0001Q",0,0,0,1,0,0,0,0,0,0,0,0,0,0,0,0,0,0,58778.140000000007]
[null,"GUANAJUATO","BAUR7105213K8","BAUR710521MDFRRT02","RITA BARCENAS URBINA","11DPT0001Q",0,0,0,1,0,0,0,0,0,0,0,0,0,0,0,0,0,0,59123.090000000011]
[null,"GUANAJUATO","VEGR631014AK5","VEGR631014HGTLRB01","RUBEN VELAZQUEZ GARCIA","11DPT0001Q",0,0,0,1,0,0,0,0,0,0,0,0,0,0,0,0,0,0,43587.97]
[null,"GUANAJUATO","ROHR681221N53","ROHR681221MGTJRB00","RUBISELA ROJAS HUARACHA","11DPT0001Q",0,0,0,1,0,0,0,0,0,0,0,0,0,0,0,0,0,0,88339.4]
[null,"GUANAJUATO","TOSS530312KL6","TOSS530312HDFRMM05","SAMUEL TORRES SUMOZA","11DPT0001Q",0,0,0,1,0,0,0,0,0,0,0,0,0,0,0,0,0,0,36549.5]
[null,"GUANAJUATO","PACS810122DT6","PACS810122MGTLRR02","SARA PALOMINO CARREÑO","11DPT0001Q",0,0,0,1,0,0,0,0,0,0,0,0,0,0,0,0,0,0,33266.339999999997]
[null,"GUANAJUATO","CEFS680324L40","CEFS680324HJCRLL06","SAUL CERPA FLORES","11DPT0001Q",0,0,0,1,0,0,0,0,0,0,0,0,0,0,0,0,0,0,38528.43]
[null,"GUANAJUATO","CAGT7903078F3","CAGT790307HGTMRM01","TOMAS ESTEBAN CAMACHO GARCIA","11DPT0001Q",0,0,0,1,0,0,0,0,0,0,0,0,0,0,0,0,0,0,31846.530000000002]
[null,"GUANAJUATO","ROBY7612249Q3","ROBY761224MMCDCN00","YUNUEN RODRIGUEZ BECERRA","11DPT0001Q",0,0,0,1,0,0,0,0,0,0,0,0,0,0,0,0,0,0,42833.740000000005]
[null,"GUANAJUATO","ROZA560516SE3","ROZA560516HGTJPB08","ABEL ROJAS ZAPATERO","11DPT0008J",0,0,0,1,0,0,0,0,0,0,0,0,0,0,0,0,0,0,65429.920000000006]
[null,"GUANAJUATO","RACA8011159T0","RACA801115MGTMRD05","ADELA RAMIREZ CERRITOS","11DPT0008J",0,0,0,1,0,0,0,0,0,0,0,0,0,0,0,0,0,0,38025.68]
[null,"GUANAJUATO","COVA700831PW6","COVA700831MGRNRM03","AMADA CONDE VERA","11DPT0008J",0,0,0,1,0,0,0,0,0,0,0,0,0,0,0,0,0,0,60933.820000000014]
[null,"GUANAJUATO","SABA620417HF9","SABA620417HVZNTN05","ANICETO SANTIAGO BAUTISTA","11DPT0008J",0,0,0,1,0,0,0,0,0,0,0,0,0,0,0,0,0,0,137419.64000000001]
[null,"GUANAJUATO","ROVA500401GUA","ROVA500401HGTJLR05","ARTURO ROJAS VALENCIA","11DPT0008J",0,0,0,1,0,0,0,0,0,0,0,0,0,0,0,0,0,0,43545.020000000004]
[null,"GUANAJUATO","LAVD841123J58","LAVD841123HGTGRN02","DANIEL LAGUNA VARGAS","11DPT0008J",0,0,0,1,0,0,0,0,0,0,0,0,0,0,0,0,0,0,33069.880000000005]
[null,"GUANAJUATO","RASE540830U28","RASE540830HGTYLL02","ELEAZAR RAYAS SILVA","11DPT0008J",0,0,0,1,0,0,0,0,0,0,0,0,0,0,0,0,0,0,52205.210000000006]
[null,"GUANAJUATO","JACF700609GI1","JACF700609HGTRML07","FELIPE JARAMILLO CAMPOS","11DPT0008J",0,0,0,1,0,0,0,0,0,0,0,0,0,0,0,0,0,0,36502.080000000002]
[null,"GUANAJUATO","COVF720114623","COVF720114HGTNRR02","FRANCISCO JAVIER CONDE VERA","11DPT0008J",0,0,0,1,0,0,0,0,0,0,0,0,0,0,0,0,0,0,34521.310000000005]
[null,"GUANAJUATO","RAFG691106392","RAFG691106HGTMRR04","GERARDO RAMIREZ FERNANDEZ","11DPT0008J",0,0,0,0,0,0,0,0,0,0,0,0,0,1,0,0,0,0,95731.82]
[null,"GUANAJUATO","CUMG550523TM9","CUMG550523MDFRRL06","GLORIA ARACELI CRUZ MARTIN DEL CAMPO","11DPT0008J",0,0,0,0,0,0,0,0,0,0,0,0,0,1,0,0,0,0,26272.400000000001]
[null,"GUANAJUATO","GOCH8410237R3","GOCH841023HGTNBC04","HECTOR HUGO GONZALEZ CABRERA","11DPT0008J",0,0,0,1,0,0,0,0,0,0,0,0,0,0,0,0,0,0,34558.000000000007]
[null,"GUANAJUATO","ROHH851230UU9","ROHH851230HGTJRR04","HERNAN ROJAS HERNANDEZ","11DPT0008J",0,0,0,1,0,0,0,0,0,0,0,0,0,0,0,0,0,0,34249.880000000005]
[null,"GUANAJUATO","MOFD480314HT2","MOFD480314HGTRLL00","JOSE DOLORES MORALES FLORES","11DPT0008J",0,0,0,1,0,0,0,0,0,0,0,0,0,0,0,0,0,0,45326.239999999998]
[null,"GUANAJUATO","ROGJ7905253Y5","ROGJ790525HPLJDN05","JOSE JUAN ROJAS GODOY","11DPT0008J",0,0,0,1,0,0,0,0,0,0,0,0,0,0,0,0,0,0,123072.39000000001]
[null,"GUANAJUATO","RASJ781020U88","RASJ781020MGTZSS02","JOSEFINA RAZO SOSA","11DPT0008J",0,0,0,1,0,0,0,0,0,0,0,0,0,0,0,0,0,0,88029.39]
[null,"GUANAJUATO","BARJ8305267S1","BARJ830526HGTRYN02","JUAN ANGEL BRAVO REYES","11DPT0008J",0,0,0,1,0,0,0,0,0,0,0,0,0,0,0,0,0,0,64647.68]
[null,"GUANAJUATO","FOJU6701074Z1","FOXJ670107HGTLXN09","JUAN ANTONIO FLORES","11DPT0008J",0,0,0,1,0,0,0,0,0,0,0,0,0,0,0,0,0,0,85834.46]
[null,"GUANAJUATO","MELJ7904219Z8","MELJ790421HGTLDN03","JUAN MAURICIO MELGOZA LEDESMA","11DPT0008J",0,0,0,1,0,0,0,0,0,0,0,0,0,0,0,0,0,0,42880.78]
[null,"GUANAJUATO","OETL661122IZ6","OETL661122MGTRRZ06","LUZ CECILIA ORTEGA TORRES","11DPT0008J",0,0,0,1,0,0,0,0,0,0,0,0,0,0,0,0,0,0,70533.78]
[null,"GUANAJUATO","AAOL550422TB5","AAOL550422MGTRRZ00","LUZ VERONICA ARANDA OROZCO","11DPT0008J",0,0,0,0,0,0,0,0,0,0,0,0,0,1,0,0,0,0,34906.930000000008]
[null,"GUANAJUATO","AEAC630530Q21","AEAC630530MGTLLN08","MA. CONCEPCION ALEJOS ALONSO","11DPT0008J",0,0,0,1,0,0,0,0,0,0,0,0,0,0,0,0,0,0,85151.889999999985]
[null,"GUANAJUATO","LAVA8108019Q9","LAVA810801MGTGRN09","MARIA DE LOS ANGELES LAGUNA VARGAS","11DPT0008J",0,0,0,1,0,0,0,0,0,0,0,0,0,0,0,0,0,0,123156.93000000002]
[null,"GUANAJUATO","ROCS8704055G4","ROCS870405MMCDSL06","MARIA DEL SOL RODRIGUEZ CASTRO","11DPT0008J",0,0,0,1,0,0,0,0,0,0,0,0,0,0,0,0,0,0,73879.87999999999]
[null,"GUANAJUATO","PACM941015U40","PACM941015MGTLRR06","MARIANA PALOMINO CARREÑO","11DPT0008J",0,0,0,1,0,0,0,0,0,0,0,0,0,0,0,0,0,0,34059.430000000008]
[null,"GUANAJUATO","VIVM841025NR4","VIVM841025MGTLRL07","MELINA VILLARREAL VARGAS","11DPT0008J",0,0,0,1,0,0,0,0,0,0,0,0,0,0,0,0,0,0,100832.71]
[null,"GUANAJUATO","CAAO740517PC6","CAAO740517HGTMRC05","OCTAVIANO CAMPOS ARRIAGA","11DPT0008J",0,0,0,1,0,0,0,0,0,0,0,0,0,0,0,0,0,0,84832.46]
[null,"GUANAJUATO","BAJR800429CA7","BAJR800429MGTLRC00","ROCIO BALDERAS JUAREZ","11DPT0008J",0,0,0,1,0,0,0,0,0,0,0,0,0,0,0,0,0,0,46155.570000000007]
[null,"GUANAJUATO","GUTR690427DSA","GUTR690427MDFPRC02","ROCIO GUAPO TORRECILLAS","11DPT0008J",0,0,0,1,0,0,0,0,0,0,0,0,0,0,0,0,0,0,50360.260000000009]
[null,"GUANAJUATO","SALS651213I40","SALS651213MGTNNN03","SANJUANA SANCHEZ LUNA","11DPT0008J",0,0,0,1,0,0,0,0,0,0,0,0,0,0,0,0,0,0,53388.33]
[null,"GUANAJUATO","NUCS580811UI9","NUCS580811MGTXRS04","SUSANA NUÑEZ CERRITOS","11DPT0008J",0,0,0,1,0,0,0,0,0,0,0,0,0,0,0,0,0,0,47282.909999999996]
[null,"GUANAJUATO","EICT8203073V8","EICT820307HGTSRM05","TOMAS ROGELIO ESPINOZA CERVANTES","11DPT0008J",0,0,0,1,0,0,0,0,0,0,0,0,0,0,0,0,0,0,45027.64]
[null,"GUANAJUATO","GAFV6609298F9","GAFV660929MGTRRR06","VERONICA ROCIO GRANADOS FRIAS","11DPT0008J",0,0,0,1,0,0,0,0,0,0,0,0,0,0,0,0,0,0,47238.2]
[null,"GUANAJUATO","ROSA621019UW4","ROSA621019HGTDNG01","AGAPITO RODRIGUEZ SANCHEZ","11DPT0002P",0,0,0,1,0,0,0,0,0,0,0,0,0,0,0,0,0,0,50206.020000000004]
[null,"GUANAJUATO","SARA881017KA5","SARA881017HGTNXL07","ALBERTO ALEXANDRO SANTILLAN REA","11DPT0002P",0,0,0,1,0,0,0,0,0,0,0,0,0,0,0,0,0,0,33909.64]
[null,"GUANAJUATO","CAGX680903LH5","CXGA680903HGTHNL08","ALBERTO CHAO GONZALEZ","11DPT0002P",0,0,0,0,0,0,0,0,0,0,0,0,0,1,0,0,0,0,97723.59]
[null,"GUANAJUATO","GUAA600320L51","GUAA600320MGTTLL03","ALEJANDRA GUTIERREZ ALVAREZ","11DPT0002P",0,0,0,1,0,0,0,0,0,0,0,0,0,0,0,0,0,0,46338.22]
[null,"GUANAJUATO","COCA760915JU4","COCA760915HGTRLL02","ALEJANDRO CORIA CALDERON","11DPT0002P",0,0,0,1,0,0,0,0,0,0,0,0,0,0,0,0,0,0,36927.5]
[null,"GUANAJUATO","DONA780620F80","DONA780620HGTMTL04","ALEJANDRO DOMINGUEZ NIETO","11DPT0002P",0,0,0,1,0,0,0,0,0,0,0,0,0,0,0,0,0,0,33069.880000000005]
[null,"GUANAJUATO","VAEA7904041V2","VAEA790404HGTLLL05","ALEJANDRO VALADEZ ELIAS","11DPT0002P",0,0,0,1,0,0,0,0,0,0,0,0,0,0,0,0,0,0,35573.42]
[null,"GUANAJUATO","ROBA710226BG0","RXBA710226MGTBRL07","ALMA ROBLES BRAVO","11DPT0002P",0,0,0,1,0,0,0,0,0,0,0,0,0,0,0,0,0,0,45579.540000000008]
[null,"GUANAJUATO","CUHC5501119F9","CUHC550111HGTLNS08","CESAR CUELLAR HINOJOSA","11DPT0002P",0,0,0,1,0,0,0,0,0,0,0,0,0,0,0,0,0,0,48366.33]
[null,"GUANAJUATO","BERC880813NK7","BERC880813MGTLMN05","CINDIA ELIZABETH BELTRAN RAMOS","11DPT0002P",0,0,0,1,0,0,0,0,0,0,0,0,0,0,0,0,0,0,49125.479999999996]
[null,"GUANAJUATO","HEGC870427C96","HEGC870427HCSRNR00","CRISTOBAL DE JESUS HERNANDEZ GONZALEZ","11DPT0002P",0,0,0,1,0,0,0,0,0,0,0,0,0,0,0,0,0,0,33069.880000000005]
[null,"GUANAJUATO","MOFD741006FM4","MOFD741006HGTSLV05","DAVID MOSQUEDA FLORES","11DPT0002P",0,0,0,1,0,0,0,0,0,0,0,0,0,0,0,0,0,0,44348.71]
[null,"GUANAJUATO","MEAE910606I30","MEAE910606HGTJGD01","EDGAR EMMANUEL MEJIA AGUILA","11DPT0002P",0,0,0,1,0,0,0,0,0,0,0,0,0,0,0,0,0,0,34189.56]
[null,"GUANAJUATO","CIEE710907TK8","CIEE710907HDFSSD04","EDUARDO ALEJANDRO CISNEROS ESPINOZA","11DPT0002P",0,0,0,1,0,0,0,0,0,0,0,0,0,0,0,0,0,0,33069.880000000005]
[null,"GUANAJUATO","JUHF791105831","JUHF791105HDFRLR06","FERNANDO JUAREZ HELGUERA","11DPT0002P",0,0,0,1,0,0,0,0,0,0,0,0,0,0,0,0,0,0,33277.230000000003]
[null,"GUANAJUATO","GATG451128UX1","GATG451128HDFYRS05","GUSTAVO GAYTAN TORRES","11DPT0002P",0,0,0,1,0,0,0,0,0,0,0,0,0,0,0,0,0,0,102396.77999999998]
[null,"GUANAJUATO","MABH800524BY7","MABH800524HMNRRG02","HUGO MARTINEZ BARRERA","11DPT0002P",0,0,0,1,0,0,0,0,0,0,0,0,0,0,0,0,0,0,102396.77999999998]
[null,"GUANAJUATO","CASI750121969","CASI750121HGTSNS13","ISAAC CASTRO SANTILLANES","11DPT0002P",0,0,0,1,0,0,0,0,0,0,0,0,0,0,0,0,0,0,47220.119999999995]
[null,"GUANAJUATO","VEGJ461124SB6","VEGG461124HGTLLD01","J. GUADALUPE VELAZQUEZ GALLARDO","11DPT0002P",0,0,0,1,0,0,0,0,0,0,0,0,0,0,0,0,0,0,47960.38]
[null,"GUANAJUATO","SASJ650121CF2","SAST650121HGTNMR00","J. TRINIDAD SANCHEZ SAMANO","11DPT0002P",0,0,0,1,0,0,0,0,0,0,0,0,0,0,0,0,0,0,77339.209999999992]
[null,"GUANAJUATO","MADJ760413GFA","MADJ760413HGTTZQ01","JOAQUIN MATA DIAZ","11DPT0002P",0,0,0,1,0,0,0,0,0,0,0,0,0,0,0,0,0,0,45334.409999999996]
[null,"GUANAJUATO","LAMA800707D83","LAMA800707HGTRRL05","JOSE ALEJANDRO LARA MERCADO","11DPT0002P",0,0,0,1,0,0,0,0,0,0,0,0,0,0,0,0,0,0,37281.620000000003]
[null,"GUANAJUATO","DEJA790116DM3","DEJA790116HMCLMN00","JOSE ANTONIO DELGADO JIMENEZ","11DPT0002P",0,0,0,1,0,0,0,0,0,0,0,0,0,0,0,0,0,0,122951.46000000002]
[null,"GUANAJUATO","SAVJ890118LK2","SAVJ890118HGTNZS05","JOSE DE JESUS SANCHEZ VAZQUEZ","11DPT0002P",0,0,0,1,0,0,0,0,0,0,0,0,0,0,0,0,0,0,38198.410000000003]
[null,"GUANAJUATO","MADM900319GN9","MADM900319HGTTZN05","JOSE MANUEL MATA DIAZ","11DPT0002P",0,0,0,1,0,0,0,0,0,0,0,0,0,0,0,0,0,0,33069.880000000005]
[null,"GUANAJUATO","GAHJ561230M55","GAHJ561230HGTRRN04","JUAN GRANADOS HERNANDEZ","11DPT0002P",0,0,0,1,0,0,0,0,0,0,0,0,0,0,0,0,0,0,121742.39999999999]
[null,"GUANAJUATO","MEVJ760816A58","MEVJ760816HGTJLL19","JULIO ENRIQUE MEJIA VILLANUEVA","11DPT0002P",0,0,0,1,0,0,0,0,0,0,0,0,0,0,0,0,0,0,126657.16]
[null,"GUANAJUATO","RAHL900721A16","RAHL900721MGTNRL09","LILIANA BERENICE RANGEL HERNANDEZ","11DPT0002P",0,0,0,1,0,0,0,0,0,0,0,0,0,0,0,0,0,0,31222.110000000004]
[null,"GUANAJUATO","SAHL6309234X5","SAHL630923HGTNRS00","LUIS MIGUEL SANCHEZ HERNANDEZ","11DPT0002P",0,0,0,1,0,0,0,0,0,0,0,0,0,0,0,0,0,0,94034.34]
[null,"GUANAJUATO","SALM811102IP0","SALG811102MGTNGD00","MA. GUADALUPE SANCHEZ LAGUNA","11DPT0002P",0,0,0,1,0,0,0,0,0,0,0,0,0,0,0,0,0,0,67212.770000000019]
[null,"GUANAJUATO","SAHI6701211M4","SAHI670121MGTNRN07","MA. INES SANDOVAL HERNANDEZ","11DPT0002P",0,0,0,1,0,0,0,0,0,0,0,0,0,0,0,0,0,0,80145.75]
[null,"GUANAJUATO","CAVM730609CSA","CAVT730609MGTRRR04","MA. TERESA CARPIO VARGAS","11DPT0002P",0,0,0,1,0,0,0,0,0,0,0,0,0,0,0,0,0,0,50110.590000000004]
[null,"GUANAJUATO","MACP790228577","MACP790228MGTRSL06","MARIA DEL PILAR MARTINEZ CASTRO","11DPT0002P",0,0,0,1,0,0,0,0,0,0,0,0,0,0,0,0,0,0,35878.46]
[null,"GUANAJUATO","GOGF910421775","GOGF910421MGTNLR03","MARIA FERNANDA GONZALEZ GALLARDO","11DPT0002P",0,0,0,1,0,0,0,0,0,0,0,0,0,0,0,0,0,0,34558.000000000007]
[null,"GUANAJUATO","EIPM591011QG5","EIPM591011MGTSRR09","MARTHA ALICIA ESPINOSA PEREZ","11DPT0002P",0,0,0,1,0,0,0,0,0,0,0,0,0,0,0,0,0,0,118347.80000000002]
[null,"GUANAJUATO","GOGM920808LU4","GOGM920808MGTNNR00","MARTHA ELENA GONZALEZ GONZALEZ","11DPT0002P",0,0,0,1,0,0,0,0,0,0,0,0,0,0,0,0,0,0,10979.7]
[null,"GUANAJUATO","DEHM860518J96","DEHM860518HMCLRG02","MIGUEL ANGEL DELGADO HERNANDEZ","11DPT0002P",0,0,0,1,0,0,0,0,0,0,0,0,0,0,0,0,0,0,38856.69]
[null,"GUANAJUATO","GULM790929U80","GULM790929HGTRGG04","MIGUEL ANGEL GUERRERO LAGUNA","11DPT0002P",0,0,0,1,0,0,0,0,0,0,0,0,0,0,0,0,0,0,44135.29]
[null,"GUANAJUATO","PALM711130LV9","PALM711130HGTRGG02","MIGUEL ANGEL PARAMO LAGUNA","11DPT0002P",0,0,0,1,0,0,0,0,0,0,0,0,0,0,0,0,0,0,45843.9]
[null,"GUANAJUATO","LOBM750809KY1","LOBM750809HGTPRG01","MIGUEL LOPEZ BARRAGAN","11DPT0002P",0,0,0,1,0,0,0,0,0,0,0,0,0,0,0,0,0,0,37410.39]
[null,"GUANAJUATO","SACM851223UV7","SACM851223MDFNSN01","MONSERRAT SANCHEZ CISNEROS","11DPT0002P",0,0,0,1,0,0,0,0,0,0,0,0,0,0,0,0,0,0,33423.090000000004]
[null,"GUANAJUATO","AARM7802157H4","AARM780215MGTLDY03","MYRIAM DEL ROSARIO ALVARADO RODRIGUEZ","11DPT0002P",0,0,0,1,0,0,0,0,0,0,0,0,0,0,0,0,0,0,32691.880000000005]
[null,"GUANAJUATO","CAPR810416EKA","CAPR810416HGTLRB07","ROBERTO CALDERON PEREZ","11DPT0002P",0,0,0,1,0,0,0,0,0,0,0,0,0,0,0,0,0,0,73552.81]
[null,"GUANAJUATO","SAGS78112652A","SAGS781126HGTLTS16","SASHA EMMANUEL SALINAS GUTIERREZ","11DPT0002P",0,0,0,1,0,0,0,0,0,0,0,0,0,0,0,0,0,0,38207.410000000003]
[null,"GUANAJUATO","CUVY830805JA3","CUVY830805MGTSRH00","YAHAIRA ALICIA ELENA CUESTAS VARGAS","11DPT0002P",0,0,0,1,0,0,0,0,0,0,0,0,0,0,0,0,0,0,32603.350000000006]
[null,"GUANAJUATO","MOFY680125UV7","MOFY680125MGTSLL00","YOLANDA MOSQUEDA FLORES","11DPT0002P",0,0,0,1,0,0,0,0,0,0,0,0,0,0,0,0,0,0,49557.880000000005]
[null,"GUANAJUATO","RODY660703MQ8","RODY660703MGTXLL07","YOLANDA ROA DELGADO","11DPT0002P",0,0,0,1,0,0,0,0,0,0,0,0,0,0,0,0,0,0,86424.959999999992]
[null,"GUANAJUATO","PAPA810618AR6","PAPA810618HGTLLB03","ABRAHAM PALACIOS PALACIOS","11DPT0003O",0,0,0,1,0,0,0,0,0,0,0,0,0,0,0,0,0,0,35708.979999999996]
[null,"GUANAJUATO","CALA611023U79","CALA611023MZSRZD15","ADRIANA CARDENAS LOZA","11DPT0003O",0,0,0,1,0,0,0,0,0,0,0,0,0,0,0,0,0,0,121742.39999999999]
[null,"GUANAJUATO","FOSA610902SG9","FOSA610902MGTLNL09","ALEJANDRA PATRICIA FLORES SANDOVAL","11DPT0003O",0,0,0,1,0,0,0,0,0,0,0,0,0,0,0,0,0,0,89196.46]
[null,"GUANAJUATO","NIRA700123GK9","NIRA700123MGTTVN01","ANA LAURA NIETO RIVERA","11DPT0003O",0,0,0,1,0,0,0,0,0,0,0,0,0,0,0,0,0,0,131213.70000000001]
[null,"GUANAJUATO","HEHA900701U81","HEHA900701MGTRRN03","ANA LETICIA HERNANDEZ HERRERA","11DPT0003O",0,0,0,1,0,0,0,0,0,0,0,0,0,0,0,0,0,0,35759.210000000006]
[null,"GUANAJUATO","NAME6411037H1","NAME641103MDFVDV03","EVA NAVARRO MADRIGAL","11DPT0003O",0,0,0,1,0,0,0,0,0,0,0,0,0,0,0,0,0,0,39298.230000000003]
[null,"GUANAJUATO","RARE590716V64","RARE590716MJCMMV05","EVELIA DEL CARMEN RAMIREZ RAMIREZ","11DPT0003O",0,0,0,1,0,0,0,0,0,0,0,0,0,0,0,0,0,0,54554.920000000006]
[null,"GUANAJUATO","CACF600221UD2","CACF600221HSPMSR07","FORTUNATO CAMACHO CASTILLO","11DPT0003O",0,0,0,1,0,0,0,0,0,0,0,0,0,0,0,0,0,0,36280.160000000003]
[null,"GUANAJUATO","GAGH790601EB0","GAGH790601HGTYNC00","HECTOR ALFONSO GAYTAN GONZALEZ","11DPT0003O",0,0,0,1,0,0,0,0,0,0,0,0,0,0,0,0,0,0,7319.8]
[null,"GUANAJUATO","HECH720907NC1","HECH720907MDFRNL01","HILDA HERNANDEZ CANCHOLA","11DPT0003O",0,0,0,1,0,0,0,0,0,0,0,0,0,0,0,0,0,0,35421.22]
[null,"GUANAJUATO","ROVJ5612313Z1","ROVS561231HGTBNL05","J. SILVESTRE ROBLEDO VENEGAS","11DPT0003O",0,0,0,1,0,0,0,0,0,0,0,0,0,0,0,0,0,0,65444.110000000008]
[null,"GUANAJUATO","AEGJ5311191A4","AEGJ531119HGTSRR09","JORGE ASCENCIO GARCIA","11DPT0003O",0,0,0,1,0,0,0,0,0,0,0,0,0,0,0,0,0,0,44148.97]
[null,"GUANAJUATO","GARJ690126G3A","GARJ690126HQTRVN01","JOSE JUAN GARCIA RIVERA","11DPT0003O",0,0,0,1,0,0,0,0,0,0,0,0,0,0,0,0,0,0,34579.210000000006]
[null,"GUANAJUATO","MAMJ620217DW9","MAMJ620217HGTRNN03","JUAN ANTONIO MARTINEZ MONCIBAIS","11DPT0003O",0,0,0,1,0,0,0,0,0,0,0,0,0,0,0,0,0,0,94852.4]
[null,"GUANAJUATO","GALJ930324KX8","GALJ930324HGTRPN06","JUAN CARLOS GARCIA LOPEZ","11DPT0003O",0,0,0,1,0,0,0,0,0,0,0,0,0,0,0,0,0,0,35573.42]
[null,"GUANAJUATO","ROGJ631018GD6","ROGJ631018HGTMRN04","JUAN JOSE ROMERO GARCIA","11DPT0003O",0,0,0,1,0,0,0,0,0,0,0,0,0,0,0,0,0,0,50957.510000000009]
[null,"GUANAJUATO","RORJ800328CB1","RORJ800328HGTDMN01","JUAN PABLO RODRIGUEZ RAMIREZ","11DPT0003O",0,0,0,1,0,0,0,0,0,0,0,0,0,0,0,0,0,0,40701.449999999997]
[null,"GUANAJUATO","HECL6401228X2","HECL640122MDFRLT03","LETICIA HERNANDEZ CALVILLO","11DPT0003O",0,0,0,1,0,0,0,0,0,0,0,0,0,0,0,0,0,0,49623.990000000005]
[null,"GUANAJUATO","JIOL8008248F7","JIOL800824MGTMRZ11","LIZETH ARIADNA JIMENEZ ORTEGA","11DPT0003O",0,0,0,1,0,0,0,0,0,0,0,0,0,0,0,0,0,0,81511.810000000012]
[null,"GUANAJUATO","ROFL910916ES9","ROFL910916MGTBNR05","LORENA ROBLEDO FONSECA","11DPT0003O",0,0,0,1,0,0,0,0,0,0,0,0,0,0,0,0,0,0,32213.110000000004]
[null,"GUANAJUATO","SAML830406CC2","SAML830406HDFNNS01","LUIS ENRIQUE SANCHEZ MENDOZA","11DPT0003O",0,0,0,1,0,0,0,0,0,0,0,0,0,0,0,0,0,0,89392.36]
[null,"GUANAJUATO","GOML690426EW2","GOML690426MGTNDZ08","LUZ ESTELA GONZALEZ MEDINA","11DPT0003O",0,0,0,1,0,0,0,0,0,0,0,0,0,0,0,0,0,0,87838.399999999994]
[null,"GUANAJUATO","BUSG720302VE9","BUSG720302MGTLND02","MA GUADALUPE BULLONS SANTIAGO","11DPT0003O",0,0,0,1,0,0,0,0,0,0,0,0,0,0,0,0,0,0,43763.3]
[null,"GUANAJUATO","AOVP751006KA9","AOVP751006MGTLLL04","MA. DEL PILAR ALMONACI VALADEZ","11DPT0003O",0,0,0,1,0,0,0,0,0,0,0,0,0,0,0,0,0,0,86853.37]
[null,"GUANAJUATO","OIOM621117BE8","OIOM621117HGTLLN02","MANUEL MARTIN OLIVA OLIVA","11DPT0003O",0,0,0,1,0,0,0,0,0,0,0,0,0,0,0,0,0,0,57207.340000000004]
[null,"GUANAJUATO","FAAF540219KI2","FAAF540219MGTRGX06","MARIA FE FRAUSTO AGUILAR","11DPT0003O",0,0,0,1,0,0,0,0,0,0,0,0,0,0,0,0,0,0,54435.900000000009]
[null,"GUANAJUATO","HEFM781229PE6","HEFM781229MGTRRL06","MARIA MILAGROS HERNANDEZ FRAUSTO","11DPT0003O",0,0,0,1,0,0,0,0,0,0,0,0,0,0,0,0,0,0,37138.949999999997]
[null,"GUANAJUATO","CAGM670126RV9","CAGM670126MGTHNR09","MARTHA DELIA CHAVEZ GONZALEZ","11DPT0003O",0,0,0,1,0,0,0,0,0,0,0,0,0,0,0,0,0,0,121742.39999999999]
[null,"GUANAJUATO","TAPM7310026U1","TAPM731002HDFRSG06","MIGUEL ANGEL TAURINO PASTEN","11DPT0003O",0,0,0,1,0,0,0,0,0,0,0,0,0,0,0,0,0,0,39152.32]
[null,"GUANAJUATO","LEOL8201231V2","LEXO820123MGTNXL07","OLGALIDIA . LEON","11DPT0003O",0,0,0,1,0,0,0,0,0,0,0,0,0,0,0,0,0,0,23490.14]
[null,"GUANAJUATO","GOPP5010306G6","GOPP501030HGTNRD05","PEDRO GONZALEZ PORTILLO","11DPT0003O",0,0,0,1,0,0,0,0,0,0,0,0,0,0,0,0,0,0,51959.590000000004]
[null,"GUANAJUATO","RARR701207IA9","RARR701207MDFMMT08","RITA RAMIREZ RAMIREZ","11DPT0003O",0,0,0,1,0,0,0,0,0,0,0,0,0,0,0,0,0,0,45185.599999999999]
[null,"GUANAJUATO","MALR690904B5A","MALR690904MGTRPS03","ROSA EUGENIA MARTINEZ LOPEZ","11DPT0003O",0,0,0,1,0,0,0,0,0,0,0,0,0,0,0,0,0,0,50661.280000000006]
[null,"GUANAJUATO","GOPR8103287J3","GOPR810328HDFMRB09","RUBEN GOMEZ PORTILLA","11DPT0003O",0,0,0,0,0,0,0,0,0,0,0,0,0,1,0,0,0,0,97723.59]
[null,"GUANAJUATO","DAFT8701278E1","DAFT870127MZSVLN04","TANIA LIZETH DAVILA FLORES","11DPT0003O",0,0,0,1,0,0,0,0,0,0,0,0,0,0,0,0,0,0,36343.259999999995]
[null,"GUANAJUATO","GUFV820306TSA","GUFV820306HGRZLC04","VICTOR MANUEL GUZMAN FLORES","11DPT0003O",0,0,0,1,0,0,0,0,0,0,0,0,0,0,0,0,0,0,110860.50000000001]
[null,"GUANAJUATO","MORA580316U78","MORA580316HGTJML06","ALEJANDRO MOJICA RAMIREZ","11DPT0007K",0,0,0,1,0,0,0,0,0,0,0,0,0,0,0,0,0,0,50777.880000000005]
[null,"GUANAJUATO","BAPA711019KLA","BAPA711019MGTRRN03","ANA LOURDES BARAJAS PEREZ","11DPT0007K",0,0,0,1,0,0,0,0,0,0,0,0,0,0,0,0,0,0,87325.299999999988]
[null,"GUANAJUATO","CEVB731120C46","CEVB731120HGTDRR00","BERNARDO CEDILLO VERA","11DPT0007K",0,0,0,1,0,0,0,0,0,0,0,0,0,0,0,0,0,0,37098.340000000004]
[null,"GUANAJUATO","IAVC761114FE1","IAVC761114MNTBLL00","CLAUDIA ELIZABETH IBARRA VILLANUEVA","11DPT0007K",0,0,0,1,0,0,0,0,0,0,0,0,0,0,0,0,0,0,120130.24000000001]
[null,"GUANAJUATO","JAMC821119QK9","JAMC821119MGTMSL07","CLAUDIA MARCELA JAIME MOSQUEDA","11DPT0007K",0,0,0,1,0,0,0,0,0,0,0,0,0,0,0,0,0,0,38944.620000000003]
[null,"GUANAJUATO","GUGE730901EC4","GUGE730901MGTTNS07","ESPERANZA GUTIERREZ GONZALEZ","11DPT0007K",0,0,0,1,0,0,0,0,0,0,0,0,0,0,0,0,0,0,48554.45]
[null,"GUANAJUATO","MAGF780719PC1","MAGF780719MGTRNT03","FATIMA MARTINEZ GONZALEZ","11DPT0007K",0,0,0,1,0,0,0,0,0,0,0,0,0,0,0,0,0,0,32691.880000000005]
[null,"GUANAJUATO","ROGF800428M80","ROGF800428HGTDZD06","FIDEL RODRIGUEZ GUZMAN","11DPT0007K",0,0,0,1,0,0,0,0,0,0,0,0,0,0,0,0,0,0,59830.910000000011]
[null,"GUANAJUATO","CAUF560705QGA","CAUF560705HGTHRL05","FILOMENO CHAGOYA URRUTIA","11DPT0007K",0,0,0,1,0,0,0,0,0,0,0,0,0,0,0,0,0,0,44658.46]
[null,"GUANAJUATO","SAGG7304218VA","SAGG730421MGTNLL02","GLORIA SANCHEZ GALVAN","11DPT0007K",0,0,0,1,0,0,0,0,0,0,0,0,0,0,0,0,0,0,48335.810000000005]
[null,"GUANAJUATO","CADG5812029W6","CADG581202MGTHLR09","GRACIELA CHAVEZ DELGADO","11DPT0007K",0,0,0,1,0,0,0,0,0,0,0,0,0,0,0,0,0,0,53563.83]
[null,"GUANAJUATO","OILH810313JS5","OILH810313HGTVGC18","HECTOR GERARDO OVIEDO LUGO","11DPT0007K",0,0,0,1,0,0,0,0,0,0,0,0,0,0,0,0,0,0,30289.050000000003]
[null,"GUANAJUATO","ROMJ501119M55","ROMI501119HGTCZS06","J. ISABEL ROCHA MEZA","11DPT0007K",0,0,0,1,0,0,0,0,0,0,0,0,0,0,0,0,0,0,43555.4]
[null,"GUANAJUATO","GARJ840526678","GARJ840526HGTRMV04","JAVIER ARTURO GARCIA ROMERO","11DPT0007K",0,0,0,1,0,0,0,0,0,0,0,0,0,0,0,0,0,0,40479.520000000004]
[null,"GUANAJUATO","COEJ510401V7A","COEJ510401HZSNSS04","JESUS MARIA CONTRERAS ESPARZA","11DPT0007K",0,0,0,0,0,0,0,0,0,0,0,0,0,1,0,0,0,0,97723.59]
[null,"GUANAJUATO","AOLJ820429DY4","AOLJ820429HGTCPL06","JOEL ADOLFO ACOSTA LOPEZ","11DPT0007K",0,0,0,1,0,0,0,0,0,0,0,0,0,0,0,0,0,0,36009.430000000008]
[null,"GUANAJUATO","PERR730823M62","PERR730823HPLRMF15","JOSE RAFAEL PEREZ RAMOS","11DPT0007K",0,0,0,1,0,0,0,0,0,0,0,0,0,0,0,0,0,0,22337.4]
[null,"GUANAJUATO","BAMJ651013MA3","BAMJ651013HGTRRN08","JUAN PEDRO BARBOSA MORALES","11DPT0007K",0,0,0,1,0,0,0,0,0,0,0,0,0,0,0,0,0,0,97545.46]
[null,"GUANAJUATO","ROGJ720412CD2","ROGJ720412HGTCNL01","JULIO BERNARDO ROCHA GONZALEZ","11DPT0007K",0,0,0,1,0,0,0,0,0,0,0,0,0,0,0,0,0,0,51645.530000000006]
[null,"GUANAJUATO","GOGL6009014D1","GOGL600901MGTNLN08","LINA ENGRACIA GONZALEZ GALLARDO","11DPT0007K",0,0,0,1,0,0,0,0,0,0,0,0,0,0,0,0,0,0,54412.890000000014]
[null,"GUANAJUATO","HEBL680226MH6","HEBL680226HDFRNS05","LUIS FELIPE HERRERA BUENDIA","11DPT0007K",0,0,0,1,0,0,0,0,0,0,0,0,0,0,0,0,0,0,44275.43]
[null,"GUANAJUATO","GARL720427FX0","GARL720427MGTRMZ12","LUZ MA GARCIA ROMERO","11DPT0007K",0,0,0,1,0,0,0,0,0,0,0,0,0,0,0,0,0,0,59575.250000000007]
[null,"GUANAJUATO","ROGL591003DS4","ROGL591003MGTMNN05","MA LINA ROMERO GONZALEZ","11DPT0007K",0,0,0,1,0,0,0,0,0,0,0,0,0,0,0,0,0,0,64438.46]
[null,"GUANAJUATO","MUPT600105IQ9","MUPT600105MGTRRR07","MA TRINIDAD MURILLO PEREZ","11DPT0007K",0,0,0,1,0,0,0,0,0,0,0,0,0,0,0,0,0,0,45944.240000000005]
[null,"GUANAJUATO","RAHJ6410105C3","RAHJ641010MGTMRS04","MA. DE JESUS RAMIREZ HORTA","11DPT0007K",0,0,0,1,0,0,0,0,0,0,0,0,0,0,0,0,0,0,142955.57999999999]
[null,"GUANAJUATO","CACL650308V86","CACL650308MGTMLZ03","MA. DE LA LUZ CAMARILLO COLLAZO","11DPT0007K",0,0,0,1,0,0,0,0,0,0,0,0,0,0,0,0,0,0,136363.56]
[null,"GUANAJUATO","RIOS5803272M4","RIOS580327MZSVLC03","MA. DEL SOCORRO RIVERA OLVERA","11DPT0007K",0,0,0,1,0,0,0,0,0,0,0,0,0,0,0,0,0,0,45174.509999999995]
[null,"GUANAJUATO","SACA791207U75","SACA791207MGTLSL02","MARIA ALEJANDRA GUADALUPE SALAZAR CASTAÑEDA","11DPT0007K",0,0,0,0,0,0,0,0,0,0,0,0,0,1,0,0,0,0,83101.77]
[null,"GUANAJUATO","OILP6802156K9","OILP680215MDFVGL09","MARIA DEL PILAR OVIEDO LUGO","11DPT0007K",0,0,0,1,0,0,0,0,0,0,0,0,0,0,0,0,0,0,45577.630000000005]
[null,"GUANAJUATO","LOMA701120ND4","LOXM701120HGTPXR04","MARTIN EDUARDO LOPEZ _","11DPT0007K",0,0,0,1,0,0,0,0,0,0,0,0,0,0,0,0,0,0,153365.54000000004]
[null,"GUANAJUATO","MAMN910328KD9","MAMN910328HGTRDS06","NESTOR ISIDRO MARTINEZ MEDINA","11DPT0007K",0,0,0,1,0,0,0,0,0,0,0,0,0,0,0,0,0,0,46802.79]
[null,"GUANAJUATO","RARP630605NP2","RARP630605HJCMMD06","PEDRO RAMIREZ RAMIREZ","11DPT0007K",0,0,0,1,0,0,0,0,0,0,0,0,0,0,0,0,0,0,42753.740000000005]
[null,"GUANAJUATO","PAZR620620HP0","PAZR620620MGTCPQ07","RAQUEL PACHECO ZAPIEN","11DPT0007K",0,0,0,1,0,0,0,0,0,0,0,0,0,0,0,0,0,0,94305.41]
[null,"GUANAJUATO","POMR6708302N1","POMR670830MGTRNS05","ROSA MARIA PORRAS MANRIQUE","11DPT0007K",0,0,0,1,0,0,0,0,0,0,0,0,0,0,0,0,0,0,90297.41]
[null,"GUANAJUATO","SETV690706LG3","SETV690706MDFRRR05","VERONICA SERRANO TORRES","11DPT0007K",0,0,0,1,0,0,0,0,0,0,0,0,0,0,0,0,0,0,89708.689999999988]
[null,"GUANAJUATO","GURW970309V10","GURW970309MGTTDN02","WENDI GUTIERREZ RODRIGUEZ","11DPT0007K",0,0,0,1,0,0,0,0,0,0,0,0,0,0,0,0,0,0,14891.6]
[null,"GUANAJUATO","GUGA7312084M6","GUGA731208HGTTZL01","ALFREDO GUTIERREZ GUZMAN","11DPT0013V",0,0,0,1,0,0,0,0,0,0,0,0,0,0,0,0,0,0,46482.270000000004]
[null,"GUANAJUATO","RORC850223K78","RORC850223HGTDMR02","CARLOS ALBERTO RODRIGUEZ RAMIREZ","11DPT0013V",0,0,0,1,0,0,0,0,0,0,0,0,0,0,0,0,0,0,73971.740000000005]
[null,"GUANAJUATO","GUAC730716AX1","GUAC730716MGTTRL04","CLAUDIA CECILIA GUTIERREZ ARAMBULA","11DPT0013V",0,0,0,1,0,0,0,0,0,0,0,0,0,0,0,0,0,0,11745.07]
[null,"GUANAJUATO","JICC6704222W7","JICC670422MGTMRL00","CLAUDIA FABIOLA JIMENEZ CERRILLO","11DPT0013V",0,0,0,0,0,0,0,0,0,0,0,0,0,1,0,0,0,0,95731.82]
[null,"GUANAJUATO","GUME761118NPA","GUME761118MGTLNR03","ERIKA ALEJANDRA GUILLEN MENDIOLA","11DPT0013V",0,0,0,1,0,0,0,0,0,0,0,0,0,0,0,0,0,0,35235.21]
[null,"GUANAJUATO","NIRG591215T84","NIRG591215MGTTVR06","GEORGINA DE LOURDES NIETO RIVERA","11DPT0013V",0,0,0,1,0,0,0,0,0,0,0,0,0,0,0,0,0,0,138938.46000000002]
[null,"GUANAJUATO","HEMG620422565","HEMG620422MGTRRR08","GRACIELA HERNANDEZ MARTINEZ","11DPT0013V",0,0,0,1,0,0,0,0,0,0,0,0,0,0,0,0,0,0,45314.87]
[null,"GUANAJUATO","MOLJ6908066K2","MOLJ690806HGTNRN01","JUAN ANTONIO MONTALVO LIRA","11DPT0013V",0,0,0,1,0,0,0,0,0,0,0,0,0,0,0,0,0,0,72217.94]
[null,"GUANAJUATO","HELJ790519GT9","HELJ790519HGTRPN03","JUAN MANUEL HERNANDEZ LOPEZ","11DPT0013V",0,0,0,1,0,0,0,0,0,0,0,0,0,0,0,0,0,0,55922.500000000015]
[null,"GUANAJUATO","ROSJ840320PL5","ROSJ840320MMCMGL06","JULIA OYUKI ROMERO SEGURA","11DPT0013V",0,0,0,1,0,0,0,0,0,0,0,0,0,0,0,0,0,0,45210.340000000004]
[null,"GUANAJUATO","CAML820820U36","CAML820820HGTNNS09","LUIS MIGUEL CANO MENDOZA","11DPT0013V",0,0,0,1,0,0,0,0,0,0,0,0,0,0,0,0,0,0,72401.850000000006]
[null,"GUANAJUATO","EACA751029DJ3","EACA751029MGTSRN06","MA DE LOS ANGELES ESPARZA CORONA","11DPT0013V",0,0,0,1,0,0,0,0,0,0,0,0,0,0,0,0,0,0,34936.000000000007]
[null,"GUANAJUATO","GURG711212BH3","GURG711212MGTRXD01","MA GUADALUPE GUARDADO REA","11DPT0013V",0,0,0,1,0,0,0,0,0,0,0,0,0,0,0,0,0,0,39244.97]
[null,"GUANAJUATO","RELS650704P63","RELS650704MGTXZL00","MA. SOLEDAD REA LOZANO","11DPT0013V",0,0,0,1,0,0,0,0,0,0,0,0,0,0,0,0,0,0,60244.81]
[null,"GUANAJUATO","ZERV770303SS4","ZERV770303MGTNCN07","MARIA VANESSA ZENDEJAS ROCHA","11DPT0013V",0,0,0,1,0,0,0,0,0,0,0,0,0,0,0,0,0,0,50392.61]
[null,"GUANAJUATO","GASM690929112","GASM690929HDFRLR02","MARIO MIGUEL GARCIA SALINAS","11DPT0013V",0,0,0,1,0,0,0,0,0,0,0,0,0,0,0,0,0,0,74638.22]
[null,"GUANAJUATO","RUER840817TJ2","RUER840817HGTZSN07","RENE RUIZ ESPINOSA","11DPT0013V",0,0,0,1,0,0,0,0,0,0,0,0,0,0,0,0,0,0,47176.15]
[null,"GUANAJUATO","ROMR861218274","ROMR861218HGTDGC00","RICARDO RODRIGUEZ MAGDALENO","11DPT0013V",0,0,0,1,0,0,0,0,0,0,0,0,0,0,0,0,0,0,100904.06999999999]
[null,"GUANAJUATO","MEES880125B67","MEES880125MGTZSN02","SANDRA MARGARITA MEZA ESTRADA","11DPT0013V",0,0,0,1,0,0,0,0,0,0,0,0,0,0,0,0,0,0,36457.950000000004]
[null,"GUANAJUATO","SOPA800206QN0","SOPA800206HMCRRB02","ABNER ISAI SORIA PEREZ","11DPT0004N",0,0,0,1,0,0,0,0,0,0,0,0,0,0,0,0,0,0,74376.820000000007]
[null,"GUANAJUATO","GAZE690718GX3","GAZE690718MGTRVL07","ELIZABETH GARCIA ZAVALA","11DPT0004N",0,0,0,1,0,0,0,0,0,0,0,0,0,0,0,0,0,0,50404.83]
[null,"GUANAJUATO","GOGE730923ME8","GOGE730923MMNNNL00","ELIZABETH GONZALEZ GONZALEZ","11DPT0004N",0,0,0,1,0,0,0,0,0,0,0,0,0,0,0,0,0,0,44875.22]
[null,"GUANAJUATO","AACG691218L13","AACG691218MMNLSR08","GRACIELA ALVAREZ CASTRO","11DPT0004N",0,0,0,1,0,0,0,0,0,0,0,0,0,0,0,0,0,0,47392.05]
[null,"GUANAJUATO","DUAJ8704098Q4","DUAJ870409HGTRGR00","JORGE LUIS DURAN AGUILERA","11DPT0004N",0,0,0,1,0,0,0,0,0,0,0,0,0,0,0,0,0,0,34313.960000000006]
[null,"GUANAJUATO","MAVJ651001UX7","MAVJ651001HGTRGS08","JOSE DE JESUS MARTINEZ VEGA","11DPT0004N",0,0,0,1,0,0,0,0,0,0,0,0,0,0,0,0,0,0,25150.05]
[null,"GUANAJUATO","OEVL650213T59","OEVL650213MGTRLR01","LAURA INES ORTEGA VALADEZ","11DPT0004N",0,0,0,1,0,0,0,0,0,0,0,0,0,0,0,0,0,0,141282.04999999999]
[null,"GUANAJUATO","DIJL7203079A3","DIJL720307MGTGCR01","MA. DE LOURDES DIEGO JACOBO","11DPT0004N",0,0,0,1,0,0,0,0,0,0,0,0,0,0,0,0,0,0,60309.610000000008]
[null,"GUANAJUATO","PAGR7307144R1","PAGR730714MGTNMF00","MARIA DEL REFUGIO PANTOJA GOMEZ","11DPT0004N",0,0,0,1,0,0,0,0,0,0,0,0,0,0,0,0,0,0,48115.7]
[null,"GUANAJUATO","GACR6704153I2","GACR670415MGTRRT06","MARIA RITA GARCIA CERRATO","11DPT0004N",0,0,0,1,0,0,0,0,0,0,0,0,0,0,0,0,0,0,52181.440000000002]
[null,"GUANAJUATO","AUPM640422KR2","AUPM640422HGTGLR03","MARTIN AGUIRRE PALMERIN","11DPT0004N",0,0,0,1,0,0,0,0,0,0,0,0,0,0,0,0,0,0,46771.66]
[null,"GUANAJUATO","MORM731010QZ9","MORM731010MVZLZR03","MIRSA MARICELA MOLGORA RAZO","11DPT0004N",0,0,0,0,0,0,0,0,0,0,0,0,0,1,0,0,0,0,95731.82]
[null,"GUANAJUATO","LOGM731124S65","LOGM731124MMNPZN04","MONICA IVETT LOPEZ GUZMAN","11DPT0004N",0,0,0,1,0,0,0,0,0,0,0,0,0,0,0,0,0,0,112069.56]
[null,"GUANAJUATO","VASO730804UX2","VASO730804HGTRTC00","OCTAVIO VARGAS SOTO","11DPT0004N",0,0,0,1,0,0,0,0,0,0,0,0,0,0,0,0,0,0,120907.20000000001]
[null,"GUANAJUATO","SAHO620602LB0","SAHO620602HSRLRS06","OSMAN SALAZAR HERNANDEZ","11DPT0004N",0,0,0,1,0,0,0,0,0,0,0,0,0,0,0,0,0,0,35361.07]
[null,"GUANAJUATO","LURR5303156L3","LURR530315HGTNMY04","RAYMUNDO LUNA RAMIREZ","11DPT0004N",0,0,0,1,0,0,0,0,0,0,0,0,0,0,0,0,0,0,124623.35]
[null,"GUANAJUATO","MEGR631011V43","MEGR631011MGTNRS04","ROSA MENDEZ GARCIA","11DPT0004N",0,0,0,1,0,0,0,0,0,0,0,0,0,0,0,0,0,0,42609.62]
[null,"GUANAJUATO","TAAS6205308FA","TAAS620530MJCPLR01","SARA TAPIA ALCANTARA","11DPT0004N",0,0,0,1,0,0,0,0,0,0,0,0,0,0,0,0,0,0,50881.62]
[null,"GUANAJUATO","GARS670416A54","GARS670416MGTRYL05","SILVIA GARCIA REYES","11DPT0004N",0,0,0,1,0,0,0,0,0,0,0,0,0,0,0,0,0,0,92398.229999999981]
[null,"GUANAJUATO","LOGY890331RG1","LOGY890331MGTPZN04","YANNET LOPEZ GUZMAN","11DPT0004N",0,0,0,1,0,0,0,0,0,0,0,0,0,0,0,0,0,0,36546.36]
[null,"GUANAJUATO","GUZA720514FG4","GUZA720514MDFTVL06","ALEJANDRA GUTIERREZ ZAVALA","11DPT0009I",0,0,0,1,0,0,0,0,0,0,0,0,0,0,0,0,0,0,51027.990000000005]
[null,"GUANAJUATO","MERA680725T53","MERA680725MGTJML04","ALMA DELIA MEJIA RAMOS","11DPT0009I",0,0,0,1,0,0,0,0,0,0,0,0,0,0,0,0,0,0,52011.02]
[null,"GUANAJUATO","EICA641219IS3","EICA641219MGTLRL01","ALTAGRACIA ELIZARRARAS CERVANTES","11DPT0009I",0,0,0,1,0,0,0,0,0,0,0,0,0,0,0,0,0,0,56903.83]
[null,"GUANAJUATO","LOLA590613UN8","LOLA590613HGTPPN00","ANTONIO LOPEZ LOPEZ","11DPT0009I",0,0,0,1,0,0,0,0,0,0,0,0,0,0,0,0,0,0,140399.12]
[null,"GUANAJUATO","LILB720207HV3","LILB720207MGTNML02","BLANCA ESTELA LINARES LOMELI","11DPT0009I",0,0,0,1,0,0,0,0,0,0,0,0,0,0,0,0,0,0,54752.000000000007]
[null,"GUANAJUATO","AABC720527RL6","AABC720527HGTLRR03","CARLOS ALVARADO BARRIOS","11DPT0009I",0,0,0,1,0,0,0,0,0,0,0,0,0,0,0,0,0,0,44240.12]
[null,"GUANAJUATO","EIVC851005GF2","EIVC851005HGTLRR07","CARLOS ELIZARRARAS VARGAS","11DPT0009I",0,0,0,1,0,0,0,0,0,0,0,0,0,0,0,0,0,0,103576.77999999998]
[null,"GUANAJUATO","MAZC781203890","MAZC781203HGTQRR06","CARLOS MAQUEDA ZARATE","11DPT0009I",0,0,0,1,0,0,0,0,0,0,0,0,0,0,0,0,0,0,34558.000000000007]
[null,"GUANAJUATO","EICC740626328","EICC740626MGTLRL02","CLAUDIA ELIZARRARAS CERVANTES","11DPT0009I",0,0,0,1,0,0,0,0,0,0,0,0,0,0,0,0,0,0,25975.05]
[null,"GUANAJUATO","MAAG880919T71","MAAG880919MGTGYR06","GREGORIA MAGAÑA AYALA","11DPT0009I",0,0,0,1,0,0,0,0,0,0,0,0,0,0,0,0,0,0,18299.5]
[null,"GUANAJUATO","ZUGJ521022BB6","ZUGJ521022HGTXRV02","JAVIER ZUÑIGA GARCIA","11DPT0009I",0,0,0,0,0,0,0,0,0,0,0,0,0,1,0,0,0,0,97723.59]
[null,"GUANAJUATO","SOMJ580901N40","SOMJ580901HMNLRS02","JESUS SOLIS MARIN","11DPT0009I",0,0,0,1,0,0,0,0,0,0,0,0,0,0,0,0,0,0,49907.259999999995]
[null,"GUANAJUATO","SAAA790117M77","SAAA790117HGTNRL19","JOSE ALFREDO SANCHEZ ARREDONDO","11DPT0009I",0,0,0,1,0,0,0,0,0,0,0,0,0,0,0,0,0,0,112069.56]
[null,"GUANAJUATO","ROPJ630922717","ROPJ630922MGTDRS08","JOSEFINA RODRIGUEZ PEREZ","11DPT0009I",0,0,0,1,0,0,0,0,0,0,0,0,0,0,0,0,0,0,46742.53]
[null,"GUANAJUATO","GUZL770701FT7","GUZL770701MMCTVT09","LETICIA GUTIERREZ ZAVALA","11DPT0009I",0,0,0,1,0,0,0,0,0,0,0,0,0,0,0,0,0,0,10979.7]
[null,"GUANAJUATO","MAZC650708TU1","MAZC650708MGTQRR01","MARIA CARMEN MAQUEDA ZARATE","11DPT0009I",0,0,0,1,0,0,0,0,0,0,0,0,0,0,0,0,0,0,47035.450000000004]
[null,"GUANAJUATO","EITG6112096F3","EITG611209MDFSBD05","MARIA GUADALUPE ESPINOSA TABLEROS","11DPT0009I",0,0,0,1,0,0,0,0,0,0,0,0,0,0,0,0,0,0,84054.389999999985]
[null,"GUANAJUATO","COCM710215JF9","COCM710215HMNBMR04","MARIO COBIAN CAMACHO","11DPT0009I",0,0,0,1,0,0,0,0,0,0,0,0,0,0,0,0,0,0,125369.7]
[null,"GUANAJUATO","MEGM680209QU7","MEGM680209MGTDZR08","MARTHA SUSANA MEDEL GUZMAN","11DPT0009I",0,0,0,1,0,0,0,0,0,0,0,0,0,0,0,0,0,0,36680.339999999997]
[null,"GUANAJUATO","MARM6405079G7","MARM640507HGTGVR02","MARTIN MAGAÑA RIVERA","11DPT0009I",0,0,0,1,0,0,0,0,0,0,0,0,0,0,0,0,0,0,123959.06]
[null,"GUANAJUATO","VACM560124H46","VACM560124HGTZRR03","MAURILIO VAZQUEZ CERVANTES","11DPT0009I",0,0,0,1,0,0,0,0,0,0,0,0,0,0,0,0,0,0,47707.12]
[null,"GUANAJUATO","CELM960313G89","CELM960313MGTRPY09","MAYRA FRANCISCA CERVANTES LOPEZ","11DPT0009I",0,0,0,1,0,0,0,0,0,0,0,0,0,0,0,0,0,0,35160.650000000009]
[null,"GUANAJUATO","MATM660127GT0","MATM660127MGTGFN01","MONICA MAGAÑA TAFOYA","11DPT0009I",0,0,0,1,0,0,0,0,0,0,0,0,0,0,0,0,0,0,57365.090000000004]
[null,"GUANAJUATO","SARO9410041H4","SARO941004HGTNXL07","OLDAIR FERNANDO SANTILLAN REA","11DPT0009I",0,0,0,1,0,0,0,0,0,0,0,0,0,0,0,0,0,0,32691.880000000005]
[null,"GUANAJUATO","RELR6206286CA","RELR620628HGTYPG09","ROGELIO REYES LOPEZ","11DPT0009I",0,0,0,1,0,0,0,0,0,0,0,0,0,0,0,0,0,0,57122.510000000009]
[null,"GUANAJUATO","CALA880830IGA","CALA880830MGTLPD08","ADRIANA CALDERON LOPEZ","11DPT0011X",0,0,0,1,0,0,0,0,0,0,0,0,0,0,0,0,0,0,43655.600000000006]
[null,"GUANAJUATO","AOFA670123A81","AOFA670123MGTBLD06","ADRIANA DEL CARMEN ABONCE FLORES","11DPT0011X",0,0,0,1,0,0,0,0,0,0,0,0,0,0,0,0,0,0,110860.50000000001]
[null,"GUANAJUATO","ROGA640613DQ5","ROGA640613MDFJTN05","ANTONIA ESTELA ROJAS GUTIERREZ","11DPT0011X",0,0,0,1,0,0,0,0,0,0,0,0,0,0,0,0,0,0,121540.87999999999]
[null,"GUANAJUATO","RACB5510265G3","RACB551026HGTMSN05","BENITO RAMIREZ CASTILLO","11DPT0011X",0,0,0,1,0,0,0,0,0,0,0,0,0,0,0,0,0,0,49433.83]
[null,"GUANAJUATO","AABC680116196","AABC680116MMCBNL09","CLAUDIA CECILIA DE JESUS ABDALA BUENDIA","11DPT0011X",0,0,0,1,0,0,0,0,0,0,0,0,0,0,0,0,0,0,44168.58]
[null,"GUANAJUATO","MAJG650413GMA","MAJG650413HGTLRS08","GUSTAVO MALAGON JUAREZ","11DPT0011X",0,0,0,1,0,0,0,0,0,0,0,0,0,0,0,0,0,0,131213.70000000001]
[null,"GUANAJUATO","BAGJ5004309G9","BAGJ500430HGTRRR03","JORGE BARRERA GARCIA","11DPT0011X",0,0,0,1,0,0,0,0,0,0,0,0,0,0,0,0,0,0,44713.409999999996]
[null,"GUANAJUATO","MOMA590424218","MOMA590424HGTNLN04","JOSE ANTONIO MONCADA MALDONADO","11DPT0011X",0,0,0,1,0,0,0,0,0,0,0,0,0,0,0,0,0,0,50661.280000000006]
[null,"GUANAJUATO","NAZA870510IS9","NAZA870510HGTVVN07","JOSE ANTONIO NAVARRETE ZAVALA","11DPT0011X",0,0,0,1,0,0,0,0,0,0,0,0,0,0,0,0,0,0,31033.110000000004]
[null,"GUANAJUATO","RIGA780625KX0","RIGA780625HGTVMG07","JOSE AUGUSTO RIVERA GOMEZ","11DPT0011X",0,0,0,1,0,0,0,0,0,0,0,0,0,0,0,0,0,0,41089.58]
[null,"GUANAJUATO","AECJ7908035L8","AECJ790803HGTLRS03","JOSE JESUS ALEJO CARREÑO","11DPT0011X",0,0,0,1,0,0,0,0,0,0,0,0,0,0,0,0,0,0,39039.400000000009]
[null,"GUANAJUATO","RARL5612292P3","RARL561229HGTMMS07","JOSE LUIS RAMIREZ RAMIREZ","11DPT0011X",0,0,0,0,0,0,0,0,0,0,0,0,0,1,0,0,0,0,92669.46]
[null,"GUANAJUATO","GAJJ660505P94","GAJJ660505HGTRMN06","JUAN GARCIA JIMENEZ","11DPT0011X",0,0,0,1,0,0,0,0,0,0,0,0,0,0,0,0,0,0,50888.94]
[null,"GUANAJUATO","AECM720103NB9","AECM720103MGTLRR09","MARCELA ALEJO CARREÑO","11DPT0011X",0,0,0,1,0,0,0,0,0,0,0,0,0,0,0,0,0,0,133788.6]
[null,"GUANAJUATO","CAAM930419DL1","CAAM930419HGTRLR08","MARCO ALEJANDRO CARDOSO ALVARADO","11DPT0011X",0,0,0,1,0,0,0,0,0,0,0,0,0,0,0,0,0,0,10979.7]
[null,"GUANAJUATO","SARF810815QJ5","SARF810815MDFNCB12","MARIA FABIOLA SANCHEZ RICO","11DPT0011X",0,0,0,1,0,0,0,0,0,0,0,0,0,0,0,0,0,0,35951.269999999997]
[null,"GUANAJUATO","MAMM8504029T1","MAMM850402MGTLLS09","MASSIEL MALDONADO MALDONADO","11DPT0011X",0,0,0,1,0,0,0,0,0,0,0,0,0,0,0,0,0,0,39015.78]
[null,"GUANAJUATO","EAFM570902GM4","EAFM570902HGTSLS06","MOISES ESTRADA FLORES","11DPT0011X",0,0,0,1,0,0,0,0,0,0,0,0,0,0,0,0,0,0,44458.39]
[null,"GUANAJUATO","AAMR650620AB4","AAMR650620HGTLGB03","ROBERTO ALVARADO MAGAÑA","11DPT0011X",0,0,0,1,0,0,0,0,0,0,0,0,0,0,0,0,0,0,50635.59]
[null,"GUANAJUATO","GOLR590503HDA","GOLR590503HGTNDB04","ROBERTO GONZALEZ LEDESMA","11DPT0011X",0,0,0,1,0,0,0,0,0,0,0,0,0,0,0,0,0,0,155697.04999999999]
[null,"GUANAJUATO","ROPR8607125H9","ROPR860712MGTDNS08","ROSA AIDE RODRIGUEZ PANIAGUA","11DPT0011X",0,0,0,1,0,0,0,0,0,0,0,0,0,0,0,0,0,0,102396.77999999998]
[null,"GUANAJUATO","AAMR671130JR0","AAMR671130HGTLGB00","RUBEN ALVARADO MAGAÑA","11DPT0011X",0,0,0,1,0,0,0,0,0,0,0,0,0,0,0,0,0,0,36480.720000000001]
[null,"GUANAJUATO","GOSA4507257Y0","GOXS450725HGTNXN07","SANTIAGO GONZALEZ","11DPT0011X",0,0,0,1,0,0,0,0,0,0,0,0,0,0,0,0,0,0,17038.170000000002]
[null,"GUANAJUATO","SEES881205VA7","SEES881205MGTRSR08","SARA SERRANO ESTRADA","11DPT0011X",0,0,0,1,0,0,0,0,0,0,0,0,0,0,0,0,0,0,45380.570000000007]
[null,"GUANAJUATO","BAGS470901EG4","BAGS470901MGTRRL03","SILVIA BARRERA GARCIA","11DPT0011X",0,0,0,1,0,0,0,0,0,0,0,0,0,0,0,0,0,0,45326.239999999998]
[null,"GUANAJUATO","LOCV8505084R9","LOCV850508MGTPRR07","VERONICA LOPEZ CARDOSO","11DPT0011X",0,0,0,1,0,0,0,0,0,0,0,0,0,0,0,0,0,0,39697.06]
[null,"GUANAJUATO","GOLV650317F13","GOLV650317HGTNPC03","VICTOR MANUEL GONZALEZ LOPEZ","11DPT0011X",0,0,0,1,0,0,0,0,0,0,0,0,0,0,0,0,0,0,25150.05]
[null,"GUANAJUATO","AALA880119VB9","AALA880119MGTLPL06","ALESSA ALVARADO LOPEZ","11DPT0014U",0,0,0,1,0,0,0,0,0,0,0,0,0,0,0,0,0,0,53552.66]
[null,"GUANAJUATO","SOMC8307243E3","SOMC830724HGTTNH06","CHRISTIAN SOTO MENDOZA","11DPT0014U",0,0,0,1,0,0,0,0,0,0,0,0,0,0,0,0,0,0,108442.26000000001]
[null,"GUANAJUATO","MOJC851117J2A","MOJC851117MGTRST08","CITLALLI TONANCI MORA JASSO","11DPT0014U",0,0,0,1,0,0,0,0,0,0,0,0,0,0,0,0,0,0,110114.15000000001]
[null,"GUANAJUATO","JUSD780922L87","JUSD780922MQTRRL03","DULCE MARIA JUAREZ SORIA","11DPT0014U",0,0,0,1,0,0,0,0,0,0,0,0,0,0,0,0,0,0,49248.770000000004]
[null,"GUANAJUATO","GAAE770204JK3","GAAE770204MDFYLL06","ELIA GAYTAN ALCARAZ","11DPT0014U",0,0,0,0,0,0,0,0,0,0,0,0,0,1,0,0,0,0,95731.82]
[null,"GUANAJUATO","RAAE850827HM7","RAAE850827MGTMNL05","ELVIA RAMIREZ ANDRADE","11DPT0014U",0,0,0,1,0,0,0,0,0,0,0,0,0,0,0,0,0,0,47239.880000000005]
[null,"GUANAJUATO","MERG840929RZ5","MERG840929MGTNDB06","GABRIELA MENDEZ RODRIGUEZ","11DPT0014U",0,0,0,1,0,0,0,0,0,0,0,0,0,0,0,0,0,0,31443.560000000005]
[null,"GUANAJUATO","MIHG8606185P2","MIHG860618MDFRRB06","GABRIELA MIRAMONTES HERNANDEZ","11DPT0014U",0,0,0,1,0,0,0,0,0,0,0,0,0,0,0,0,0,0,37988.319999999992]
[null,"GUANAJUATO","SECG740707K72","SECG740707MZSGML05","GUILLERMINA SEGURA CAMPOS","11DPT0014U",0,0,0,1,0,0,0,0,0,0,0,0,0,0,0,0,0,0,89708.689999999988]
[null,"GUANAJUATO","SIRI830722KG2","SIRI830722HGTXCG04","IGNACIO MANUEL SIXTOS RICO","11DPT0014U",0,0,0,1,0,0,0,0,0,0,0,0,0,0,0,0,0,0,72036.639999999999]
[null,"GUANAJUATO","OISI790511DD8","OISI790511HHGLNS14","ISMAEL OLIVO SANCHEZ","11DPT0014U",0,0,0,1,0,0,0,0,0,0,0,0,0,0,0,0,0,0,60920.040000000008]
[null,"GUANAJUATO","NAQI780206S92","NAQI780206HDFVXV07","IVAN AGUSTIN NAVARRETE QUIÑONES","11DPT0014U",0,0,0,1,0,0,0,0,0,0,0,0,0,0,0,0,0,0,45459.62000000001]
[null,"GUANAJUATO","MEME901101QT3","MEME901101MGTNRL08","MARIA ELENA MENDOZA MARTINEZ","11DPT0014U",0,0,0,1,0,0,0,0,0,0,0,0,0,0,0,0,0,0,44966.270000000004]
[null,"GUANAJUATO","GABI850102NDA","GABI850102MGTRRS03","MARIA ISABEL GARCIA BARRIENTOS","11DPT0014U",0,0,0,1,0,0,0,0,0,0,0,0,0,0,0,0,0,0,105416.58000000002]
[null,"GUANAJUATO","RAAI811229BW5","RAAI811229MMCMNS05","MARIA ISABEL RAMIREZ ANDRADE","11DPT0014U",0,0,0,1,0,0,0,0,0,0,0,0,0,0,0,0,0,0,55345.279999999999]
[null,"GUANAJUATO","TORM8008155Q9","TORM800815HGTRVR02","MARIO TORRES RIVERA","11DPT0014U",0,0,0,1,0,0,0,0,0,0,0,0,0,0,0,0,0,0,38538.99]
[null,"GUANAJUATO","RESO730809AI4","RESO730809MGTYNF03","OFELIA REYES SANDOVAL","11DPT0014U",0,0,0,1,0,0,0,0,0,0,0,0,0,0,0,0,0,0,44767.47]
[null,"GUANAJUATO","RIHR880331D30","RIHR880331HGTSRC09","RICARDO RIOS HERNANDEZ","11DPT0014U",0,0,0,1,0,0,0,0,0,0,0,0,0,0,0,0,0,0,75429.87999999999]
[null,"GUANAJUATO","HEPU760412GG8","HEPU760412HPLRRZ03","UZIEL HERNANDEZ PEREZ","11DPT0014U",0,0,0,1,0,0,0,0,0,0,0,0,0,0,0,0,0,0,49432.259999999995]
[null,"GUANAJUATO","EUVA760924363","EUVA760924HGTSLN02","ANTONIO ESQUEDA VILLALON","11DPT0012W",0,0,0,1,0,0,0,0,0,0,0,0,0,0,0,0,0,0,82479.920000000013]
[null,"GUANAJUATO","SAHA7408317B1","SAHA740831MDFNRR01","AURELIA SANDOVAL HERNANDEZ","11DPT0012W",0,0,0,1,0,0,0,0,0,0,0,0,0,0,0,0,0,0,36267.910000000003]
[null,"GUANAJUATO","BAHC790225T34","BAHC790225HGTSRS06","CESAR ISRAEL BASALDUA HERNANDEZ","11DPT0012W",0,0,0,1,0,0,0,0,0,0,0,0,0,0,0,0,0,0,30566.580000000005]
[null,"GUANAJUATO","PECE671111QE4","PECE671111HDFRSL09","ELOY MARTIN PEREZ CASTILLO","11DPT0012W",0,0,0,1,0,0,0,0,0,0,0,0,0,0,0,0,0,0,132843.75999999998]
[null,"GUANAJUATO","VAMF590309CY5","VAMF590309HGTLNR07","FERNANDO VALDES MONTES","11DPT0012W",0,0,0,1,0,0,0,0,0,0,0,0,0,0,0,0,0,0,125676.28000000001]
[null,"GUANAJUATO","LOSG55020446A","LOSG550204HGTPTL09","GUILLERMO LOPEZ SOTO","11DPT0012W",0,0,0,1,0,0,0,0,0,0,0,0,0,0,0,0,0,0,49088.58]
[null,"GUANAJUATO","FOGH740517223","FOGH740517HGTLTC07","HECTOR FLORES GUTIERREZ","11DPT0012W",0,0,0,1,0,0,0,0,0,0,0,0,0,0,0,0,0,0,50022.500000000007]
[null,"GUANAJUATO","GOGI750427GM1","GOGI750427HMCMYS02","ISRAEL GOMEZ GAYTAN","11DPT0012W",0,0,0,1,0,0,0,0,0,0,0,0,0,0,0,0,0,0,128381.28]
[null,"GUANAJUATO","VEMJ831202MR4","VEMJ831202HGTRNS09","JESUS VERA MENDIETA","11DPT0012W",0,0,0,1,0,0,0,0,0,0,0,0,0,0,0,0,0,0,21959.4]
[null,"GUANAJUATO","MUHA861028V94","MUHA861028HGTXRD02","JOSE ADAN MUÑOZ HERNANDEZ","11DPT0012W",0,0,0,1,0,0,0,0,0,0,0,0,0,0,0,0,0,0,35738.000000000007]
[null,"GUANAJUATO","RAGT730306AI0","RAGT730306HGTNRR07","JOSE TRINIDAD RANGEL GUERRERO","11DPT0012W",0,0,0,1,0,0,0,0,0,0,0,0,0,0,0,0,0,0,52628.89]
[null,"GUANAJUATO","SOPL831024T56","SOPL831024MGTTRR09","LAURA ANGELICA SOTO PEREZ","11DPT0012W",0,0,0,1,0,0,0,0,0,0,0,0,0,0,0,0,0,0,85639.040000000008]
[null,"GUANAJUATO","COMI671203D76","COMI671203MGTNLR18","MA. IRAIS CONTRERAS MALDONADO","11DPT0012W",0,0,0,0,0,0,0,0,0,0,0,0,0,1,0,0,0,0,83101.77]
[null,"GUANAJUATO","ROVR751027UW3","ROVR751027MGTBRS09","MARIA DEL ROSARIO ROBLES VARGAS","11DPT0012W",0,0,0,1,0,0,0,0,0,0,0,0,0,0,0,0,0,0,41184.100000000006]
[null,"GUANAJUATO","OERM770419UD7","OERM770419HGTLSG03","MIGUEL ANGEL OLVERA RESENDIZ","11DPT0012W",0,0,0,1,0,0,0,0,0,0,0,0,0,0,0,0,0,0,52103.73]
[null,"GUANAJUATO","SUFR660516C81","SUFR660516MDFRLQ08","RAQUEL SUAREZ FALCON","11DPT0012W",0,0,0,1,0,0,0,0,0,0,0,0,0,0,0,0,0,0,85624.12000000001]
[null,"GUANAJUATO","VIRS630902SUA","VIRS630902HMNLYL09","SALVADOR VILLANUEVA REYNOSO","11DPT0012W",0,0,0,1,0,0,0,0,0,0,0,0,0,0,0,0,0,0,121944.49]
[null,"GUANAJUATO","VASS860602N16","VASS860602MQTLNN00","SANDRA YANET VALTIERRA SANCHEZ","11DPT0012W",0,0,0,1,0,0,0,0,0,0,0,0,0,0,0,0,0,0,91688.560000000012]
[null,"GUANAJUATO","ZABS850402N68","ZABS850402HGTMLR06","SERGIO LUIS ZAMUDIO BELTRAN","11DPT0012W",0,0,0,1,0,0,0,0,0,0,0,0,0,0,0,0,0,0,48038.389999999992]
[null,"GUANAJUATO","ZABS740117LZ8","ZABS740117MGRMLS00","SUSY ROCIO ZAMUDIO BALVUENA","11DPT0012W",0,0,0,1,0,0,0,0,0,0,0,0,0,0,0,0,0,0,84832.46]
[null,"GUANAJUATO","OELW670610C88","OELW670610HGTLDN06","WENCESLAO OLVERA LEDESMA","11DPT0012W",0,0,0,1,0,0,0,0,0,0,0,0,0,0,0,0,0,0,50463.5]
[null,"GUANAJUATO","GAGY700725MG2","GAGY700725MGTRNS04","YESENIA GRANADOS GONZALEZ","11DPT0012W",0,0,0,0,0,0,0,0,0,0,0,0,0,1,0,0,0,0,97882.310000000012]
[null,"GUANAJUATO","HEHA830216PP3","HEHA830216MGTRRL04","ALMA DELIA HERNANDEZ HERNANDEZ","11DPT0010Y",0,0,0,1,0,0,0,0,0,0,0,0,0,0,0,0,0,0,39982.310000000005]
[null,"GUANAJUATO","GAGA8610104P3","GAGA861010HGTSRM03","AMOS EDUARDO GASCA GARCIA","11DPT0010Y",0,0,0,1,0,0,0,0,0,0,0,0,0,0,0,0,0,0,26973.630000000005]
[null,"GUANAJUATO","HELB7109192T6","HELB710919MGTRNT04","BEATRIZ HERNANDEZ LONA","11DPT0010Y",0,0,0,1,0,0,0,0,0,0,0,0,0,0,0,0,0,0,47076.680000000008]
[null,"GUANAJUATO","EISB881118DD0","EISB881118MGTSPT05","BETSAIDA MAGDALENA ESPINOZA SEPULVEDA","11DPT0010Y",0,0,0,1,0,0,0,0,0,0,0,0,0,0,0,0,0,0,35304.350000000006]
[null,"GUANAJUATO","GUMB860612B77","GUMB860612MGTTRL01","BLANCA EDITH GUTIERREZ MORENO","11DPT0010Y",0,0,0,1,0,0,0,0,0,0,0,0,0,0,0,0,0,0,48356.179999999993]
[null,"GUANAJUATO","SAOC521104BAA","SAOC521104HGTNLR02","CARLOS SANCHEZ OLIVA","11DPT0010Y",0,0,0,1,0,0,0,0,0,0,0,0,0,0,0,0,0,0,59034.030000000006]
[null,"GUANAJUATO","TOOC610522FW3","TOOC610522MGTRRL02","CELIA TORRES ORIGEL","11DPT0010Y",0,0,0,1,0,0,0,0,0,0,0,0,0,0,0,0,0,0,89708.689999999988]
[null,"GUANAJUATO","GUPD810705I4A","GUPD810705HQTRDM04","DOMINGO DANIEL GUERRERO PADILLA","11DPT0010Y",0,0,0,0,0,0,0,0,0,0,0,0,0,1,0,0,0,0,95731.82]
[null,"GUANAJUATO","ROTF640526L74","ROTF640526HGTDVL07","FELIPE RODRIGUEZ TOVAR","11DPT0010Y",0,0,0,1,0,0,0,0,0,0,0,0,0,0,0,0,0,0,44761.930000000008]
[null,"GUANAJUATO","HEVJ6006012YA","HEVL600601HGTRLZ00","J LUZ HERNANDEZ VELAZQUEZ","11DPT0010Y",0,0,0,1,0,0,0,0,0,0,0,0,0,0,0,0,0,0,44076.65]
[null,"GUANAJUATO","CORJ8905256I9","CORJ890525HGTRMR07","JORGE ARMANDO CORONA RAMIREZ","11DPT0010Y",0,0,0,1,0,0,0,0,0,0,0,0,0,0,0,0,0,0,43599.210000000006]
[null,"GUANAJUATO","FOCJ7406233X9","FOCJ740623MGTLLS01","JOSEFINA FLORES CALVA","11DPT0010Y",0,0,0,1,0,0,0,0,0,0,0,0,0,0,0,0,0,0,49077.51]
[null,"GUANAJUATO","RAGJ8207054L2","RAGJ820705HGTNMN05","JUAN ANTONIO RANGEL GOMEZ","11DPT0010Y",0,0,0,1,0,0,0,0,0,0,0,0,0,0,0,0,0,0,64003.25]
[null,"GUANAJUATO","HIMK800908LB0","HIMK800908HGTNNR04","KRISTIAN LUIS MANUEL HINOJOSA MONROY","11DPT0010Y",0,0,0,1,0,0,0,0,0,0,0,0,0,0,0,0,0,0,47701.39]
[null,"GUANAJUATO","CUVL741004T6A","CUVL741004MGTRRR08","LAURA CRUZ VARGAS","11DPT0010Y",0,0,0,1,0,0,0,0,0,0,0,0,0,0,0,0,0,0,115696.86]
[null,"GUANAJUATO","PELL790204HW5","PELL790204MNTRRC05","LUCIA PEREZ LARA","11DPT0010Y",0,0,0,1,0,0,0,0,0,0,0,0,0,0,0,0,0,0,37359.5]
[null,"GUANAJUATO","HETL941116C88","HETL941116HGTRRS09","LUIS RAUL HERNANDEZ TREJO","11DPT0010Y",0,0,0,1,0,0,0,0,0,0,0,0,0,0,0,0,0,0,25150.05]
[null,"GUANAJUATO","ROVL470314635","ROVL470314HGTXGS09","LUIS RUBEN ROA VEGA","11DPT0010Y",0,0,0,1,0,0,0,0,0,0,0,0,0,0,0,0,0,0,41442.94]
[null,"GUANAJUATO","LOZE620109973","LOZE620109MGTPMV07","MA. EVERILDA LOPEZ ZAMORA","11DPT0010Y",0,0,0,1,0,0,0,0,0,0,0,0,0,0,0,0,0,0,43814.65]
[null,"GUANAJUATO","MAHM7308144U2","MAHM730814MGTRRR07","MARCELA DEL PILAR MARTINEZ HERNANDEZ","11DPT0010Y",0,0,0,1,0,0,0,0,0,0,0,0,0,0,0,0,0,0,102396.77999999998]
[null,"GUANAJUATO","MADB860405V48","MADB860405MGTLZL02","MARIA BLANCA MALAGON DIAZ","11DPT0010Y",0,0,0,1,0,0,0,0,0,0,0,0,0,0,0,0,0,0,40332.200000000004]
[null,"GUANAJUATO","DUFC8505038R7","DUFC850503MGTRLR04","MARIA CRUZ DURAN FLORES","11DPT0010Y",0,0,0,1,0,0,0,0,0,0,0,0,0,0,0,0,0,0,44891.72]
[null,"GUANAJUATO","BAUM780104T8A","BAUM780104MGTRRC01","MICAELA BARCENAS URBINA","11DPT0010Y",0,0,0,1,0,0,0,0,0,0,0,0,0,0,0,0,0,0,47737.180000000008]
[null,"GUANAJUATO","RARR710422AB6","RARR710422HGTMDM09","RAMON RAMIREZ RODRIGUEZ","11DPT0010Y",0,0,0,1,0,0,0,0,0,0,0,0,0,0,0,0,0,0,82479.920000000013]
[null,"GUANAJUATO","RABR820601BH9","RABR820601HGTMND08","RODOLFO OSVALDO RAMIREZ BUENO","11DPT0010Y",0,0,0,1,0,0,0,0,0,0,0,0,0,0,0,0,0,0,104756.78000000001]
[null,"GUANAJUATO","CUTR610723JC8","CUTR610723MGTLTS06","ROSA MARIA CUELLAR TETUAN","11DPT0010Y",0,0,0,1,0,0,0,0,0,0,0,0,0,0,0,0,0,0,154194.47999999998]
[null,"GUANAJUATO","MAVR700118TS6","MAVR700118HGTRRB08","RUBEN MARTINEZ VARELA","11DPT0010Y",0,0,0,1,0,0,0,0,0,0,0,0,0,0,0,0,0,0,135848.57999999999]
[null,"GUANAJUATO","OAGS860412RP6","OAGS860412MGTRTR05","SARA DEL ROSARIO ORRANTI GUTIERREZ","11DPT0010Y",0,0,0,1,0,0,0,0,0,0,0,0,0,0,0,0,0,0,36539.290000000008]
[null,"GUANAJUATO","RORA760321A25","RORA760321HGTDDL07","ALEXANDER DANIEL RODRIGUEZ RODRIGUEZ","11DPT0005M",0,0,0,0,0,0,0,0,0,0,0,0,0,1,0,0,0,0,35943.949999999997]
[null,"GUANAJUATO","NIMA711025LJ1","NIMA711025MGTTRL07","ALICIA NIETO MARTINEZ","11DPT0005M",0,0,0,1,0,0,0,0,0,0,0,0,0,0,0,0,0,0,46829.270000000004]
[null,"GUANAJUATO","GOAA770911HT1","GOAA770911MGTMLN09","ANA ROSA GOMEZ ALBA","11DPT0005M",0,0,0,1,0,0,0,0,0,0,0,0,0,0,0,0,0,0,70141.33]
[null,"GUANAJUATO","SIFB790507EM8","SIFB790507HGTRRR00","BRAULIO ISAAC SIERRA FERREYRA","11DPT0005M",0,0,0,1,0,0,0,0,0,0,0,0,0,0,0,0,0,0,105419.51999999999]
[null,"GUANAJUATO","VAGC6606185V3","VAGC660618MGTRRN09","CANDELARIA VARGAS GARCIA","11DPT0005M",0,0,0,1,0,0,0,0,0,0,0,0,0,0,0,0,0,0,33069.880000000005]
[null,"GUANAJUATO","RORA760321A25","RORA760321HGTDDL07","DANIEL ALEXANDER RODRITUEZ RODRIGUEZ","11DPT0005M",0,0,0,0,0,0,0,0,0,0,0,0,0,1,0,0,0,0,61779.64]
[null,"GUANAJUATO","COAD7908184B7","COAD790818MGTVRN00","DENY COVARRUBIAS ARREGUIN","11DPT0005M",0,0,0,1,0,0,0,0,0,0,0,0,0,0,0,0,0,0,33069.880000000005]
[null,"GUANAJUATO","LELE610112FLA","LELE610112MGTMRL09","ELSA GUADALUPE LEMUS LIRA","11DPT0005M",0,0,0,1,0,0,0,0,0,0,0,0,0,0,0,0,0,0,119518.83]
[null,"GUANAJUATO","RORF650224FV1","RORF650224HDFDDR03","FERNANDO RODRIGUEZ RODRIGUEZ","11DPT0005M",0,0,0,1,0,0,0,0,0,0,0,0,0,0,0,0,0,0,38920.280000000006]
[null,"GUANAJUATO","FIRG871015PB5","FIRG871015MGTGMB07","GABRIELA FIGUEROA RAMIREZ","11DPT0005M",0,0,0,1,0,0,0,0,0,0,0,0,0,0,0,0,0,0,35538.650000000009]
[null,"GUANAJUATO","MEGG6410124T0","MEGG641012MGTDRL06","GLORIA MEDINA GARCIA","11DPT0005M",0,0,0,1,0,0,0,0,0,0,0,0,0,0,0,0,0,0,46665.41]
[null,"GUANAJUATO","GULH680121BP6","GULH680121HDFTPR01","HORACIO GUTIERREZ LOPEZ","11DPT0005M",0,0,0,1,0,0,0,0,0,0,0,0,0,0,0,0,0,0,36611.640000000007]
[null,"GUANAJUATO","RAFA620326696","RAFA620326HGTMNN00","JOSE ANTONIO RAMIREZ FUENTES","11DPT0005M",0,0,0,1,0,0,0,0,0,0,0,0,0,0,0,0,0,0,137393.51999999999]
[null,"GUANAJUATO","JUMH681213NW0","JUMH681213HGTRGL00","JOSE HILARIO JUAREZ MAGAÑA","11DPT0005M",0,0,0,1,0,0,0,0,0,0,0,0,0,0,0,0,0,0,132758.64000000001]
[null,"GUANAJUATO","CAML640420FH8","CAML640420HDFSRS06","JOSE LUIS CASILLAS MIRANDA","11DPT0005M",0,0,0,1,0,0,0,0,0,0,0,0,0,0,0,0,0,0,47584.32]
[null,"GUANAJUATO","BAQL620315PN5","BAQL620315HGTRRS00","LUIS MANUEL BRAVO QUIROZ","11DPT0005M",0,0,0,1,0,0,0,0,0,0,0,0,0,0,0,0,0,0,142112.20000000001]
[null,"GUANAJUATO","MORM8011214B7","MORM801121HDFRMN03","MANUEL EFRAIN MORENO ROMERO","11DPT0005M",0,0,0,1,0,0,0,0,0,0,0,0,0,0,0,0,0,0,34936.000000000007]
[null,"GUANAJUATO","PIAR680730PSA","PIAR680730MGTRGG01","MARIA REGINA PRIETO AGUILAR","11DPT0005M",0,0,0,1,0,0,0,0,0,0,0,0,0,0,0,0,0,0,105727.4]
[null,"GUANAJUATO","BASS600608U7A","BASS600608MGTRRL08","MARIA SOLEDAD ROSA LETICIA BRAVO SERRANO","11DPT0005M",0,0,0,1,0,0,0,0,0,0,0,0,0,0,0,0,0,0,51868.05]
[null,"GUANAJUATO","MEMM670521N64","MEMM670521MDFDJR03","MARTHA PATRICIA MEDEL MEJIA","11DPT0005M",0,0,0,1,0,0,0,0,0,0,0,0,0,0,0,0,0,0,67893.2]
[null,"GUANAJUATO","SABM631225F45","SABM631225HGTVRR06","MARTIN SALVADOR SAAVEDRA BRAVO","11DPT0005M",0,0,0,1,0,0,0,0,0,0,0,0,0,0,0,0,0,0,36764.839999999997]
[null,"GUANAJUATO","PAGM5802105H5","PAGM580210HNTLRT06","MATIAS PALOMARES GARCIA","11DPT0005M",0,0,0,1,0,0,0,0,0,0,0,0,0,0,0,0,0,0,38509.170000000006]
[null,"GUANAJUATO","PACM840215MT1","PACM840215MGTLRR00","MAURA ANGELICA PALOMINO CARREÑO","11DPT0005M",0,0,0,1,0,0,0,0,0,0,0,0,0,0,0,0,0,0,30243.170000000006]
[null,"GUANAJUATO","MORM6501066X7","MORM650106HGTRSL00","MELCHOR BENITO MORENO ROSALES","11DPT0005M",0,0,0,1,0,0,0,0,0,0,0,0,0,0,0,0,0,0,128741.03]
[null,"GUANAJUATO","OUGM7012272G3","OUGM701227MGTRRN03","MONICA ORDUÑA GARCIA","11DPT0005M",0,0,0,1,0,0,0,0,0,0,0,0,0,0,0,0,0,0,38787]
[null,"GUANAJUATO","VALN7508285U9","VALN750828MGTZMR00","NORMA ADRIANA VAZQUEZ LOMELI","11DPT0005M",0,0,0,1,0,0,0,0,0,0,0,0,0,0,0,0,0,0,52025.01]
[null,"GUANAJUATO","FIGP640907QP7","FIGP640907HGTGRD01","PEDRO FIGUEROA GARCIA","11DPT0005M",0,0,0,1,0,0,0,0,0,0,0,0,0,0,0,0,0,0,51575.020000000004]
[null,"GUANAJUATO","CARR771026IP3","CARR771026MDFRMS09","ROSANA CARRILLO RAMIREZ","11DPT0005M",0,0,0,0,0,0,0,0,0,0,0,0,0,1,0,0,0,0,83101.77]
[null,"GUANAJUATO","SATR640529JN3","SATR640529HGTLRB08","RUBEN SALAZAR TORRES","11DPT0005M",0,0,0,1,0,0,0,0,0,0,0,0,0,0,0,0,0,0,54294.680000000008]
[null,"GUANAJUATO","CAGR660928KD7","CAGR660928MGTSNB07","RUBICELIA CASTRO GONZALEZ","11DPT0005M",0,0,0,1,0,0,0,0,0,0,0,0,0,0,0,0,0,0,92916.169999999984]
[null,"GUANAJUATO","CANS730714K3A","CANS730714MGTSTR04","SARA CASTILLO NIETO","11DPT0005M",0,0,0,1,0,0,0,0,0,0,0,0,0,0,0,0,0,0,47964.36]
[null,"GUANAJUATO","HECS621213HZ5","HECS621213HGTRLR02","SERGIO HERNANDEZ CALDERON","11DPT0005M",0,0,0,1,0,0,0,0,0,0,0,0,0,0,0,0,0,0,30101.030000000002]
[null,"GUANAJUATO","NIMT691014GT1","NIMT691014MGTTRR05","TERESITA NIETO MARTINEZ","11DPT0005M",0,0,0,1,0,0,0,0,0,0,0,0,0,0,0,0,0,0,41686.199999999997]
[null,"GUANAJUATO","VACY6607278R7","VACY660727MGTRSL08","YOLANDA VARGAS CASTILLO","11DPT0005M",0,0,0,1,0,0,0,0,0,0,0,0,0,0,0,0,0,0,146846.39000000001]
[null,"GUANAJUATO","DIAL510311BH6","DIXA510311HGTSXL09","ALBERTO DE LA LUZ SOCORRO DIOSDADO .","11APT0001T",0,0,0,0,0,0,0,0,0,0,0,0,0,1,0,0,0,0,254636.3]
[null,"GUANAJUATO","CALA7006204L0","CALA700620MGTMPL09","ALEJANDRA CAMACHO LOPEZ","11APT0001T",0,0,0,1,0,0,0,0,0,0,0,0,0,0,0,0,0,0,77286]
[null,"GUANAJUATO","RESA730203TA5","RESA730203MGTYNN04","ANA CELIA REYNOSO SANCHEZ","11APT0001T",0,0,0,0,0,0,0,0,0,0,0,0,0,1,0,0,0,0,120061.07]
[null,"GUANAJUATO","CESA870418K76","CESA870418MGTRMN08","ANA GABRIELA CERVERA SAMANO","11APT0001T",0,0,0,1,0,0,0,0,0,0,0,0,0,0,0,0,0,0,49263.259999999995]
[null,"GUANAJUATO","HEGG810820ID3","HEGG810820HGTRMR07","GERARDO HERNANDEZ GOMEZ","11APT0001T",0,0,0,1,0,0,0,0,0,0,0,0,0,0,0,0,0,0,23431.65]
[null,"GUANAJUATO","OING5906128T6","OING590612HGTRCS02","GUSTAVO ORTIZ NICASIO","11APT0001T",0,0,0,1,0,0,0,0,0,0,0,0,0,0,0,0,0,0,51427.89]
[null,"GUANAJUATO","LUCH751109S53","LUCH751109HGTVNG03","HUGO ENRIQUE LUEVANO CONTRERAS","11APT0001T",0,0,0,0,0,0,0,0,0,0,0,0,0,1,0,0,0,0,83101.77]
[null,"GUANAJUATO","AOGI790809G38","AOGI790809MGTLRM04","IMELDA SUSANA ALONSO GARCIA","11APT0001T",0,0,0,1,0,0,0,0,0,0,0,0,0,0,0,0,0,0,81695.72]
[null,"GUANAJUATO","PELI680925LM6","PELI680925MGTDPV03","IVONNE YOLANDA PEDROZA LOPEZ","11APT0001T",0,0,0,1,0,0,0,0,0,0,0,0,0,0,0,0,0,0,132758.64000000001]
[null,"GUANAJUATO","BACJ850923PQ8","BACJ850923HGTRRS05","JESUS OMAR BARCENAS CORNEJO","11APT0001T",0,0,0,0,0,0,0,0,0,0,0,0,0,1,0,0,0,0,26272.400000000001]
[null,"GUANAJUATO","LERD770827E23","LERD770827HGTNDM00","JOSE DOMINGO DE LEON RODRIGUEZ","11APT0001T",0,0,0,0,0,0,0,0,0,0,0,0,0,1,0,0,0,0,95806.31]
[null,"GUANAJUATO","AECL710621SE4","AECL710621HGTRRS02","JOSE LUIS ARELLANO CRUZ","11APT0001T",0,0,0,1,0,0,0,0,0,0,0,0,0,0,0,0,0,0,40340.559999999998]
[null,"GUANAJUATO","CAJU780116N75","CAXJ780116HGTMXN05","JUAN JOSE CAMACHO","11APT0001T",0,0,0,1,0,0,0,0,0,0,0,0,0,0,0,0,0,0,102396.77999999998]
[null,"GUANAJUATO","QUZJ6303282J5","QUZJ630328HSRLNN05","JUAN QUILES ZUNO","11APT0001T",0,0,0,1,0,0,0,0,0,0,0,0,0,0,0,0,0,0,53636.31]
[null,"GUANAJUATO","MAOJ7405168FA","MAOJ740516MGTRCN05","JUANA MARTINEZ OCHOA","11APT0001T",0,0,0,1,0,0,0,0,0,0,0,0,0,0,0,0,0,0,114487.80000000002]
[null,"GUANAJUATO","PUAJ821120LU8","PUAJ821120MJCGLN05","JUANA PUGA ALDANA","11APT0001T",0,0,0,1,0,0,0,0,0,0,0,0,0,0,0,0,0,0,38558.239999999998]
[null,"GUANAJUATO","SAAK880407FL7","SAAK880407MJCNNR03","KARLA ANGELINA SANDOVAL DE ANDA","11APT0001T",0,0,0,0,0,0,0,0,0,0,0,0,0,1,0,0,0,0,83101.77]
[null,"GUANAJUATO","AIMK880805R10","AIMK880805MGTRXR05","KARLA GABRIELA ARIAS MUÑOZ","11APT0001T",0,0,0,1,0,0,0,0,0,0,0,0,0,0,0,0,0,0,99038.17]
[null,"GUANAJUATO","RAEL8409015U2","RAEL840901MGTMSR07","LAURA PATRICIA RAMOS ESTRADA","11APT0001T",0,0,0,1,0,0,0,0,0,0,0,0,0,0,0,0,0,0,110662.90000000001]
[null,"GUANAJUATO","MESL860213877","MESL860213MGTNNR09","LOURDES PAULINA MENDOZA SANCHEZ","11APT0001T",0,0,0,1,0,0,0,0,0,0,0,0,0,0,0,0,0,0,69959.000000000015]
[null,"GUANAJUATO","GOML710913T66","GOML710913MGTNXC08","LUCIA GONZALEZ MUÑOZ","11APT0001T",0,0,0,0,0,0,0,0,0,0,0,0,0,1,0,0,0,0,120061.07]
[null,"GUANAJUATO","PEGL590326TB4","PEGL590326MGTRMZ05","LUZ ELENA PERALES GOMEZ","11APT0001T",0,0,0,1,0,0,0,0,0,0,0,0,0,0,0,0,0,0,46475.360000000008]
[null,"GUANAJUATO","SAHE741012DCA","SAHE741012MGTNRS04","MA ESTHER SANCHEZ HERNANDEZ","11APT0001T",0,0,0,0,0,0,0,0,0,0,0,0,0,1,0,0,0,0,95806.31]
[null,"GUANAJUATO","SAMN650727TS7","SAMN650727MGTNJT03","MA NATALIA SANCHEZ MOJICA","11APT0001T",0,0,0,1,0,0,0,0,0,0,0,0,0,0,0,0,0,0,36818.69]
[null,"GUANAJUATO","VACR780505180","VACR780505MGTRHS07","MARIA DEL ROSARIO VARGAS CHAVEZ","11APT0001T",0,0,0,0,0,0,0,0,0,0,0,0,0,1,0,0,0,0,95806.31]
[null,"GUANAJUATO","MOGM581228P96","MOGM581228MGTRNR09","MARTHA DEL CARMEN MORENO GONZALEZ","11APT0001T",0,0,0,1,0,0,0,0,0,0,0,0,0,0,0,0,0,0,52628.89]
[null,"GUANAJUATO","PATR7101059J2","PATR710105MGTCRS08","ROSA ADRIANA MARCELA PACHECO TORRES","11APT0001T",0,0,0,0,0,0,0,0,0,0,0,0,0,1,0,0,0,0,52544.800000000003]
[null,"GUANAJUATO","VAGS770812TH3","VAGS770812HGTLRM07","SAMUEL VALLEJO GUERRERO","11APT0001T",0,0,0,1,0,0,0,0,0,0,0,0,0,0,0,0,0,0,69149.000000000015]
[null,"GUANAJUATO","GAPS690711PT2","GAPS690711MGTRRR00","SARA GISELA GARCIA PEREZ","11APT0001T",0,0,0,0,0,0,0,0,0,0,0,0,0,1,0,0,0,0,83101.77]
[null,"GUANAJUATO","HEOS630818TG4","HEOS630818MDFRRN00","SONIA GUADALUPE HERNANDEZ OROZCO","11APT0001T",0,0,0,1,0,0,0,0,0,0,0,0,0,0,0,0,0,0,123354.5]
[null,"GUANAJUATO","GAGV930611G79","GAGV930611HGTRMC04","VICTOR HUGO GARCIA GOMEZ","11APT0001T",0,0,0,1,0,0,0,0,0,0,0,0,0,0,0,0,0,0,31033.110000000004]
[null,"GUANAJUATO","GOAV860422EK6","GOAV860422HGTNLC02","VICTOR ISRAEL GONZALEZ ALCANTAR","11APT0001T",0,0,0,1,0,0,0,0,0,0,0,0,0,0,0,0,0,0,89708.689999999988]
[null,"GUANAJUATO","AOOS720925113","AOOS720925MGTBRN08","SANDRA ABOYTES OROZCO","11DPT0001Q",0,0,0,0,0,0,0,1,0,0,0,0,0,0,0,0,0,0,30903.88]
[null,"GUANAJUATO","AAVB660401UL2","AAVB660401MDFLNL01","BLANCA IVETTE ALVAREZ DEL CASTILLO VENTRE","11DPT0001Q",0,0,0,0,0,0,0,1,0,0,0,0,0,0,0,0,0,0,27664.75]
[null,"GUANAJUATO","AOOC650822A32","AOOC650822MGTRJR02","MA CRISTINA ARROYO OJEDA","11DPT0001Q",0,0,0,0,0,0,0,1,0,0,0,0,0,0,0,0,0,0,22246.98]
[null,"GUANAJUATO","BESJ810412R10","BESJ810412HGTLNS06","JESUS EDUARDO BELMAN SANTILLAN","11DPT0001Q",0,0,0,0,0,0,0,1,0,0,0,0,0,0,0,0,0,0,24845.05]
[null,"GUANAJUATO","BOSC820326RI2","BOSC820326HGTLRR09","CARLOS MARTIN BOLAÑOS SERVIN","11DPT0001Q",0,0,0,0,0,0,0,1,0,0,0,0,0,0,0,0,0,0,21685.96]
[null,"GUANAJUATO","CAAL690628UQA","CAAL690628MGTRLT08","MARIA LETICIA CARDENAS ALMANZA","11DPT0001Q",0,0,0,0,0,0,0,1,0,0,0,0,0,0,0,0,0,0,22546.77]
[null,"GUANAJUATO","CARL560630I41","CARL560630HGTSVS09","JOSE LUIS CASTRO RIVAS","11DPT0001Q",0,0,0,0,0,0,0,1,0,0,0,0,0,0,0,0,0,0,22015.21]
[null,"GUANAJUATO","CAPJ680119DJ7","CAPA680119HGTZTN01","J. ANDRES CAZARES PATIÑO","11DPT0001Q",0,0,0,0,0,0,0,1,0,0,0,0,0,0,0,0,0,0,5661.52]
[null,"GUANAJUATO","CEGE7106304G8","CEGE710630MGTBML09","MA. ELIZABETH CEBALLOS GOMEZ","11DPT0001Q",0,0,0,0,0,0,0,1,0,0,0,0,0,0,0,0,0,0,12812.92]
[null,"GUANAJUATO","CAVA820322S74","CAVA820322HDFHRB06","ABRAHAM CHAVEZ VARELA","11DPT0001Q",0,0,0,0,0,0,0,1,0,0,0,0,0,0,0,0,0,0,23871.1]
[null,"GUANAJUATO","CIGM510313HX4","CIGM510313HVZSRG08","MIGUEL ANGEL CISNEROS GARCIA","11DPT0001Q",0,0,0,0,0,0,0,1,0,0,0,0,0,0,0,0,0,0,24513.98]
[null,"GUANAJUATO","COMM610831NKA","COMM610831HDFRRG06","MIGUEL CORTES MORALES","11DPT0001Q",0,0,0,0,0,0,0,1,0,0,0,0,0,0,0,0,0,0,21119.46]
[null,"GUANAJUATO","DEPT800907TBA","DEPT800907MGTRDR04","MARIA TERESA DERRAMADERO PADILLA","11DPT0001Q",0,0,0,0,0,0,0,1,0,0,0,0,0,0,0,0,0,0,25224.879999999997]
[null,"GUANAJUATO","EICS7010205K2","EICS701020MMNNRR06","SERAFINA ENRIQUEZ CORDOVA","11DPT0001Q",0,0,0,0,0,0,0,1,0,0,0,0,0,0,0,0,0,0,31105.27]
[null,"GUANAJUATO","EASG800616J20","EASG800616HGTSSR09","GERARDO ESTRADA SESENTO","11DPT0001Q",0,0,0,0,0,0,0,1,0,0,0,0,0,0,0,0,0,0,31448.890000000003]
[null,"GUANAJUATO","GAFF820410AV4","GAFF820410HGTRRR01","FERNANDO GARCIA FRIAS","11DPT0001Q",0,0,0,0,0,0,0,1,0,0,0,0,0,0,0,0,0,0,18941.71]
[null,"GUANAJUATO","GAMC720506I97","GAMC720506MGTRRN08","CONSTANZA GARCIA MARTINEZ","11DPT0001Q",0,0,0,0,0,0,0,1,0,0,0,0,0,0,0,0,0,0,28226.69]
[null,"GUANAJUATO","GACS730701E50","GACS730701MGTYDN08","SANDRA KARINA GAYTAN CADENA","11DPT0001Q",0,0,0,0,0,0,0,1,0,0,0,0,0,0,0,0,0,0,34340.699999999997]
[null,"GUANAJUATO","GODA691116ALA","GODA691116HDFMZL07","ALEJANDRO GOMEZ DIAZ","11DPT0001Q",0,0,0,0,0,0,0,1,0,0,0,0,0,0,0,0,0,0,18146.330000000002]
[null,"GUANAJUATO","GOLG8308137R7","GOLG830813HSPNPB08","GABRIEL HUMBERTO GONZALEZ LOPEZ","11DPT0001Q",0,0,0,0,0,0,0,1,0,0,0,0,0,0,0,0,0,0,18929.38]
[null,"GUANAJUATO","GOPE721215MA1","GOPE721215HGTNSD18","EDISON OSWALDO GONZALEZ PESCADOR","11DPT0001Q",0,0,0,0,0,0,0,1,0,0,0,0,0,0,0,0,0,0,19664.52]
[null,"GUANAJUATO","GAUR8010189E2","GAUR801018MGTRRS03","MARIA DEL ROSARIO GRANADOS URIBE","11DPT0001Q",0,0,0,0,0,0,0,1,0,0,0,0,0,0,0,0,0,0,29232.559999999998]
[null,"GUANAJUATO","GULA760327G74","GULA760327MCSLPN05","ANA CELIA GUILLEN LOPEZ","11DPT0001Q",0,0,0,0,0,0,0,1,0,0,0,0,0,0,0,0,0,0,24479.040000000001]
[null,"GUANAJUATO","GUCM630109EJ1","GUCM630109MGTTSR00","MARIA MARTINA MARGARITA GUTIERREZ CASTRO","11DPT0001Q",0,0,0,0,0,0,0,1,0,0,0,0,0,0,0,0,0,0,32175.230000000003]
[null,"GUANAJUATO","GUCA621009A88","GUCA621009MGTTHR00","ARACELI GUTIERREZ CHACON","11DPT0001Q",0,0,0,0,0,0,0,1,0,0,0,0,0,0,0,0,0,0,19117.32]
[null,"GUANAJUATO","GUJE600723CI3","GUJE600723HGTZMR03","ERNESTO GUZMAN JIMENEZ","11DPT0001Q",0,0,0,0,0,0,0,1,0,0,0,0,0,0,0,0,0,0,36480.6]
[null,"GUANAJUATO","HEPM8111294E4","HEPM811129HGTRRG03","MIGUEL ANGEL HERNANDEZ PEREZ","11DPT0001Q",0,0,0,0,0,0,0,1,0,0,0,0,0,0,0,0,0,0,29612.660000000003]
[null,"GUANAJUATO","JISS660630UT8","JISS660630HGTMNR01","SERGIO JIMENEZ SANCHEZ","11DPT0001Q",0,0,0,0,0,0,0,1,0,0,0,0,0,0,0,0,0,0,20591.37]
[null,"GUANAJUATO","LAML7310086Z6","LAML731008MGTRNR00","LAURA LARA MANCERA","11DPT0001Q",0,0,0,0,0,0,0,1,0,0,0,0,0,0,0,0,0,0,31105.27]
[null,"GUANAJUATO","MAMA770820UT0","MAMA770820MGTRRN06","ANA LILIA MARTINEZ MARTINEZ","11DPT0001Q",0,0,0,0,0,0,0,1,0,0,0,0,0,0,0,0,0,0,26455.980000000003]
[null,"GUANAJUATO","MARR660925MG9","MARR660925MGTRDC04","ROCIO MARTINEZ RODRIGUEZ","11DPT0001Q",0,0,0,0,0,0,0,1,0,0,0,0,0,0,0,0,0,0,22576.22]
[null,"GUANAJUATO","MASJ651012DZ4","MASJ651012HVZRNN09","JUAN CARLOS MARTINEZ SANTOS","11DPT0001Q",0,0,0,0,0,0,0,1,0,0,0,0,0,0,0,0,0,0,19633.239999999998]
[null,"GUANAJUATO","MOHD5903208E0","MOHD590320HMCCRL05","JOSE DOLORES GUADALUPE MOCTEZUMA HERNANDEZ","11DPT0001Q",0,0,0,0,0,0,0,1,0,0,0,0,0,0,0,0,0,0,22083.26]
[null,"GUANAJUATO","MOPL8106219G5","MOPL810621MGTRLD07","LIDIA MORENO PALOALTO","11DPT0001Q",0,0,0,0,0,0,0,1,0,0,0,0,0,0,0,0,0,0,21898.410000000003]
[null,"GUANAJUATO","OIBM740215HY9","OIBM740215MGTRRR07","MIRIAM ORTIZ BARROSO","11DPT0001Q",0,0,0,0,0,0,0,1,0,0,0,0,0,0,0,0,0,0,35537.93]
[null,"GUANAJUATO","PAGJ820614HB3","PAGJ820614MGTLRN07","JUANA ADRIANA PALOALTO GARCIA","11DPT0001Q",0,0,0,0,0,0,0,1,0,0,0,0,0,0,0,0,0,0,17183.21]
[null,"GUANAJUATO","PEGR811217KS9","PEGR811217HGTRRC00","RICARDO PEREZ GARCIA","11DPT0001Q",0,0,0,0,0,0,0,1,0,0,0,0,0,0,0,0,0,0,15554]
[null,"GUANAJUATO","RAGM860115N6A","RAGM860115HGTMRR00","MAURO RAMIREZ GARCIA","11DPT0001Q",0,0,0,0,0,0,0,1,0,0,0,0,0,0,0,0,0,0,19619.25]
[null,"GUANAJUATO","RAGL820420UF7","RAGL820420MGTMMR03","LOURDES MIRELLA RAMOS GOMEZ","11DPT0001Q",0,0,0,0,0,0,0,1,0,0,0,0,0,0,0,0,0,0,28354.550000000003]
[null,"GUANAJUATO","RALG600418P69","RALG600418MGTMPD09","MARIA GUADALUPE RAMOS LOPEZ","11DPT0001Q",0,0,0,0,0,0,0,1,0,0,0,0,0,0,0,0,0,0,31105.27]
[null,"GUANAJUATO","RECT770406EE9","RECT770406MMNNHR04","TERESITA DEL NIÑO JESUS RENTERIA CHAVEZ","11DPT0001Q",0,0,0,0,0,0,0,1,0,0,0,0,0,0,0,0,0,0,20827.04]
[null,"GUANAJUATO","RICM6610087I3","RICM661008MGTSSR09","MARIBEL RIOS CASTRO","11DPT0001Q",0,0,0,0,0,0,0,1,0,0,0,0,0,0,0,0,0,0,19945.030000000002]
[null,"GUANAJUATO","ROSC730321AY9","ROSC730321HGTSLR07","JOSE CRUZ ROSALES SOLORZANO","11DPT0001Q",0,0,0,0,0,0,0,1,0,0,0,0,0,0,0,0,0,0,12667.1]
[null,"GUANAJUATO","SACJ630711ERA","SACJ630711MGTNRN08","JUANA PATRICIA SANCHEZ CORNEJO","11DPT0001Q",0,0,0,0,0,0,0,1,0,0,0,0,0,0,0,0,0,0,22762.3]
[null,"GUANAJUATO","SAGB671230SK2","SAGB671230MDFNRL01","BLANCA ELBA SANCHEZ GARCIA","11DPT0001Q",0,0,0,0,0,0,0,1,0,0,0,0,0,0,0,0,0,0,17998.09]
[null,"GUANAJUATO","TOOL570825A45","TOOL570825HOCRRS04","LUIS FIDEL TORRES ORDAZ","11DPT0001Q",0,0,0,0,0,0,0,1,0,0,0,0,0,0,0,0,0,0,7591.9400000000005]
[null,"GUANAJUATO","VEGC620316675","VEGC620316MJCLTR03","CRISTINA VELASCO GUTIERREZ","11DPT0001Q",0,0,0,0,0,0,0,1,0,0,0,0,0,0,0,0,0,0,15068.66]
[null,"GUANAJUATO","VIRE830228NR9","VIRE830228HGTLDD01","EDUARDO VILLAFAÑA RODRIGUEZ","11DPT0001Q",0,0,0,0,0,0,0,1,0,0,0,0,0,0,0,0,0,0,11400.380000000001]
[null,"GUANAJUATO","CAEL691012SG8","CAEL691012MDFRST01","LETICIA CARMONA ESPINOSA","11DPT0001Q",0,0,0,0,0,0,0,1,0,0,0,0,0,0,0,0,0,0,15707.160000000002]
[null,"GUANAJUATO","LOGJ711211E25","LOGJ711211HGTMVN07","JUAN LOMAS GUEVARA","11DPT0001Q",0,0,0,0,0,0,0,1,0,0,0,0,0,0,0,0,0,0,25010.6]
[null,"GUANAJUATO","ROVD750821HSA","ROVD750821MMNCLM06","DAMARY BERENICE ROCHA VILLAGOMEZ","11DPT0001Q",0,0,0,0,0,0,0,1,0,0,0,0,0,0,0,0,0,0,13221.529999999999]
[null,"GUANAJUATO","MACM811125B26","MACM811125MGTSRR00","MARLENE SELENE MASCOTTE CRUZ","11DPT0001Q",0,0,0,0,0,0,0,1,0,0,0,0,0,0,0,0,0,0,17775.510000000002]
[null,"GUANAJUATO","COVE740314GR2","COVE740314HGTRZN07","ENRIQUE CORTEZ VAZQUEZ","11DPT0001Q",0,0,0,0,0,0,0,1,0,0,0,0,0,0,0,0,0,0,10872.470000000001]
[null,"GUANAJUATO","TUMJ870625262","TUMJ870625HGTLLF00","JAFET GASSEN TULA MALDONADO","11DPT0001Q",0,0,0,0,0,0,0,1,0,0,0,0,0,0,0,0,0,0,13433.02]
[null,"GUANAJUATO","RORM810208UU3","RORM810208HGTCCR04","MARTIN RAFAEL ROCHA RICO","11DPT0001Q",0,0,0,0,0,0,0,1,0,0,0,0,0,0,0,0,0,0,17539.830000000002]
[null,"GUANAJUATO","RORL820606UU0","RORL820606HGTDBS06","LUIS FERNANDO RODRIGUEZ ROBLES","11DPT0001Q",0,0,0,0,0,0,0,1,0,0,0,0,0,0,0,0,0,0,9489.64]
[null,"GUANAJUATO","JIEC831030A73","JIEC831030MGTMSR07","MARIA CRISTHIAN JIMENEZ ESQUEDA","11DPT0001Q",0,0,0,0,0,0,0,1,0,0,0,0,0,0,0,0,0,0,25304.719999999998]
[null,"GUANAJUATO","CABD840721MI3","CABD840721HGTSNN09","DANIEL CASIQUE BUENAVISTA","11DPT0001Q",0,0,0,0,0,0,0,1,0,0,0,0,0,0,0,0,0,0,9074.83]
[null,"GUANAJUATO","CARJ7608215KA","CARJ760821HTLRDN05","JOSE JUAN CARRILLO RODRIGUEZ","11DPT0001Q",0,0,0,0,0,0,0,1,0,0,0,0,0,0,0,0,0,0,12426.7]
[null,"GUANAJUATO","CAOL581027513","CAOL581027HGTMLS01","JOSE LUIS CAMPOS OLALDE","11DPT0001Q",0,0,0,0,0,0,0,1,0,0,0,0,0,0,0,0,0,0,23095.350000000002]
[null,"GUANAJUATO","FEHE800724TQ5","FEHE800724HGTRRD06","EDUARDO FERNANDEZ HERNANDEZ","11DPT0001Q",0,0,0,0,0,0,0,1,0,0,0,0,0,0,0,0,0,0,12784.920000000002]
[null,"GUANAJUATO","HEAM501110PP1","HEAM501110MDFRRN05","MINERVA HERNANDEZ ARMENDARIZ","11DPT0001Q",0,0,0,0,0,0,0,1,0,0,0,0,0,0,0,0,0,0,19000.650000000001]
[null,"GUANAJUATO","LOJR731229QW3","LOJR731229HGTPRC05","RICARDO LOPEZ JUAREZ","11DPT0001Q",0,0,0,0,0,0,0,1,0,0,0,0,0,0,0,0,0,0,25216.35]
[null,"GUANAJUATO","MEHE811224IH7","MEHE811224HGTNRM08","EMMANUEL MENDOZA HERNANDEZ","11DPT0001Q",0,0,0,0,0,0,0,1,0,0,0,0,0,0,0,0,0,0,19471.97]
[null,"GUANAJUATO","NUHG820619NB2","NUHG820619MGTXRR08","GRACIELA GUADALUPE NUÑEZ HERNANDEZ","11DPT0001Q",0,0,0,0,0,0,0,1,0,0,0,0,0,0,0,0,0,0,15936.970000000001]
[null,"GUANAJUATO","PIZM740723DV9","PIZM740723MGTZMR06","MIRYAM PIZANO ZAMORA","11DPT0001Q",0,0,0,0,0,0,0,1,0,0,0,0,0,0,0,0,0,0,18352.559999999998]
[null,"GUANAJUATO","ROCJ841011870","ROCJ841011MDFDSS04","MARIA DE JESUS RODRIGUEZ CASTRO","11DPT0001Q",0,0,0,0,0,0,0,1,0,0,0,0,0,0,0,0,0,0,6451.37]
[null,"GUANAJUATO","ZAVJ481005MS5","ZAVJ481005HGTVLS09","J. JESUS ZAVALA VILLAGOMEZ","11DPT0001Q",0,0,0,0,0,0,0,1,0,0,0,0,0,0,0,0,0,0,11135.26]
[null,"GUANAJUATO","SAAF940310IF2","SAAF940310HGTNCR07","FRANCISCO JAVIER SANCHEZ ACOSTA","11DPT0001Q",0,0,0,0,0,0,0,1,0,0,0,0,0,0,0,0,0,0,7046.43]
[null,"GUANAJUATO","AOVI670402NJA","AOVI670402HGTCZS07","ISMAEL ACOSTA VAZQUEZ","11DPT0002P",0,0,0,0,0,0,0,1,0,0,0,0,0,0,0,0,0,0,24601.940000000002]
[null,"GUANAJUATO","AUGJ550312251","AUGJ550312HGTGTR04","JORGE AGUILERA GUTIERREZ","11DPT0002P",0,0,0,0,0,0,0,1,0,0,0,0,0,0,0,0,0,0,32261.320000000003]
[null,"GUANAJUATO","AAGC731126M29","AAGC731126HDFLNN07","CONRRADO ARTURO ALVAREZ GONZALEZ","11DPT0002P",0,0,0,0,0,0,0,1,0,0,0,0,0,0,0,0,0,0,4646.1200000000008]
[null,"GUANAJUATO","CARS710511U36","CARS710511HGTMNR10","SERGIO ARTURO CAMPOS RANGEL","11DPT0002P",0,0,0,0,0,0,0,1,0,0,0,0,0,0,0,0,0,0,14316.25]
[null,"GUANAJUATO","CAEL721019IZ9","CAEL721019MGTSLL08","LILIA ISELA CASTILLO ELIZARRARAZ","11DPT0002P",0,0,0,0,0,0,0,1,0,0,0,0,0,0,0,0,0,0,25540.33]
[null,"GUANAJUATO","CAMH790325MK2","CAMH790325HGTSSC09","HECTOR CASTRO MOSQUEDA","11DPT0002P",0,0,0,0,0,0,0,1,0,0,0,0,0,0,0,0,0,0,23548.420000000002]
[null,"GUANAJUATO","CECE690308KZ9","CECE690308HGTRRL05","ELIAS CERVANTES CRUZ","11DPT0002P",0,0,0,0,0,0,0,1,0,0,0,0,0,0,0,0,0,0,15368.73]
[null,"GUANAJUATO","CAHJ750812FB7","CAHJ750812HGTHRR09","JORGE ALEJANDRO CHAGOYA HERNANDEZ","11DPT0002P",0,0,0,0,0,0,0,1,0,0,0,0,0,0,0,0,0,0,14637.3]
[null,"GUANAJUATO","CILB730402N95","CILB730402MGTSPL08","BLANCA ESTELA GUILLERMINA CISNEROS LOPEZ","11DPT0002P",0,0,0,0,0,0,0,1,0,0,0,0,0,0,0,0,0,0,31121.460000000003]
[null,"GUANAJUATO","CILG720124JZ9","CILG720124MGTSPD05","MA GUADALUPE CISNEROS LOPEZ","11DPT0002P",0,0,0,0,0,0,0,1,0,0,0,0,0,0,0,0,0,0,31846.559999999998]
[null,"GUANAJUATO","COAA820127CJ8","COAA820127MGTRYN00","ANA ERICKA CORRALES AYALA","11DPT0002P",0,0,0,0,0,0,0,1,0,0,0,0,0,0,0,0,0,0,15592.199999999999]
[null,"GUANAJUATO","COCJ790301RG5","COCJ790301HGTRRN06","JOSE JUAN CORRALES CORONA","11DPT0002P",0,0,0,0,0,0,0,1,0,0,0,0,0,0,0,0,0,0,14466.52]
[null,"GUANAJUATO","COMI550105UFA","COMI550105MVZRRS01","MARIA ISABEL CORTES MARTINEZ","11DPT0002P",0,0,0,0,0,0,0,1,0,0,0,0,0,0,0,0,0,0,20960.2]
[null,"GUANAJUATO","CUTP651030E94","CUTP651030HGTRRB03","PABLO CRUZ TORREZ","11DPT0002P",0,0,0,0,0,0,0,1,0,0,0,0,0,0,0,0,0,0,18234.73]
[null,"GUANAJUATO","DICI670401TA1","DICI670401MGTZMR00","IRENE DIAZ CAMPOS","11DPT0002P",0,0,0,0,0,0,0,1,0,0,0,0,0,0,0,0,0,0,3439.13]
[null,"GUANAJUATO","DIJT521003PE9","DIJT521003MVZZCR03","MARIA TERESITA DIAZ JACOME","11DPT0002P",0,0,0,0,0,0,0,1,0,0,0,0,0,0,0,0,0,0,34773.67]
[null,"GUANAJUATO","DOMN670802UR9","DOMN670802MGTMNT03","NATALIA DE LOS ANGELES DOMINGUEZ MANZANO","11DPT0002P",0,0,0,0,0,0,0,1,0,0,0,0,0,0,0,0,0,0,1324.33]
[null,"GUANAJUATO","EIVJ610404DLA","EIVJ610404HDFLLR08","JORGE ALBERTO ELIZARRARAS VILLALPANDO","11DPT0002P",0,0,0,0,0,0,0,1,0,0,0,0,0,0,0,0,0,0,32073.510000000002]
[null,"GUANAJUATO","EIVJ6412112B7","EIVJ641211HGTLLN00","JUAN CARLOS ELIZARRARAZ VILLALPANDO","11DPT0002P",0,0,0,0,0,0,0,1,0,0,0,0,0,0,0,0,0,0,20966.32]
[null,"GUANAJUATO","EUGC8109022K7","EUGC810902HGTSZS09","CESAR JAVIER ESQUIVEL GUZMAN","11DPT0002P",0,0,0,0,0,0,0,1,0,0,0,0,0,0,0,0,0,0,13842.75]
[null,"GUANAJUATO","EUQJ600614JNA","EUQJ600614HDFSRN05","JUAN MIGUEL ESQUIVEL QUIROZ","11DPT0002P",0,0,0,0,0,0,0,1,0,0,0,0,0,0,0,0,0,0,21419.269999999997]
[null,"GUANAJUATO","EAGA611030B76","EAGA611030HGTSTN01","ANTONIO MARTIN ESTRADA GUTIERREZ","11DPT0002P",0,0,0,0,0,0,0,1,0,0,0,0,0,0,0,0,0,0,18626.53]
[null,"GUANAJUATO","FAAJ620222E7A","FAAJ620222HGTRRS08","JOSE FRANCO ARREDONDO","11DPT0002P",0,0,0,0,0,0,0,1,0,0,0,0,0,0,0,0,0,0,33143.47]
[null,"GUANAJUATO","GAMM750120RB8","GAMM750120MGTRSR08","MARTHA ELBA GARCIA MOSQUEDA","11DPT0002P",0,0,0,0,0,0,0,1,0,0,0,0,0,0,0,0,0,0,31838.949999999997]
[null,"GUANAJUATO","GULJ780404F75","GULJ780404HGTRGR06","JORGE GUADALUPE GUERRERO LAGUNA","11DPT0002P",0,0,0,0,0,0,0,1,0,0,0,0,0,0,0,0,0,0,6497.5000000000009]
[null,"GUANAJUATO","GUVG640807PZ4","GUVG640807MDFZRB04","GABRIELA GUIZAR VARGAS","11DPT0002P",0,0,0,0,0,0,0,1,0,0,0,0,0,0,0,0,0,0,16087.780000000002]
[null,"GUANAJUATO","HERD520203AD0","HERD520203MSLRSB04","DEBORA HERN RUSSELL","11DPT0002P",0,0,0,0,0,0,0,1,0,0,0,0,0,0,0,0,0,0,19501.440000000002]
[null,"GUANAJUATO","HEGV820527FN1","HEGV820527MGTRRR00","VERONICA HERNANDEZ GARCIA","11DPT0002P",0,0,0,0,0,0,0,1,0,0,0,0,0,0,0,0,0,0,2979.75]
[null,"GUANAJUATO","HERR700403DU0","HERR700403HGTRMC07","RICARDO MARTIN HERNANDEZ RAMIREZ","11DPT0002P",0,0,0,0,0,0,0,1,0,0,0,0,0,0,0,0,0,0,12963.560000000001]
[null,"GUANAJUATO","HERG630310IB0","HERG630310MGTRMB03","MARIA GABRIELA SUSANA HERRERA ZUBIETA ROMERO","11DPT0002P",0,0,0,0,0,0,0,1,0,0,0,0,0,0,0,0,0,0,22889.61]
[null,"GUANAJUATO","LARJ570720TF2","LARJ570720HGTGDR07","JORGE ARTURO LAGUNA RODRIGUEZ","11DPT0002P",0,0,0,0,0,0,0,1,0,0,0,0,0,0,0,0,0,0,13718.599999999999]
[null,"GUANAJUATO","LEHB680513J91","LEHB680515MDFDRR01","BRENDA LEDESMA HERNANDEZ","11DPT0002P",0,0,0,0,0,0,0,1,0,0,0,0,0,0,0,0,0,0,18669.440000000002]
[null,"GUANAJUATO","MAST621028SCA","MAST621028MGTRTR12","MA. TERESA MARTINEZ SOTO","11DPT0002P",0,0,0,0,0,0,0,1,0,0,0,0,0,0,0,0,0,0,12892.95]
[null,"GUANAJUATO","MASS590809UI8","MASS590809HGTRTL08","SALVADOR MARTINEZ SOTO","11DPT0002P",0,0,0,0,0,0,0,1,0,0,0,0,0,0,0,0,0,0,23881.85]
[null,"GUANAJUATO","MATM690314JA0","MATM690314MGTRRT12","MA. MATILDE MARTINEZ TORRES","11DPT0002P",0,0,0,0,0,0,0,1,0,0,0,0,0,0,0,0,0,0,22583.9]
[null,"GUANAJUATO","MEMJ801218ND2","MEMJ801218HGTNRS09","JOSE DE JESUS MENDIOLA MARTINEZ","11DPT0002P",0,0,0,0,0,0,0,1,0,0,0,0,0,0,0,0,0,0,17933.41]
[null,"GUANAJUATO","MOHT651003EA6","MOHT651003MGTRRR13","MA. TERESA MORENO HERNANDEZ","11DPT0002P",0,0,0,0,0,0,0,1,0,0,0,0,0,0,0,0,0,0,12441.600000000002]
[null,"GUANAJUATO","NAVG770820NG1","NAVG770820MGTVGB02","GABRIELA NAVA VIGIL","11DPT0002P",0,0,0,0,0,0,0,1,0,0,0,0,0,0,0,0,0,0,21915.390000000003]
[null,"GUANAJUATO","OASF640805DW4","OASF640805HGTCTR00","FRANCISCO JAVIER OCAMPO SOTO","11DPT0002P",0,0,0,0,0,0,0,1,0,0,0,0,0,0,0,0,0,0,14673.900000000001]
[null,"GUANAJUATO","PEMA591231QP8","PEMA591231HGTRLN01","ANDREZ PEREZ MELENDEZ","11DPT0002P",0,0,0,0,0,0,0,1,0,0,0,0,0,0,0,0,0,0,13718.599999999999]
[null,"GUANAJUATO","RISM640319LE9","RISM640319HGTCRR02","JOSE MARTIN RICO SERRITEÑO","11DPT0002P",0,0,0,0,0,0,0,1,0,0,0,0,0,0,0,0,0,0,8837.5]
[null,"GUANAJUATO","RIMA811003E55","RIMA811003MGTVRN05","ANA PAOLA RIVADENEYRA MARTINEZ","11DPT0002P",0,0,0,0,0,0,0,1,0,0,0,0,0,0,0,0,0,0,17969.599999999999]
[null,"GUANAJUATO","SAVR640908IQA","SAVR640908HGTNGB09","ROBERTO SANTILLAN VEGA","11DPT0002P",0,0,0,0,0,0,0,1,0,0,0,0,0,0,0,0,0,0,16186.32]
[null,"GUANAJUATO","SOAO850607U46","SOAO850607HGTTGM04","OMAR DAVID SOTO AGUIRRE","11DPT0002P",0,0,0,0,0,0,0,1,0,0,0,0,0,0,0,0,0,0,12328.789999999999]
[null,"GUANAJUATO","VILL6707201Q6","VILL670720HGTTNS08","JOSE LUIS VITAL LEON","11DPT0002P",0,0,0,0,0,0,0,1,0,0,0,0,0,0,0,0,0,0,24329.030000000002]
[null,"GUANAJUATO","ZAMD580804HX2","ZAMD580804HGTRRV01","DAVID ZARAGOZA MARTINEZ","11DPT0002P",0,0,0,0,0,0,0,1,0,0,0,0,0,0,0,0,0,0,16554.169999999998]
[null,"GUANAJUATO","COCF7905248G5","COCF790524HGTNRR07","FRANCISCO JAVIER CONTRERAS CERVANTES","11DPT0002P",0,0,0,0,0,0,0,1,0,0,0,0,0,0,0,0,0,0,20953.690000000002]
[null,"GUANAJUATO","COMS721010P5A","COMS721010MGTRSL09","SILVIA CORDOBA MOSQUEDA","11DPT0002P",0,0,0,0,0,0,0,1,0,0,0,0,0,0,0,0,0,0,22756.05]
[null,"GUANAJUATO","HERA5904202S0","HERA590420HGTRSN04","JOSE ANTONIO HERRERA ROSALES","11DPT0002P",0,0,0,0,0,0,0,1,0,0,0,0,0,0,0,0,0,0,3973]
[null,"GUANAJUATO","OIGE810723JD5","OIGE810723MVZRRD02","EDITH ORTIZ GARCIA","11DPT0002P",0,0,0,0,0,0,0,1,0,0,0,0,0,0,0,0,0,0,29397.29]
[null,"GUANAJUATO","OIZG530609RR8","OIZG530609HGTRFL01","GUILLERMO ORTIZ ZAFRA","11DPT0002P",0,0,0,0,0,0,0,1,0,0,0,0,0,0,0,0,0,0,27131.200000000004]
[null,"GUANAJUATO","GORM820608RC9","GORC820608MGTNMN03","MA. CONCEPCION GONZALEZ RAMIREZ","11DPT0002P",0,0,0,0,0,0,0,1,0,0,0,0,0,0,0,0,0,0,15967.92]
[null,"GUANAJUATO","GUVJ730410LD4","GUVJ730410MGTZRD08","JUDITH GUIZAR VARGAS","11DPT0002P",0,0,0,0,0,0,0,1,0,0,0,0,0,0,0,0,0,0,17321.52]
[null,"GUANAJUATO","JAOP740625985","JAOP740625MGTMLT05","PATRICIA JAIME OLVERA","11DPT0002P",0,0,0,0,0,0,0,1,0,0,0,0,0,0,0,0,0,0,20764.32]
[null,"GUANAJUATO","ROVC800502SP1","ROVC800502MGTDGL04","CLAUDIA ANGELICA RODRIGUEZ VEGA","11DPT0002P",0,0,0,0,0,0,0,1,0,0,0,0,0,0,0,0,0,0,5120.79]
[null,"GUANAJUATO","DARE870421E95","DARE870421MGTMDD03","EDUARDINA ESAIG DAMIAN RODRIGUEZ","11DPT0002P",0,0,0,0,0,0,0,1,0,0,0,0,0,0,0,0,0,0,29326.810000000005]
[null,"GUANAJUATO","SAGM820626E90","SAGR820626MGTNNS28","MA. DEL ROSARIO SANCHEZ GONZALEZ","11DPT0002P",0,0,0,0,0,0,0,1,0,0,0,0,0,0,0,0,0,0,31793.58]
[null,"GUANAJUATO","LOCJ790515Q78","LOCJ790515HGTPHN00","JUAN ANDRES LOPEZ CHAVEZ","11DPT0002P",0,0,0,0,0,0,0,1,0,0,0,0,0,0,0,0,0,0,26296.29]
[null,"GUANAJUATO","DEBJ851217D4A","DEBJ851217MGTLLS09","JUSELY GUADALUPE DELGADO BELTRAN","11DPT0002P",0,0,0,0,0,0,0,1,0,0,0,0,0,0,0,0,0,0,33660.550000000003]
[null,"GUANAJUATO","JOSJ820529NC7","JOSJ820529HNTYNN07","JONATHAN JOYA DE LA SANCHA","11DPT0002P",0,0,0,0,0,0,0,1,0,0,0,0,0,0,0,0,0,0,30940.950000000004]
[null,"GUANAJUATO","SALP780917IZ3","SALP780917HGTNRD04","PEDRO JESUS SANTIAGO LARA","11DPT0002P",0,0,0,0,0,0,0,1,0,0,0,0,0,0,0,0,0,0,25982.270000000004]
[null,"GUANAJUATO","GAVJ660521UR1","GAVJ660521HGTRGN08","JUAN CARLOS GARCIA VEGA","11DPT0002P",0,0,0,0,0,0,0,1,0,0,0,0,0,0,0,0,0,0,17815.580000000002]
[null,"GUANAJUATO","COMJ7702043T7","COMJ770204HGTRRL02","JOEL DE JESUS CORONA MORENO","11DPT0002P",0,0,0,0,0,0,0,1,0,0,0,0,0,0,0,0,0,0,22547.420000000002]
[null,"GUANAJUATO","LURA851031520","LURA851031HGTNML05","JOSE ALFONSO LUNA RAMIREZ","11DPT0002P",0,0,0,0,0,0,0,1,0,0,0,0,0,0,0,0,0,0,4115.08]
[null,"GUANAJUATO","GAEA800524RQA","GAEA800524HGTRLL00","JOSE ALFREDO GRANADOS ELIZARRARAZ","11DPT0002P",0,0,0,0,0,0,0,1,0,0,0,0,0,0,0,0,0,0,11026.35]
[null,"GUANAJUATO","EURT6610036LA","EURT661003MMNSYR05","TERESA ESQUIVEL REYES","11DPT0002P",0,0,0,0,0,0,0,1,0,0,0,0,0,0,0,0,0,0,12440.11]
[null,"GUANAJUATO","AAPA590710LA8","AAPA590710HGTNNL02","JOSE ALEJANDRO ANDRADE PONCE","11DPT0003O",0,0,0,0,0,0,0,1,0,0,0,0,0,0,0,0,0,0,23653.850000000002]
[null,"GUANAJUATO","AAVC870605JF8","AAVC870605HGTNLR03","CARLOS ALBERTO ANDRADE VALDIVIA","11DPT0003O",0,0,0,0,0,0,0,1,0,0,0,0,0,0,0,0,0,0,8157.6399999999994]
[null,"GUANAJUATO","AAPJ8809041C9","AAPJ880904HGTRTN01","JUAN MIGUEL ARANDA PATLAN","11DPT0003O",0,0,0,0,0,0,0,1,0,0,0,0,0,0,0,0,0,0,18145.27]
[null,"GUANAJUATO","AORS650107A96","AORS650107MGTRML00","MARIA SOLEDAD ARROYO RAMIREZ","11DPT0003O",0,0,0,0,0,0,0,1,0,0,0,0,0,0,0,0,0,0,19163.68]
[null,"GUANAJUATO","AABR750608IB4","AABR750608MGTYRS01","ROSA MARGARITA AYALA BARRERA","11DPT0003O",0,0,0,0,0,0,0,1,0,0,0,0,0,0,0,0,0,0,24325.81]
[null,"GUANAJUATO","BAFL730321MR1","BAFL730321HGTRLS09","LUIS EDUARDO BARRERA FLORES","11DPT0003O",0,0,0,0,0,0,0,1,0,0,0,0,0,0,0,0,0,0,19009.150000000001]
[null,"GUANAJUATO","BEMG7505027F8","BEMG750502HGTTNR02","GERMAN BETANCOURT MENDEZ","11DPT0003O",0,0,0,0,0,0,0,1,0,0,0,0,0,0,0,0,0,0,17889.650000000001]
[null,"GUANAJUATO","BORA580910H59","BORA580910MGTNVN06","MARIA DE LOS ANGELES BONILLA RIVERA","11DPT0003O",0,0,0,0,0,0,0,1,0,0,0,0,0,0,0,0,0,0,23500.71]
[null,"GUANAJUATO","CAVM6302079D4","CAVM630207MDFLLR04","MARIANA FEDERICA CALDERON VILLALOBOS","11DPT0003O",0,0,0,0,0,0,0,1,0,0,0,0,0,0,0,0,0,0,16818.86]
[null,"GUANAJUATO","CAMA720409D58","CAMA720409HGTMRN04","JOSE ANTONIO CAMPOS MORENO","11DPT0003O",0,0,0,0,0,0,0,1,0,0,0,0,0,0,0,0,0,0,16430.39]
[null,"GUANAJUATO","COHV730429DPA","COHV730429MGTRDR01","VIRGINIA FABIOLA CORNEJO HIDALGO","11DPT0003O",0,0,0,0,0,0,0,1,0,0,0,0,0,0,0,0,0,0,21960.02]
[null,"GUANAJUATO","COFT581003P73","COFT581003MDFRLR01","MA TERESA CORTES FLORES","11DPT0003O",0,0,0,0,0,0,0,1,0,0,0,0,0,0,0,0,0,0,13203.25]
[null,"GUANAJUATO","CURP6903018I5","CURP690301MGTRYT08","PATRICIA DE LA CRUZ REYES","11DPT0003O",0,0,0,0,0,0,0,1,0,0,0,0,0,0,0,0,0,0,16821.46]
[null,"GUANAJUATO","DUCC5804306T4","DUCC580430HGTXSR01","CARLOS VICTOR DUEÑAS CASTILLO","11DPT0003O",0,0,0,0,0,0,0,1,0,0,0,0,0,0,0,0,0,0,7850.94]
[null,"GUANAJUATO","EURA860418KB7","EURA860418HGTSDL09","ALBERTO ESQUIVEL RODRIGUEZ","11DPT0003O",0,0,0,0,0,0,0,1,0,0,0,0,0,0,0,0,0,0,8472.2200000000012]
[null,"GUANAJUATO","FAAJ5909146M0","FAAJ590914HGTLML09","JOEL FALCON AMADOR","11DPT0003O",0,0,0,0,0,0,0,1,0,0,0,0,0,0,0,0,0,0,18288.910000000003]
[null,"GUANAJUATO","FUBM760807455","FUBM760807MGTNRN06","MONICA GUADALUPE FUENTES BARRON","11DPT0003O",0,0,0,0,0,0,0,1,0,0,0,0,0,0,0,0,0,0,25456.989999999998]
[null,"GUANAJUATO","GALR880422QE7","GALR880422HGTRPG08","ROGELIO GARCIA LOPEZ","11DPT0003O",0,0,0,0,0,0,0,1,0,0,0,0,0,0,0,0,0,0,19287.669999999998]
[null,"GUANAJUATO","GAGE660725EF1","GAGE660725MGTYNG09","MA EUGENIA GAYTAN GONZALEZ","11DPT0003O",0,0,0,0,0,0,0,1,0,0,0,0,0,0,0,0,0,0,26141.18]
[null,"GUANAJUATO","GOBE5103218X0","GOBE510321HGTNRR07","ERNESTO GONZALEZ BERISTAIN","11DPT0003O",0,0,0,0,0,0,0,1,0,0,0,0,0,0,0,0,0,0,30592.89]
[null,"GUANAJUATO","GONS7404246U0","GONS740424MGTNXS08","SUSANA MAGNOLIA GONZALEZ NUÑEZ","11DPT0003O",0,0,0,0,0,0,0,1,0,0,0,0,0,0,0,0,0,0,27261.41]
[null,"GUANAJUATO","HEAA581022HVA","HEAA581022HMCRTL07","JOSE ALBERTO HERRERA ATILANO","11DPT0003O",0,0,0,0,0,0,0,1,0,0,0,0,0,0,0,0,0,0,9073.56]
[null,"GUANAJUATO","JUGL660124951","JUGL660124MGTRNT19","LETICIA JUAREZ GONZALEZ","11DPT0003O",0,0,0,0,0,0,0,1,0,0,0,0,0,0,0,0,0,0,15534.260000000002]
[null,"GUANAJUATO","LAGG811206L76","LAGG811206MGTRND04","MARIA GUADALUPE LARA GONZALEZ","11DPT0003O",0,0,0,0,0,0,0,1,0,0,0,0,0,0,0,0,0,0,14213.240000000002]
[null,"GUANAJUATO","LOGG700109MF1","LOGG700109MGTPRD02","MA. GUADALUPE LOPEZ GARCIA","11DPT0003O",0,0,0,0,0,0,0,1,0,0,0,0,0,0,0,0,0,0,15280.07]
[null,"GUANAJUATO","MAAJ840617R99","MAAJ840617HGTRLN05","JUAN GUILLERMO MARTIN DEL CAMPO ALMENDARIZ","11DPT0003O",0,0,0,0,0,0,0,1,0,0,0,0,0,0,0,0,0,0,15428.81]
[null,"GUANAJUATO","MAGC731126BM0","MAGC731126HVZRTR04","CARLOS ROBERTO MARTINEZ GUTIERREZ","11DPT0003O",0,0,0,0,0,0,0,1,0,0,0,0,0,0,0,0,0,0,8540.75]
[null,"GUANAJUATO","MESF820630A32","MESF820630HGTNLR02","FRANCISCO JAVIER MENDOZA SOLORZANO","11DPT0003O",0,0,0,0,0,0,0,1,0,0,0,0,0,0,0,0,0,0,14770.980000000001]
[null,"GUANAJUATO","MOSG830803MK4","MOSG830803MGTJND05","MARIA GUADALUPE JANET MOJICA SANDOVAL","11DPT0003O",0,0,0,0,0,0,0,1,0,0,0,0,0,0,0,0,0,0,16584.23]
[null,"GUANAJUATO","MOQR840307NN2","MOQR840307HGTRRC01","RICARDO MORALES QUIROZ","11DPT0003O",0,0,0,0,0,0,0,1,0,0,0,0,0,0,0,0,0,0,21167.309999999998]
[null,"GUANAJUATO","MUCE6604088C8","MUCE660408HGTXRL04","ELIAS MUÑOZ CORTES","11DPT0003O",0,0,0,0,0,0,0,1,0,0,0,0,0,0,0,0,0,0,12347.75]
[null,"GUANAJUATO","MUCM5801195T2","MUCM580119HGTXMR09","JOSE MARIO MUÑOZ CAMPUSANO","11DPT0003O",0,0,0,0,0,0,0,1,0,0,0,0,0,0,0,0,0,0,7926.1399999999994]
[null,"GUANAJUATO","MUMJ581102QD4","MUMJ581102HGTXRM09","JAIME MUÑOZ MARTINEZ","11DPT0003O",0,0,0,0,0,0,0,1,0,0,0,0,0,0,0,0,0,0,17903.860000000004]
[null,"GUANAJUATO","NAJE70071623A","NAJE700716HGTVMN08","ENRIQUE NAVARRETE JIMENEZ","11DPT0003O",0,0,0,0,0,0,0,1,0,0,0,0,0,0,0,0,0,0,12148.650000000001]
[null,"GUANAJUATO","PARH580204E82","PARH580204HDFDYC09","HECTOR PADILLA REYES","11DPT0003O",0,0,0,0,0,0,0,1,0,0,0,0,0,0,0,0,0,0,12349.41]
[null,"GUANAJUATO","PASE730810KL7","PAXS730810HGTLXR05","SERGIO PLASCENCIA","11DPT0003O",0,0,0,0,0,0,0,1,0,0,0,0,0,0,0,0,0,0,20127.910000000003]
[null,"GUANAJUATO","PUGH6104307WA","PUGH610430HMNRMC01","HECTOR GERARDO PURECO GOMEZ","11DPT0003O",0,0,0,0,0,0,0,1,0,0,0,0,0,0,0,0,0,0,13823.369999999999]
[null,"GUANAJUATO","RAPA580921FZ2","RAPA580921HGTMDR04","AURELIO RAMIREZ PADRON","11DPT0003O",0,0,0,0,0,0,0,1,0,0,0,0,0,0,0,0,0,0,20955.75]
[null,"GUANAJUATO","RAGB840311G83","RAGB840311MGTMTR07","MARIA BERENICE RAMIREZ GUTIERREZ","11DPT0003O",0,0,0,0,0,0,0,1,0,0,0,0,0,0,0,0,0,0,9218.6999999999989]
[null,"GUANAJUATO","ROMB710830FA6","ROMB710830HGTDXN07","JOSE BENITO RODRIGUEZ MUÑOZ","11DPT0003O",0,0,0,0,0,0,0,1,0,0,0,0,0,0,0,0,0,0,12309.330000000002]
[null,"GUANAJUATO","RORM440729KM0","RORM440729HGTDYR00","MARGARITO RODRIGUEZ REYES","11DPT0003O",0,0,0,0,0,0,0,1,0,0,0,0,0,0,0,0,0,0,21613.69]
[null,"GUANAJUATO","ROCU811126UY1","ROCU811126HGTMNR08","URIEL ROMO CONTRERAS","11DPT0003O",0,0,0,0,0,0,0,1,0,0,0,0,0,0,0,0,0,0,29769.749999999996]
[null,"GUANAJUATO","SAGJ781103MJ3","SAGJ781103HGTLRR06","JORGE ARMANDO SALAS GUARDADO","11DPT0003O",0,0,0,0,0,0,0,1,0,0,0,0,0,0,0,0,0,0,15174.65]
[null,"GUANAJUATO","SAHL880928KE7","SAHL880928HGTNRS02","LUIS DAVID SANCHEZ HERNANDEZ","11DPT0003O",0,0,0,0,0,0,0,1,0,0,0,0,0,0,0,0,0,0,20937.849999999999]
[null,"GUANAJUATO","VASO7410292N4","VASO741029HDFLNM02","OMAR VALLARTA SANDOVAL","11DPT0003O",0,0,0,0,0,0,0,1,0,0,0,0,0,0,0,0,0,0,2710.17]
[null,"GUANAJUATO","VAWS480907UT5","VAWS480907MDFRSY01","SYLVIA AGATHE VARGAS WASHINGTON","11DPT0003O",0,0,0,0,0,0,0,1,0,0,0,0,0,0,0,0,0,0,8091.34]
[null,"GUANAJUATO","VAPS6101037B8","VAPS610103HGTZRL05","SALVADOR EUGENIO VAZQUEZ PRECIADO","11DPT0003O",0,0,0,0,0,0,0,1,0,0,0,0,0,0,0,0,0,0,11665.52]
[null,"GUANAJUATO","VESE620331G87","VESE620331HGTRLF03","EFREN VERA SALGADO","11DPT0003O",0,0,0,0,0,0,0,1,0,0,0,0,0,0,0,0,0,0,11420.720000000001]
[null,"GUANAJUATO","GIPE8705187T7","GIPE870518MGTRDR06","ERIKA ELIZABETH GRIMALDO PADILLA","11DPT0003O",0,0,0,0,0,0,0,1,0,0,0,0,0,0,0,0,0,0,22040.3]
[null,"GUANAJUATO","GOJJ751220NG4","GOJJ751220HGTMCL02","JULIO GOMEZ JACOBO","11DPT0003O",0,0,0,0,0,0,0,1,0,0,0,0,0,0,0,0,0,0,4994.5599999999995]
[null,"GUANAJUATO","LOJA720726KJ9","LOJA720726MGTPMN03","ANA CRISTINA LOPEZ JIMENEZ","11DPT0003O",0,0,0,0,0,0,0,1,0,0,0,0,0,0,0,0,0,0,16192.91]
[null,"GUANAJUATO","LOSM721211630","LOSM721211MGTPRR02","MARCELA LOPEZ SORIA","11DPT0003O",0,0,0,0,0,0,0,1,0,0,0,0,0,0,0,0,0,0,6915.4999999999991]
[null,"GUANAJUATO","CARI751102B38","CARI751102HGTSDV01","IVAN ALEJANDRO CASTAÑEDA RODRIGUEZ","11DPT0003O",0,0,0,0,0,0,0,1,0,0,0,0,0,0,0,0,0,0,19428.599999999999]
[null,"GUANAJUATO","VEMJ731231RC5","VEMJ731231HGTLXN19","JUAN MANUEL VELAZQUEZ MUÑOZ","11DPT0003O",0,0,0,0,0,0,0,1,0,0,0,0,0,0,0,0,0,0,18066.29]
[null,"GUANAJUATO","AABJ690919DQ5","AABJ690919MQTYRN07","JUANA ALMA DELIA AYALA BARRERA","11DPT0003O",0,0,0,0,0,0,0,1,0,0,0,0,0,0,0,0,0,0,24095.899999999998]
[null,"GUANAJUATO","CEGC8106038S6","CEGC810603MGTRML03","CLAUDIA PATRICIA CERVANTES GOMEZ","11DPT0003O",0,0,0,0,0,0,0,1,0,0,0,0,0,0,0,0,0,0,14162.44]
[null,"GUANAJUATO","DAZM801018FR0","DAZM801018MGTVMR04","MIRIAM TERESA DAVALOS ZAMORA","11DPT0003O",0,0,0,0,0,0,0,1,0,0,0,0,0,0,0,0,0,0,14831.02]
[null,"GUANAJUATO","FABV830514ES9","FABV830514HGTRLC04","VICTOR ESTEBAN FRAUSTO BOLIO","11DPT0003O",0,0,0,0,0,0,0,1,0,0,0,0,0,0,0,0,0,0,18863.739999999998]
[null,"GUANAJUATO","IUMM800617VC2","IUMM800617MGTSRY06","MYRNA DENISSE ISUSQUIZA MARTINEZ","11DPT0003O",0,0,0,0,0,0,0,1,0,0,0,0,0,0,0,0,0,0,10732.070000000002]
[null,"GUANAJUATO","PAHF740428HK9","PAHF740428HGTDRR00","FRANCISCO JAVIER PADILLA HERNANDEZ","11DPT0003O",0,0,0,0,0,0,0,1,0,0,0,0,0,0,0,0,0,0,14266.340000000004]
[null,"GUANAJUATO","DOBA621219C61","DOBA621219HGTMNL07","ALVARO DOMINGUEZ BONILLA","11DPT0003O",0,0,0,0,0,0,0,1,0,0,0,0,0,0,0,0,0,0,7350.05]
[null,"GUANAJUATO","VEHR8310237SA","VEHR831023HGTGRB01","ROBERTO VEGA HERNANDEZ","11DPT0003O",0,0,0,0,0,0,0,1,0,0,0,0,0,0,0,0,0,0,8604.81]
[null,"GUANAJUATO","GUHM780709MJ2","GUHM780709HGTVRN04","JOSE MANUEL GUEVARA HERNANDEZ","11DPT0003O",0,0,0,0,0,0,0,1,0,0,0,0,0,0,0,0,0,0,8240.1]
[null,"GUANAJUATO","VASR930322QX5","VASR930322HGTLGL04","RAUL VALDIVIA SEGOVIANO","11DPT0003O",0,0,0,0,0,0,0,1,0,0,0,0,0,0,0,0,0,0,5612.7500000000009]
[null,"GUANAJUATO","GOEA700316QV6","GOEA700316HGTNSR05","ARMANDO HERIBERTO GONZALEZ ESPINOSA","11DPT0003O",0,0,0,0,0,0,0,1,0,0,0,0,0,0,0,0,0,0,12577.810000000001]
[null,"GUANAJUATO","RIMM880823M49","RIMM880823HGTVDR03","MARCO ANTONIO RIVERA MEDINA","11DPT0003O",0,0,0,0,0,0,0,1,0,0,0,0,0,0,0,0,0,0,13655.319999999998]
[null,"GUANAJUATO","BEGM830427SW5","BEGM830427MGTCMR00","MARCELINA BECERRA GOMEZ","11DPT0003O",0,0,0,0,0,0,0,1,0,0,0,0,0,0,0,0,0,0,3045.9700000000003]
[null,"GUANAJUATO","FOHG891130G48","FOHG891130HGTLRR02","GERARDO DE JESUS FLORES HERNANDEZ","11DPT0003O",0,0,0,0,0,0,0,1,0,0,0,0,0,0,0,0,0,0,3985.13]
[null,"GUANAJUATO","RAGM6609221S7","RAGM660922HGTMNR07","MAURICIO ANTONIO RAMOS GONZALEZ","11DPT0003O",0,0,0,0,0,0,0,1,0,0,0,0,0,0,0,0,0,0,2710.17]
[null,"GUANAJUATO","RIOM930603P62","RIOM930603MGTVRC06","MICHELLE ELIZABETH RIVERA ORTEGA","11DPT0003O",0,0,0,0,0,0,0,1,0,0,0,0,0,0,0,0,0,0,519.80000000000007]
[null,"GUANAJUATO","DUHJ591027L95","DUHJ591027HGTRRN01","JUAN ANTONIO DURAN HERNANDEZ","11DPT0003O",0,0,0,0,0,0,0,1,0,0,0,0,0,0,0,0,0,0,3711.75]
[null,"GUANAJUATO","MOAA670312HJ8","MOAA670312HGTRFL02","ALBERTO MORALES AFANADOR","11DPT0003O",0,0,0,0,0,0,0,1,0,0,0,0,0,0,0,0,0,0,1060.5]
[null,"GUANAJUATO","DOVA60112825A","DOVA601128HGTMZD09","ADAN JOEL DOMINGUEZ VAZQUEZ","11DPT0003O",0,0,0,0,0,0,0,1,0,0,0,0,0,0,0,0,0,0,554.45000000000005]
[null,"GUANAJUATO","SACM561126DUA","SACM561126HTSLRG14","MIGUEL SALVADOR SALDAÑA CORTEZ","11DPT0003O",0,0,0,0,0,0,0,1,0,0,0,0,0,0,0,0,0,0,1414]
[null,"GUANAJUATO","AAGL820530842","AAGL820530MGTLNR07","LAURA ALDACO GONZALEZ","11DPT0003O",0,0,0,0,0,0,0,1,0,0,0,0,0,0,0,0,0,0,1414]
[null,"GUANAJUATO","AOMR770309JR5","AOMR770309MGTCRS03","ROSAURA ACOSTA MORENO","11DPT0005M",0,0,0,0,0,0,0,1,0,0,0,0,0,0,0,0,0,0,25425.38]
[null,"GUANAJUATO","AULG650807MX2","AULG650807MCLGPD08","MARIA GUADALUPE AGUILAR LOPEZ","11DPT0005M",0,0,0,0,0,0,0,1,0,0,0,0,0,0,0,0,0,0,21761.01]
[null,"GUANAJUATO","AUPL770322NG0","AUPL770322MJCGNR05","LAURA ITZAMARAY AGUIRRE PUENTE","11DPT0005M",0,0,0,0,0,0,0,1,0,0,0,0,0,0,0,0,0,0,27156.760000000002]
[null,"GUANAJUATO","AICF790308Q83","AICF790308HGTMLR01","FERNANDO AMBRIZ COLIN","11DPT0005M",0,0,0,0,0,0,0,1,0,0,0,0,0,0,0,0,0,0,16054.57]
[null,"GUANAJUATO","BASM671211R18","BASM671211MGTCNR06","MARTHA PATRICIA BACA SANCHEZ","11DPT0005M",0,0,0,0,0,0,0,1,0,0,0,0,0,0,0,0,0,0,14271.340000000002]
[null,"GUANAJUATO","BAGG740408RC0","BAGG740408MGTZRB07","GABRIELA BAEZA GARCIA","11DPT0005M",0,0,0,0,0,0,0,1,0,0,0,0,0,0,0,0,0,0,28255.22]
[null,"GUANAJUATO","BAPA800509JH2","BAPA800509HDFRRL06","ALAN BAROJAS PEREZ","11DPT0005M",0,0,0,0,0,0,0,1,0,0,0,0,0,0,0,0,0,0,13632.36]
[null,"GUANAJUATO","BACL660127PY3","BACL660127HGTRNS02","JOSE LUIS BRAVO CANO","11DPT0005M",0,0,0,0,0,0,0,1,0,0,0,0,0,0,0,0,0,0,28486.98]
[null,"GUANAJUATO","CABA581007JI3","CABA581007MMNRZN08","MARIA DE LOS ANGELES CARDENAS BAEZA","11DPT0005M",0,0,0,0,0,0,0,1,0,0,0,0,0,0,0,0,0,0,35537.93]
[null,"GUANAJUATO","CABD570205P26","CABD570205MMNRZL00","MARIA DE LOS DOLORES CARDENAS BAEZA","11DPT0005M",0,0,0,0,0,0,0,1,0,0,0,0,0,0,0,0,0,0,25425.38]
[null,"GUANAJUATO","CAGG711124NT7","CAGG711124MGTRTD19","MARIA GUADALUPE CARDENAS GUTIERREZ","11DPT0005M",0,0,0,0,0,0,0,1,0,0,0,0,0,0,0,0,0,0,15368.2]
[null,"GUANAJUATO","CACR540413CR4","CACR540413HBCSSL00","RAUL CASTAÑEDA CASTRO","11DPT0005M",0,0,0,0,0,0,0,1,0,0,0,0,0,0,0,0,0,0,32047.040000000001]
[null,"GUANAJUATO","CUGV730427G51","CUGV730427HGTLMC00","VICTOR MANUEL CUELLAR GOMEZ","11DPT0005M",0,0,0,0,0,0,0,1,0,0,0,0,0,0,0,0,0,0,28471.34]
[null,"GUANAJUATO","DABG810704HX9","DABG810704HGTMRR08","GERSON FALCAO DAMIAN BRAVO","11DPT0005M",0,0,0,0,0,0,0,1,0,0,0,0,0,0,0,0,0,0,21379.52]
[null,"GUANAJUATO","DIGJ5805018S3","DIGJ580501HGTZTR09","JORGE DIAZ GUTIERREZ","11DPT0005M",0,0,0,0,0,0,0,1,0,0,0,0,0,0,0,0,0,0,16719.71]
[null,"GUANAJUATO","EIDR500307HY1","EIDR500307HGTNLN02","JOSE RENE ENRIQUEZ DELGADO","11DPT0005M",0,0,0,0,0,0,0,1,0,0,0,0,0,0,0,0,0,0,22869.420000000002]
[null,"GUANAJUATO","EANE770730ID6","EANE770730HMNSXD06","EDGAR CUAUHTEMOC ESTRADA NUÑEZ","11DPT0005M",0,0,0,0,0,0,0,1,0,0,0,0,0,0,0,0,0,0,24291.239999999998]
[null,"GUANAJUATO","FAPR6706038JA","FAPR670603HGTRRB03","ROBERTO FRANCIA PEREZ","11DPT0005M",0,0,0,0,0,0,0,1,0,0,0,0,0,0,0,0,0,0,9535.93]
[null,"GUANAJUATO","GABM720316FV9","GABM720316MGTRLR09","MARTHA PATRICIA GARCIA BELTRAN","11DPT0005M",0,0,0,0,0,0,0,1,0,0,0,0,0,0,0,0,0,0,29536.489999999998]
[null,"GUANAJUATO","GABM731224PP4","GABM731224HGTRLG09","MIGUEL ANGEL GARCIA BELTRAN","11DPT0005M",0,0,0,0,0,0,0,1,0,0,0,0,0,0,0,0,0,0,21179.280000000002]
[null,"GUANAJUATO","GACF650909JFA","GACF650909HGTRND07","FIDEL GARCIA CONEJO","11DPT0005M",0,0,0,0,0,0,0,1,0,0,0,0,0,0,0,0,0,0,22163.25]
[null,"GUANAJUATO","GASR730617EQ9","GASR730617MGTRLS03","ROSA MARIA GARCIA SILVA","11DPT0005M",0,0,0,0,0,0,0,1,0,0,0,0,0,0,0,0,0,0,25303.040000000001]
[null,"GUANAJUATO","GOAG850312TM1","GOAG850312HGTMLN08","GENARO ALEJANDRO GOMEZ ALBA","11DPT0005M",0,0,0,0,0,0,0,1,0,0,0,0,0,0,0,0,0,0,12604.34]
[null,"GUANAJUATO","GONJ690921H46","GONJ690921HGTMTS00","JOSE JESUS GOMEZ NIETO","11DPT0005M",0,0,0,0,0,0,0,1,0,0,0,0,0,0,0,0,0,0,20654.620000000003]
[null,"GUANAJUATO","LEGR710831DD0","LEGR710831HGTSNL02","RAUL LESSO GONZALEZ","11DPT0005M",0,0,0,0,0,0,0,1,0,0,0,0,0,0,0,0,0,0,15814.240000000002]
[null,"GUANAJUATO","MABG7804019Z5","MABG780401MGTCRL00","GLORIA ELENA MACIEL BARAJAS","11DPT0005M",0,0,0,0,0,0,0,1,0,0,0,0,0,0,0,0,0,0,19861.52]
[null,"GUANAJUATO","MARJ690613N97","MARJ690613HGTGYN00","JUAN MIGUEL MAGAÑA RAYA","11DPT0005M",0,0,0,0,0,0,0,1,0,0,0,0,0,0,0,0,0,0,23625.599999999999]
[null,"GUANAJUATO","PEGS720511HW3","PEGS720511MGTXRN06","SANJUANA PATRICIA PEÑA GARCIA","11DPT0005M",0,0,0,0,0,0,0,1,0,0,0,0,0,0,0,0,0,0,13224.04]
[null,"GUANAJUATO","RAAL791208PR9","RAAL791208MGTZNL07","LILIA CONCEPCION RAZO ANGELES","11DPT0005M",0,0,0,0,0,0,0,1,0,0,0,0,0,0,0,0,0,0,23233.489999999998]
[null,"GUANAJUATO","ROLM821117536","ROLM821117HGTDPN05","MANUEL CHRISTIAN JARED RODRIGUEZ LOPEZ","11DPT0005M",0,0,0,0,0,0,0,1,0,0,0,0,0,0,0,0,0,0,16135.160000000002]
[null,"GUANAJUATO","RURL700528JKA","RURL700528MGTZDZ03","LUZ MARIA RUIZ RODRIGUEZ","11DPT0005M",0,0,0,0,0,0,0,1,0,0,0,0,0,0,0,0,0,0,28734.370000000003]
[null,"GUANAJUATO","SAMR641029MF0","SAMR641029HGTNNB09","ROBERTO SANTOYO MENDOZA","11DPT0005M",0,0,0,0,0,0,0,1,0,0,0,0,0,0,0,0,0,0,20469.12]
[null,"GUANAJUATO","TOVJ770823IY6","TOVJ770823HGTRRN05","JUAN MANUEL TORRES VERA","11DPT0005M",0,0,0,0,0,0,0,1,0,0,0,0,0,0,0,0,0,0,18352.54]
[null,"GUANAJUATO","VASY830412S80","VASY830412MMNLNN08","YUNNUEN VALENZUELA SANCHEZ","11DPT0005M",0,0,0,0,0,0,0,1,0,0,0,0,0,0,0,0,0,0,7891.3600000000006]
[null,"GUANAJUATO","VAFI6312015P7","VAFI631201MGTRLR02","IRMA VARGAS FLORES","11DPT0005M",0,0,0,0,0,0,0,1,0,0,0,0,0,0,0,0,0,0,23416.190000000002]
[null,"GUANAJUATO","VIZM6610296H8","VIZM661029MMNLRN03","MONICA VILLAGOMEZ ZARATE","11DPT0005M",0,0,0,0,0,0,0,1,0,0,0,0,0,0,0,0,0,0,25308.58]
[null,"GUANAJUATO","ZAJG780731MY6","ZAJG780731HGTVMR00","GERARDO ZAVALA JIMENEZ","11DPT0005M",0,0,0,0,0,0,0,1,0,0,0,0,0,0,0,0,0,0,10722.85]
[null,"GUANAJUATO","ZARM650407FP5","ZARM650407MGTVCT02","MARIA MATILDE ZAVALA RICO","11DPT0005M",0,0,0,0,0,0,0,1,0,0,0,0,0,0,0,0,0,0,7011.1]
[null,"GUANAJUATO","MASJ860305HY5","MASJ860305HGTRRN08","JUAN CARLOS MARTINEZ SARDINA","11DPT0005M",0,0,0,0,0,0,0,1,0,0,0,0,0,0,0,0,0,0,12799.67]
[null,"GUANAJUATO","AUPA750921LS8","AUPA750921HJCGNL00","JOSE ALFREDO AGUIRRE PUENTE","11DPT0005M",0,0,0,0,0,0,0,1,0,0,0,0,0,0,0,0,0,0,12393.810000000001]
[null,"GUANAJUATO","MAGD5812285Y1","MAGD581228MGTRRL00","MARIA DOLORES MARTINEZ GARCIA","11DPT0005M",0,0,0,0,0,0,0,1,0,0,0,0,0,0,0,0,0,0,9132.1]
[null,"GUANAJUATO","GOMM77020921A","GOMM770209MGTNRR04","MARTHA GONZALEZ MARTINEZ","11DPT0005M",0,0,0,0,0,0,0,1,0,0,0,0,0,0,0,0,0,0,5441.35]
[null,"GUANAJUATO","PAAM820226JB0","PAAM820226HGTRGR02","MARTIN PRADO AGUILAR","11DPT0005M",0,0,0,0,0,0,0,1,0,0,0,0,0,0,0,0,0,0,28751.35]
[null,"GUANAJUATO","GOHM880217IT0","GOHM880217HGTNRR05","MARCOS ELIAS GONZALEZ HERNANDEZ","11DPT0005M",0,0,0,0,0,0,0,1,0,0,0,0,0,0,0,0,0,0,11696.589999999998]
[null,"GUANAJUATO","RAPW7805122P3","RAPW780512MGTMRN01","WENDY RAMIREZ PARRA","11DPT0005M",0,0,0,0,0,0,0,1,0,0,0,0,0,0,0,0,0,0,12519.82]
[null,"GUANAJUATO","RIAM860508FPA","RIAM860508MGTVRR09","MARISA RIVERA ARREDONDO","11DPT0005M",0,0,0,0,0,0,0,1,0,0,0,0,0,0,0,0,0,0,4254.42]
[null,"GUANAJUATO","AOML850714CK0","AOML850714MMNLGR07","LAURA VENTURA ALBOR MAGAÑA","11DPT0004N",0,0,0,0,0,0,0,1,0,0,0,0,0,0,0,0,0,0,12215.150000000001]
[null,"GUANAJUATO","AAGM6807041Y7","AAGR680704MDFNRF04","MA. DEL REFUGIO ANALLA GRANADOS","11DPT0004N",0,0,0,0,0,0,0,1,0,0,0,0,0,0,0,0,0,0,12667.1]
[null,"GUANAJUATO","CIOR7805171L4","CIOR780517HGTNRB00","ROBERTO CINTORA JR.","11DPT0004N",0,0,0,0,0,0,0,1,0,0,0,0,0,0,0,0,0,0,15189.78]
[null,"GUANAJUATO","COJR790910633","COJR790910MGTRMS08","ROSALVA CORNEJO JIMENEZ","11DPT0004N",0,0,0,0,0,0,0,1,0,0,0,0,0,0,0,0,0,0,8721.2999999999993]
[null,"GUANAJUATO","CUSJ550902DF1","CUSJ550902MGTRTN09","MARIA JANET CRUZ SOTO","11DPT0004N",0,0,0,0,0,0,0,1,0,0,0,0,0,0,0,0,0,0,11463.750000000002]
[null,"GUANAJUATO","DIEM790506MK2","DIEM790506MGTZSR04","MARTHA SOFIA DIAZ ESCUTIA","11DPT0004N",0,0,0,0,0,0,0,1,0,0,0,0,0,0,0,0,0,0,12197.67]
[null,"GUANAJUATO","EAMM710507IBA","EAMM710507MASSGR04","MARTHA PATRICIA ESTRADA MAGALLON","11DPT0004N",0,0,0,0,0,0,0,1,0,0,0,0,0,0,0,0,0,0,12608.17]
[null,"GUANAJUATO","FOBD780903IT3","FOBD780903HGTNDV05","DAVID FONSECA BEDOLLA","11DPT0004N",0,0,0,0,0,0,0,1,0,0,0,0,0,0,0,0,0,0,13138.43]
[null,"GUANAJUATO","GAVJ851126FM4","GAVJ851126HGTRYV07","JAVIER GARCIA VIEYRA","11DPT0004N",0,0,0,0,0,0,0,1,0,0,0,0,0,0,0,0,0,0,16088.83]
[null,"GUANAJUATO","GUGG730101IA2","GUGG730101HGTTZN01","GONZALO GUTIERREZ GUZMAN","11DPT0004N",0,0,0,0,0,0,0,1,0,0,0,0,0,0,0,0,0,0,18234.73]
[null,"GUANAJUATO","HEDA800812J62","HEDA800812HGTRZD09","ADRIAN HERNANDEZ DIAZ","11DPT0004N",0,0,0,0,0,0,0,1,0,0,0,0,0,0,0,0,0,0,15276.75]
[null,"GUANAJUATO","LOBL610801UA2","LOBL610801HGTPDS05","LUIS LOPEZ BEDOLLA","11DPT0004N",0,0,0,0,0,0,0,1,0,0,0,0,0,0,0,0,0,0,16519.23]
[null,"GUANAJUATO","LOLB790114RE0","LOLB790114MGTPPR08","BERENICE LOPEZ LOPEZ","11DPT0004N",0,0,0,0,0,0,0,1,0,0,0,0,0,0,0,0,0,0,16997.48]
[null,"GUANAJUATO","LOOE660716UY7","LOOE660716HGTPJD01","EDUARDO LOPEZ OJEDA","11DPT0004N",0,0,0,0,0,0,0,1,0,0,0,0,0,0,0,0,0,0,9449.69]
[null,"GUANAJUATO","MOZR701212DS9","MOZR701212HGTRVG09","RIGOBERTO MORENO ZAVALA","11DPT0004N",0,0,0,0,0,0,0,1,0,0,0,0,0,0,0,0,0,0,17498.239999999998]
[null,"GUANAJUATO","OOOC810927BA9","OOOC810927MGTRRL05","CLAUDIA KARINA OROZCO OROZCO","11DPT0004N",0,0,0,0,0,0,0,1,0,0,0,0,0,0,0,0,0,0,22544.95]
[null,"GUANAJUATO","PEAA590708RJ5","PEAA590708HDFRLD08","JOSE ADRIAN ARTURO PEREZ ALVAREZ","11DPT0004N",0,0,0,0,0,0,0,1,0,0,0,0,0,0,0,0,0,0,10294.870000000001]
[null,"GUANAJUATO","PEEJ780324IC1","PEEJ780324HMNRSN01","JUAN FERNANDO PEREZ ESPINO","11DPT0004N",0,0,0,0,0,0,0,1,0,0,0,0,0,0,0,0,0,0,30736.100000000002]
[null,"GUANAJUATO","RUDJ780213NV6","RUDJ780213HGTZZN04","JUAN CARLOS RUIZ DIAZ","11DPT0004N",0,0,0,0,0,0,0,1,0,0,0,0,0,0,0,0,0,0,21485.47]
[null,"GUANAJUATO","SAVE4511296P5","SAVE451129HGTLRL03","ELIGIO SALGADO VARGAZ","11DPT0004N",0,0,0,0,0,0,0,1,0,0,0,0,0,0,0,0,0,0,12513.130000000001]
[null,"GUANAJUATO","SADF620323P95","SADF620323HDGNVD00","FIDEL SANCHEZ DAVILA","11DPT0004N",0,0,0,0,0,0,0,1,0,0,0,0,0,0,0,0,0,0,13025.390000000001]
[null,"GUANAJUATO","VIRD850905EA2","VIRD850905MGTLDY04","DEYSI VILLANUEVA RODRIGUEZ","11DPT0004N",0,0,0,0,0,0,0,1,0,0,0,0,0,0,0,0,0,0,8475.73]
[null,"GUANAJUATO","ZAPJ830703848","ZAPJ830703HGTMRN07","JUAN MARCIAL ZAMUDIO PEREZ","11DPT0004N",0,0,0,0,0,0,0,1,0,0,0,0,0,0,0,0,0,0,15078.1]
[null,"GUANAJUATO","ZAVN811206A67","ZAVN811206MGTMLR06","NORMA ANGELICA ZAMUDIO VILLALOBOS","11DPT0004N",0,0,0,0,0,0,0,1,0,0,0,0,0,0,0,0,0,0,7276.2]
[null,"GUANAJUATO","ZAHR840210PN9","ZAHR840210HGTVRD05","RODOLFO ANTONIO ZAVALA HERNANDEZ","11DPT0004N",0,0,0,0,0,0,0,1,0,0,0,0,0,0,0,0,0,0,13407.050000000001]
[null,"GUANAJUATO","CECL851027UY4","CECL851027MGTRSL00","LILIANA CERRATO CUSTODIO","11DPT0004N",0,0,0,0,0,0,0,1,0,0,0,0,0,0,0,0,0,0,12166.31]
[null,"GUANAJUATO","HERN811104FB8","HERN811104MMNRJB02","NUBIA VANESSA HERNANDEZ ROJAS","11DPT0004N",0,0,0,0,0,0,0,1,0,0,0,0,0,0,0,0,0,0,19911.920000000002]
[null,"GUANAJUATO","MELM880414RR6","MELM880414MGTNPR03","MARISOL MENDEZ LOPEZ","11DPT0004N",0,0,0,0,0,0,0,1,0,0,0,0,0,0,0,0,0,0,26070.639999999999]
[null,"GUANAJUATO","SOGY851206464","SOGY851206MMNSZN01","YANETH SOSA GUZMAN","11DPT0004N",0,0,0,0,0,0,0,1,0,0,0,0,0,0,0,0,0,0,13870.56]
[null,"GUANAJUATO","MAHS851214LA4","MAHS851214MGTRRN01","SANDRA MARTINEZ HERNANDEZ","11DPT0004N",0,0,0,0,0,0,0,1,0,0,0,0,0,0,0,0,0,0,11965.92]
[null,"GUANAJUATO","SOGE770916E73","SOGE770916MDFLNL08","MARIA ELENA SOLIS GONZALEZ","11DPT0004N",0,0,0,0,0,0,0,1,0,0,0,0,0,0,0,0,0,0,18979.27]
[null,"GUANAJUATO","TITC671201BBA","TITC671201HMNNNR07","CRESCENCIANO TINOCO TINOCO","11DPT0004N",0,0,0,0,0,0,0,1,0,0,0,0,0,0,0,0,0,0,16240.62]
[null,"GUANAJUATO","CUGE880521IJ6","CUGE880521HGTSRR02","ERIK ALBERTO CUSTODIO GARCIA","11DPT0004N",0,0,0,0,0,0,0,1,0,0,0,0,0,0,0,0,0,0,22123.23]
[null,"GUANAJUATO","COOA720302IP3","COOA720302MGTRRL01","ALMA ROSA CORTEZ ORTIZ","11DPT0004N",0,0,0,0,0,0,0,1,0,0,0,0,0,0,0,0,0,0,9249.93]
[null,"GUANAJUATO","VIMC900724PHA","VIMC900724MGTLNR08","MARIA CRISTINA VILLAGOMEZ MONTES","11DPT0004N",0,0,0,0,0,0,0,1,0,0,0,0,0,0,0,0,0,0,2116.58]
[null,"GUANAJUATO","AERJ730331GZ5","AERJ730331HGTRMN05","JUAN CARLOS ARREOLA ROMERO","11DPT0006L",0,0,0,0,0,0,0,1,0,0,0,0,0,0,0,0,0,0,16202.09]
[null,"GUANAJUATO","BEMG751210DE6","BEMG751210MDFLRD02","GUADALUPE KARINA BELTRAN MARTINEZ","11DPT0006L",0,0,0,0,0,0,0,1,0,0,0,0,0,0,0,0,0,0,7566.09]
[null,"GUANAJUATO","BEGR700112IU3","BEGR700112MGTRRB16","MA REBECA BERNAL GORDILLO","11DPT0006L",0,0,0,0,0,0,0,1,0,0,0,0,0,0,0,0,0,0,22005.4]
[null,"GUANAJUATO","BACG700412ET2","BACG700412MGTRSD07","MA GUADALUPE BRAVO CASTRO","11DPT0006L",0,0,0,0,0,0,0,1,0,0,0,0,0,0,0,0,0,0,8513.48]
[null,"GUANAJUATO","CASC710716KT2","CASC710716MGTBRR09","MA CARMEN CABALLERO SIERRA","11DPT0006L",0,0,0,0,0,0,0,1,0,0,0,0,0,0,0,0,0,0,11223.61]
[null,"GUANAJUATO","CAGG841115NK6","CAGG841115MGTLNL08","GIULIANA CALDERON GONZALEZ","11DPT0006L",0,0,0,0,0,0,0,1,0,0,0,0,0,0,0,0,0,0,10376.720000000001]
[null,"GUANAJUATO","CADJ720202F14","CADJ720202HMNHRN03","JUAN CHAVEZ DURAN","11DPT0006L",0,0,0,0,0,0,0,1,0,0,0,0,0,0,0,0,0,0,9375.02]
[null,"GUANAJUATO","COPG691022N6A","COPG691022MGTNRD16","MA GUADALUPE CONTRERAS PEREZ","11DPT0006L",0,0,0,0,0,0,0,1,0,0,0,0,0,0,0,0,0,0,24532.710000000003]
[null,"GUANAJUATO","COTR740102LT0","COTR740102MMCRRC00","ROCIO CORONA TIRADO","11DPT0006L",0,0,0,0,0,0,0,1,0,0,0,0,0,0,0,0,0,0,25746.6]
[null,"GUANAJUATO","EIME671030L39","EIME671030HGTSRD09","EDUARDO ESPINO MIRANDA","11DPT0006L",0,0,0,0,0,0,0,1,0,0,0,0,0,0,0,0,0,0,17157.73]
[null,"GUANAJUATO","EILO590921526","EILO590921MGTSNF06","OFELIA ESPINOSA LUNA","11DPT0006L",0,0,0,0,0,0,0,1,0,0,0,0,0,0,0,0,0,0,24978.63]
[null,"GUANAJUATO","GASM760821854","GASS760821MGTRTC14","MA. DEL SOCORRO GARCIA SOTELO","11DPT0006L",0,0,0,0,0,0,0,1,0,0,0,0,0,0,0,0,0,0,15144.32]
[null,"GUANAJUATO","JAMJ8502091S3","JAMJ850209HDFSRL04","JULIO CESAR JASSO MARTINEZ","11DPT0006L",0,0,0,0,0,0,0,1,0,0,0,0,0,0,0,0,0,0,25010.6]
[null,"GUANAJUATO","JAPM610407F53","JAPM610407HGTSRR09","MARCELINO JASSO PEREZ","11DPT0006L",0,0,0,0,0,0,0,1,0,0,0,0,0,0,0,0,0,0,20149.52]
[null,"GUANAJUATO","LOMA671109LL9","LOMA671109MGTPLL01","ALEJANDRA LOPEZ MELGAREJO","11DPT0006L",0,0,0,0,0,0,0,1,0,0,0,0,0,0,0,0,0,0,24481.870000000003]
[null,"GUANAJUATO","LUWR540208FX7","LUWR540208MDFNRB04","REBECA LUNA WIARCO","11DPT0006L",0,0,0,0,0,0,0,1,0,0,0,0,0,0,0,0,0,0,24500.17]
[null,"GUANAJUATO","MAJT7906215T2","MAJT790621MGTNRR01","TERESA MANDUJANO JURADO","11DPT0006L",0,0,0,0,0,0,0,1,0,0,0,0,0,0,0,0,0,0,18768.760000000002]
[null,"GUANAJUATO","MAGM780331EF7","MAGM780331MGTRZR08","MARIANA MARIN GUZMAN","11DPT0006L",0,0,0,0,0,0,0,1,0,0,0,0,0,0,0,0,0,0,22682.93]
[null,"GUANAJUATO","MAMA660610965","MAMA660610HGTRLR08","ARMANDO MARTINEZ MALDONADO","11DPT0006L",0,0,0,0,0,0,0,1,0,0,0,0,0,0,0,0,0,0,19080.97]
[null,"GUANAJUATO","MOSR800811KH0","MOSR800811HGTLNC05","RICARDO MOLINA SANCHEZ","11DPT0006L",0,0,0,0,0,0,0,1,0,0,0,0,0,0,0,0,0,0,14398.470000000001]
[null,"GUANAJUATO","OISA541015SQ0","OISA541015HGTRLL06","ALEJANDRO ORTIZ SILVA","11DPT0006L",0,0,0,0,0,0,0,1,0,0,0,0,0,0,0,0,0,0,25895.760000000002]
[null,"GUANAJUATO","PASM631104DP4","PASM631104MDFDNR08","MARTHA ROCIO PADILLA SANDOVAL","11DPT0006L",0,0,0,0,0,0,0,1,0,0,0,0,0,0,0,0,0,0,5656]
[null,"GUANAJUATO","PAMA720203B69","PAMA720203MGTLLL23","MA ALEXANDRA PALOMINO MALDONADO","11DPT0006L",0,0,0,0,0,0,0,1,0,0,0,0,0,0,0,0,0,0,28518.25]
[null,"GUANAJUATO","PEBJ680711PC1","PEBJ680711MGTRRN00","JUANA PEREZ BERNAL","11DPT0006L",0,0,0,0,0,0,0,1,0,0,0,0,0,0,0,0,0,0,26901.91]
[null,"GUANAJUATO","RAAG811213NX5","RAAG811213MGTMGD09","MARIA GUADALUPE RAMIREZ AGUIRRE","11DPT0006L",0,0,0,0,0,0,0,1,0,0,0,0,0,0,0,0,0,0,29760.729999999996]
[null,"GUANAJUATO","RABS681021GFA","RABS681021MGTMRL03","MA SOLEDAD RAMIREZ BERMUDEZ","11DPT0006L",0,0,0,0,0,0,0,1,0,0,0,0,0,0,0,0,0,0,30965.360000000004]
[null,"GUANAJUATO","RORM6503108B9","RORM650310MGTSDL03","MILAGROS ROSAS RODRIGUEZ","11DPT0006L",0,0,0,0,0,0,0,1,0,0,0,0,0,0,0,0,0,0,21887.570000000003]
[null,"GUANAJUATO","SAMM791219U15","SAMM791219MGTVDG08","MARIA MAGDALENA SAAVEDRA MEDRANO","11DPT0006L",0,0,0,0,0,0,0,1,0,0,0,0,0,0,0,0,0,0,18175.810000000001]
[null,"GUANAJUATO","SAGI850902B58","SAGI850902MJCNNS03","ISAURA SANCHEZ GONZALEZ","11DPT0006L",0,0,0,0,0,0,0,1,0,0,0,0,0,0,0,0,0,0,21445.690000000002]
[null,"GUANAJUATO","SAMC7308072M6","SAMC730807MGTNRR25","MA. DEL CARMEN SANCHEZ MORENO","11DPT0006L",0,0,0,0,0,0,0,1,0,0,0,0,0,0,0,0,0,0,21501.120000000003]
[null,"GUANAJUATO","SARP720603511","SARP720603HGTNMD03","PEDRO SANCHEZ RAMIREZ","11DPT0006L",0,0,0,0,0,0,0,1,0,0,0,0,0,0,0,0,0,0,7250.7199999999993]
[null,"GUANAJUATO","VAMM770825UBA","VAMM770825HGTLLG05","JOSE MIGUEL VALDEZ MALDONADO","11DPT0006L",0,0,0,0,0,0,0,1,0,0,0,0,0,0,0,0,0,0,24715.570000000003]
[null,"GUANAJUATO","VAOJ7001319KA","VAOJ700131HGTZRN02","JOSE JUAN VAZQUEZ ORTEGA","11DPT0006L",0,0,0,0,0,0,0,1,0,0,0,0,0,0,0,0,0,0,20755.27]
[null,"GUANAJUATO","VESJ58011884A","VESJ580118HGTGNN01","JUAN CARLOS VEGA SANCHEZ","11DPT0006L",0,0,0,0,0,0,0,1,0,0,0,0,0,0,0,0,0,0,20591.400000000001]
[null,"GUANAJUATO","ZAGG741211FF0","ZAGG741211MMNCND04","MARIA GUADALUPE ZACARIAS GONZALEZ","11DPT0006L",0,0,0,0,0,0,0,1,0,0,0,0,0,0,0,0,0,0,23437.040000000005]
[null,"GUANAJUATO","LOHE8811064TA","LOHE881106MJCPRD00","EDITH LOPEZ HERNANDEZ","11DPT0006L",0,0,0,0,0,0,0,1,0,0,0,0,0,0,0,0,0,0,2728.9500000000003]
[null,"GUANAJUATO","MASE831216GZ4","MASE831216MGTNTL05","ELIA MANDUJANO SOTO","11DPT0006L",0,0,0,0,0,0,0,1,0,0,0,0,0,0,0,0,0,0,7276.2]
[null,"GUANAJUATO","GUSS851005CT6","GUSS851005MGTLNN08","SANDRA GUILLEN SANCHEZ","11DPT0006L",0,0,0,0,0,0,0,1,0,0,0,0,0,0,0,0,0,0,20756.37]
[null,"GUANAJUATO","GUSG880306VD5","GUSG880306HGTLNR09","GERARDO GUILLEN SANCHEZ","11DPT0006L",0,0,0,0,0,0,0,1,0,0,0,0,0,0,0,0,0,0,4418.29]
[null,"GUANAJUATO","RAMO6702175A0","RAMO670217MMNNJL07","OLGA OFELIA RANGEL MEJIA","11DPT0006L",0,0,0,0,0,0,0,1,0,0,0,0,0,0,0,0,0,0,23920.19]
[null,"GUANAJUATO","QUCF750215ST6","QUCF750215HPLRRR00","FERNANDO QUIROZ CORONA","11DPT0006L",0,0,0,0,0,0,0,1,0,0,0,0,0,0,0,0,0,0,4878.3]
[null,"GUANAJUATO","HESS8606251E6","HESS860625MGTRNM00","SAMANTHA MONSERRAT HERNANDEZ SANCHEZ","11DPT0006L",0,0,0,0,0,0,0,1,0,0,0,0,0,0,0,0,0,0,3269.87]
[null,"GUANAJUATO","AAGG8604281N4","AAGG860428MGTLRD04","MARIA GUADALUPE ALAMILLA GARCIA","11DPT0009I",0,0,0,0,0,0,0,1,0,0,0,0,0,0,0,0,0,0,22599.829999999998]
[null,"GUANAJUATO","AACN800319VC6","AACN800319MGTYRY15","NAYELI DE JESUS AYALA CARRERA","11DPT0009I",0,0,0,0,0,0,0,1,0,0,0,0,0,0,0,0,0,0,24019.75]
[null,"GUANAJUATO","CASM6003305D3","CASM600330HGTMTL02","MELCHOR CAMPOS SOTO","11DPT0009I",0,0,0,0,0,0,0,1,0,0,0,0,0,0,0,0,0,0,21975.940000000002]
[null,"GUANAJUATO","CACC741121MK3","CACC741121HGTSRR01","CARLOS ALBERTO CASTILLO CRUZ","11DPT0009I",0,0,0,0,0,0,0,1,0,0,0,0,0,0,0,0,0,0,16377.349999999999]
[null,"GUANAJUATO","COGB581101LL6","COGB581101HGTRMN07","BENJAMIN CORONA GOMEZ","11DPT0009I",0,0,0,0,0,0,0,1,0,0,0,0,0,0,0,0,0,0,1234.5299999999993]
[null,"GUANAJUATO","LEHM650906984","LEHM650906HGTNRG07","MIGUEL ANGEL DE LEON HURTADO","11DPT0009I",0,0,0,0,0,0,0,1,0,0,0,0,0,0,0,0,0,0,8422.2199999999993]
[null,"GUANAJUATO","FEPD7803235M7","FEPD780323MGTLRL01","DELIA FELIPE PEREZ","11DPT0009I",0,0,0,0,0,0,0,1,0,0,0,0,0,0,0,0,0,0,24234.54]
[null,"GUANAJUATO","GAPA750814NW2","GAPA750814MDFMRN01","ANGIE GAMBOA PEREZ","11DPT0009I",0,0,0,0,0,0,0,1,0,0,0,0,0,0,0,0,0,0,11882.830000000002]
[null,"GUANAJUATO","GOAJ7711065Z5","GOAJ771106HGTNLN00","JUAN PABLO GONZALEZ ALVARADO","11DPT0009I",0,0,0,0,0,0,0,1,0,0,0,0,0,0,0,0,0,0,16072.2]
[null,"GUANAJUATO","GOMO860112AC6","GOMO860112HDFNRM01","OMAR FRANCISCO GONZALEZ MARTINEZ","11DPT0009I",0,0,0,0,0,0,0,1,0,0,0,0,0,0,0,0,0,0,19611.240000000002]
[null,"GUANAJUATO","IACC631023AI2","IACC631023HGTBNH06","CUAUHTEMOC IBARRA CANO","11DPT0009I",0,0,0,0,0,0,0,1,0,0,0,0,0,0,0,0,0,0,21187.500000000004]
[null,"GUANAJUATO","MATG681016SW7","MATG681016HGTGFR08","GERARDO MAGAÑA TAFOYA","11DPT0009I",0,0,0,0,0,0,0,1,0,0,0,0,0,0,0,0,0,0,25239.910000000003]
[null,"GUANAJUATO","MALS720215M37","MALS720215MGTRPR06","SARA MARTINEZ LOPEZ","11DPT0009I",0,0,0,0,0,0,0,1,0,0,0,0,0,0,0,0,0,0,23181.370000000003]
[null,"GUANAJUATO","MEAA781114FWA","MEAA781114MGTDRD01","ADRIANA MEDEL ARROYO","11DPT0009I",0,0,0,0,0,0,0,1,0,0,0,0,0,0,0,0,0,0,24364.480000000003]
[null,"GUANAJUATO","MEGM731204L93","MEGM731204MGTNZR02","MARISA MENDEZ GUZMAN","11DPT0009I",0,0,0,0,0,0,0,1,0,0,0,0,0,0,0,0,0,0,18490.28]
[null,"GUANAJUATO","AAVL730510P19","AAVL730510MGTYLR00","LAURA ELENA AYALA VALTIERRA","11DPT0009I",0,0,0,0,0,0,0,1,0,0,0,0,0,0,0,0,0,0,26286.190000000002]
[null,"GUANAJUATO","MOCM7012151Q9","MOCM701215MGTRNN01","MANUELA MORALES CENDEJAS","11DPT0009I",0,0,0,0,0,0,0,1,0,0,0,0,0,0,0,0,0,0,14424.71]
[null,"GUANAJUATO","PABG6901266Q2","PABG690126HGTZNR06","GERARDO PAZ BONILLA","11DPT0009I",0,0,0,0,0,0,0,1,0,0,0,0,0,0,0,0,0,0,13868.900000000001]
[null,"GUANAJUATO","PEFD7301136V8","PEFD730113HGTRLV06","DAVID PEREZ FELIPE","11DPT0009I",0,0,0,0,0,0,0,1,0,0,0,0,0,0,0,0,0,0,12540.17]
[null,"GUANAJUATO","PESA790927U25","PESA790927MGTRTN06","ANDREA MAGDALENA PEREZ SOTO","11DPT0009I",0,0,0,0,0,0,0,1,0,0,0,0,0,0,0,0,0,0,33515.949999999997]
[null,"GUANAJUATO","RARM770914S13","RARM770914HGTNYR07","MAURICIO RANGEL REYES","11DPT0009I",0,0,0,0,0,0,0,1,0,0,0,0,0,0,0,0,0,0,20363.560000000001]
[null,"GUANAJUATO","RIRG760502K16","RIRG760502MGTVDW04","GWENDOLYNE ERENDIRA RIVAS RODRIGUEZ","11DPT0009I",0,0,0,0,0,0,0,1,0,0,0,0,0,0,0,0,0,0,12333.110000000002]
[null,"GUANAJUATO","RONS740802CB3","RONS740802HGTCXL05","SALVADOR ROCHA NUÑEZ","11DPT0009I",0,0,0,0,0,0,0,1,0,0,0,0,0,0,0,0,0,0,16145.900000000003]
[null,"GUANAJUATO","ROCC7912019U3","ROCC791201HGTDHS03","CESAR ADRIAN RODRIGUEZ CHAVEZ","11DPT0009I",0,0,0,0,0,0,0,1,0,0,0,0,0,0,0,0,0,0,18369.099999999999]
[null,"GUANAJUATO","ROVA6201238U9","ROVA620123HGTDGL01","ALFONSO RODRIGUEZ VEGA","11DPT0009I",0,0,0,0,0,0,0,1,0,0,0,0,0,0,0,0,0,0,22055.41]
[null,"GUANAJUATO","SATJ701026RC3","SATJ701026HGTNFS09","JOSE SANCHEZ TAFOYA","11DPT0009I",0,0,0,0,0,0,0,1,0,0,0,0,0,0,0,0,0,0,12495.87]
[null,"GUANAJUATO","SAPR691204HS9","SAPR691204MGTNRS09","ROSA ELIA SANDOVAL PRADO","11DPT0009I",0,0,0,0,0,0,0,1,0,0,0,0,0,0,0,0,0,0,29694.52]
[null,"GUANAJUATO","SOSP630208MC6","SOSP630208HGTTCD07","PEDRO SOTO SAUCEDO","11DPT0009I",0,0,0,0,0,0,0,1,0,0,0,0,0,0,0,0,0,0,8241.5399999999991]
[null,"GUANAJUATO","TEAC711130CQ2","TEAC711130MGTJDL00","CLAUDIA ELENA TEJEDA ADAME","11DPT0009I",0,0,0,0,0,0,0,1,0,0,0,0,0,0,0,0,0,0,15796.18]
[null,"GUANAJUATO","TEAR801024C6A","TEAR801024MGTJDS18","ROSA BEATRIZ TEJEDA ADAME","11DPT0009I",0,0,0,0,0,0,0,1,0,0,0,0,0,0,0,0,0,0,19124.169999999998]
[null,"GUANAJUATO","TOAA8408254S3","TOAA840825MGRRYD03","ADRIANA TORRES AYALA","11DPT0009I",0,0,0,0,0,0,0,1,0,0,0,0,0,0,0,0,0,0,18357.580000000002]
[null,"GUANAJUATO","TOAB770225NZ9","TOAB770225MGTRRR00","BERENICE TORRES ARROYO","11DPT0009I",0,0,0,0,0,0,0,1,0,0,0,0,0,0,0,0,0,0,26410.9]
[null,"GUANAJUATO","VASD820426CR9","VASD820426HGTRTV05","DAVID VARGAS SOTO","11DPT0009I",0,0,0,0,0,0,0,1,0,0,0,0,0,0,0,0,0,0,10360.170000000002]
[null,"GUANAJUATO","ZARG620614QCA","ZARG620614MGTRMR02","GRACIELA ZARAGOZA ROMERO","11DPT0009I",0,0,0,0,0,0,0,1,0,0,0,0,0,0,0,0,0,0,9562.2999999999993]
[null,"GUANAJUATO","VAEM800823M12","VAEM800823MGTZLR07","MARIA MARISELA VAZQUEZ ELIZARRARAS","11DPT0009I",0,0,0,0,0,0,0,1,0,0,0,0,0,0,0,0,0,0,7766.12]
[null,"GUANAJUATO","AOZL870509IYA","AOZL870509MGTLRC04","LUCIA ALONSO ZARAGOZA","11DPT0009I",0,0,0,0,0,0,0,1,0,0,0,0,0,0,0,0,0,0,17168.61]
[null,"GUANAJUATO","VAMB781025HC6","VAMB781025MGTZRT08","BEATRIZ VAZQUEZ MARTINEZ","11DPT0009I",0,0,0,0,0,0,0,1,0,0,0,0,0,0,0,0,0,0,5937.2000000000007]
[null,"GUANAJUATO","AIGJ671012FB4","AIGJ671012HGTRZS09","JOSE JESUS ARIAS GUZMAN","11DPT0009I",0,0,0,0,0,0,0,1,0,0,0,0,0,0,0,0,0,0,2963.26]
[null,"GUANAJUATO","AEIS580223D43","AEXI580223HGTDXS09","ISMAEL AEDO","11DPT0007K",0,0,0,0,0,0,0,1,0,0,0,0,0,0,0,0,0,0,16011.329999999998]
[null,"GUANAJUATO","AEME830910KL9","AEME830910MGTDRS08","ESPERANZA AEDO DE MARIA Y CAMPOS","11DPT0007K",0,0,0,0,0,0,0,1,0,0,0,0,0,0,0,0,0,0,12456.86]
[null,"GUANAJUATO","AULY531226UY7","AULY531226MDFGDL03","YOLANDA ERENDIRA AGUILAR LEDESMA","11DPT0007K",0,0,0,0,0,0,0,1,0,0,0,0,0,0,0,0,0,0,11815.77]
[null,"GUANAJUATO","AAGE740808PN4","AAGE740808HGTLRM03","EMMANUEL FRANCISCO ALCARAZ GARCIA","11DPT0007K",0,0,0,0,0,0,0,1,0,0,0,0,0,0,0,0,0,0,13693.01]
[null,"GUANAJUATO","AONL720204923","AONL720204MGTLXT01","MA LETICIA ALONSO NUÑEZ","11DPT0007K",0,0,0,0,0,0,0,1,0,0,0,0,0,0,0,0,0,0,12932.23]
[null,"GUANAJUATO","AEBM7404088T6","AEBM740408HGTRCG06","MIGUEL ANGEL ARELLANO BECERRA","11DPT0007K",0,0,0,0,0,0,0,1,0,0,0,0,0,0,0,0,0,0,14958.36]
[null,"GUANAJUATO","CARS840701PT4","CARS840701MGTHMR06","SARAH GABRIELA CHAVEZ RAMIREZ","11DPT0007K",0,0,0,0,0,0,0,1,0,0,0,0,0,0,0,0,0,0,15896.689999999999]
[null,"GUANAJUATO","CIOV5211227Z3","CIOV521122HDFSRC01","VICTOR SAMUEL CISNEROS ORTEGA","11DPT0007K",0,0,0,0,0,0,0,1,0,0,0,0,0,0,0,0,0,0,22125.040000000001]
[null,"GUANAJUATO","COGA610228CT2","COGA610228HDFRRL00","ALFONSO CORONA GARCIA","11DPT0007K",0,0,0,0,0,0,0,1,0,0,0,0,0,0,0,0,0,0,25194.980000000003]
[null,"GUANAJUATO","COBT640419U79","COBT640419HGTRZD01","TEODORO CORTES BUZO","11DPT0007K",0,0,0,0,0,0,0,1,0,0,0,0,0,0,0,0,0,0,28290.200000000004]
[null,"GUANAJUATO","EOTJ551129MU2","EOTS551129HGTSPT10","J. SATURNINO ESCOTO TAPIA","11DPT0007K",0,0,0,0,0,0,0,1,0,0,0,0,0,0,0,0,0,0,14558.97]
[null,"GUANAJUATO","GACM6402137QA","GACM640213MGTRHR05","MARICELA GARCIA CHAVEZ","11DPT0007K",0,0,0,0,0,0,0,1,0,0,0,0,0,0,0,0,0,0,29767.829999999998]
[null,"GUANAJUATO","GAGA6703123EA","GAGA670312HGTSNL02","JOSE ALFREDO GASCA GONZALEZ","11DPT0007K",0,0,0,0,0,0,0,1,0,0,0,0,0,0,0,0,0,0,34862.75]
[null,"GUANAJUATO","GOPS6802087F1","GOPS680208HGTNDN00","SANTIAGO GONZALEZ PADILLA","11DPT0007K",0,0,0,0,0,0,0,1,0,0,0,0,0,0,0,0,0,0,26264.940000000002]
[null,"GUANAJUATO","GULM751128PE3","GULM751128HGTRNR07","MARIO DE JESUS GUERRERO LUNA","11DPT0007K",0,0,0,0,0,0,0,1,0,0,0,0,0,0,0,0,0,0,31818.670000000002]
[null,"GUANAJUATO","GUHG690324J87","GUHG690324HGTTRB00","GABRIEL GUTIERREZ HERNANDEZ","11DPT0007K",0,0,0,0,0,0,0,1,0,0,0,0,0,0,0,0,0,0,19654.190000000002]
[null,"GUANAJUATO","GUHM640516HF8","GUHM640516MGTTRR04","MARTHA GUTIERREZ HERNANDEZ","11DPT0007K",0,0,0,0,0,0,0,1,0,0,0,0,0,0,0,0,0,0,28315.760000000002]
[null,"GUANAJUATO","GUHR661007QW0","GUHR661007MGTTRC18","ROCIO DEL ROSARIO GUTIERREZ HERNANDEZ","11DPT0007K",0,0,0,0,0,0,0,1,0,0,0,0,0,0,0,0,0,0,29500.350000000002]
[null,"GUANAJUATO","GOOC700123LY6","GOOC700123MGTMRR07","MA DEL CARMEN GOMEZ OROPEZA","11DPT0007K",0,0,0,0,0,0,0,1,0,0,0,0,0,0,0,0,0,0,36327.74]
[null,"GUANAJUATO","LELJ740926PK3","LELJ740926HJCNPN01","JUAN ANTONIO LEON LOPEZ","11DPT0007K",0,0,0,0,0,0,0,1,0,0,0,0,0,0,0,0,0,0,16851.740000000002]
[null,"GUANAJUATO","LORF540804250","LORF540804HJCPLR09","FRANCISCO JAVIER LOPEZ RUELAS","11DPT0007K",0,0,0,0,0,0,0,1,0,0,0,0,0,0,0,0,0,0,25534.699999999997]
[null,"GUANAJUATO","MAHE740312EP4","MAHE740312MJCLRR09","ERIKA GUADALUPE MALDONADO HERNANDEZ","11DPT0007K",0,0,0,0,0,0,0,1,0,0,0,0,0,0,0,0,0,0,24838.42]
[null,"GUANAJUATO","MAMD780104I25","MAMD780104MGTTRL05","MARIA DOLORES MATA MARTINEZ","11DPT0007K",0,0,0,0,0,0,0,1,0,0,0,0,0,0,0,0,0,0,34684.620000000003]
[null,"GUANAJUATO","MEGL640103827","MEGL640103MGTLTT08","MA. LETICIA MELENDEZ GUTIERREZ","11DPT0007K",0,0,0,0,0,0,0,1,0,0,0,0,0,0,0,0,0,0,31879.67]
[null,"GUANAJUATO","MESM670501FH5","MESM670501HDFNGR03","MARCO ALFREDO MENDOZA SEGURA","11DPT0007K",0,0,0,0,0,0,0,1,0,0,0,0,0,0,0,0,0,0,26571.43]
[null,"GUANAJUATO","MOVJ75111289A","MOVJ751112HJCRRR01","JORGE ARMANDO MORALES VARGAS","11DPT0007K",0,0,0,0,0,0,0,1,0,0,0,0,0,0,0,0,0,0,20787.62]
[null,"GUANAJUATO","NAGM7308014C0","NAGM730801MGTJZR05","MARCELA NAJERA GUZMAN","11DPT0007K",0,0,0,0,0,0,0,1,0,0,0,0,0,0,0,0,0,0,31517.309999999998]
[null,"GUANAJUATO","OIMD8504181Z5","OIMD850418MGTLRN00","DIANA OLIVA MORENO","11DPT0007K",0,0,0,0,0,0,0,1,0,0,0,0,0,0,0,0,0,0,2383.8000000000002]
[null,"GUANAJUATO","RICE740107C14","RICE740107MGTVSR06","ERICA ADRIANA RIVERA CISNEROS","11DPT0007K",0,0,0,0,0,0,0,1,0,0,0,0,0,0,0,0,0,0,29793.840000000004]
[null,"GUANAJUATO","ROOO570222BT6","ROOO570222HDFJRM05","OMAR ROJAS OROZCO","11DPT0007K",0,0,0,0,0,0,0,1,0,0,0,0,0,0,0,0,0,0,11463.76]
[null,"GUANAJUATO","SOMJ5508087H2","SOMJ550808MGTTRN02","JUANA SOTO MORAN","11DPT0007K",0,0,0,0,0,0,0,1,0,0,0,0,0,0,0,0,0,0,24381.55]
[null,"GUANAJUATO","TAGL820524R17","TAGL820524MGTPMZ06","MARIA DE LA LUZ TAPIA GOMEZ","11DPT0007K",0,0,0,0,0,0,0,1,0,0,0,0,0,0,0,0,0,0,22978.68]
[null,"GUANAJUATO","TIEA7005021TA","TIEA700502MDFHSN02","ANGELICA THIRION ESCUDER","11DPT0007K",0,0,0,0,0,0,0,1,0,0,0,0,0,0,0,0,0,0,30035.320000000003]
[null,"GUANAJUATO","UIRA650703JZ5","UIRA650703MDFRML07","MARIA ALEJANDRA URIBE RAMIREZ","11DPT0007K",0,0,0,0,0,0,0,1,0,0,0,0,0,0,0,0,0,0,30162.6]
[null,"GUANAJUATO","VIBM7702283A2","VIBM770228HDFLRR01","MAURICIO VILCHIS BARCENAS","11DPT0007K",0,0,0,0,0,0,0,1,0,0,0,0,0,0,0,0,0,0,25793.45]
[null,"GUANAJUATO","ZARG760122LM0","ZARG760122MGTRDR05","GRACIELA ZARAGOZA RODRIGUEZ","11DPT0007K",0,0,0,0,0,0,0,1,0,0,0,0,0,0,0,0,0,0,40225.42]
[null,"GUANAJUATO","BEJE700403E37","BEXJ700403HGTLXS00","JESUS GERARDO  BELMONTE","11DPT0007K",0,0,0,0,0,0,0,1,0,0,0,0,0,0,0,0,0,0,10890.58]
[null,"GUANAJUATO","ROHO780227K98","ROXH780227MGTCXN02","PAOLA ROCHA HONORINA","11DPT0007K",0,0,0,0,0,0,0,1,0,0,0,0,0,0,0,0,0,0,27717.020000000004]
[null,"GUANAJUATO","AUVG860513KD9","AUVG860513MGTNZD03","MARIA GUADALUPE ANGUIANO VAZQUEZ","11DPT0007K",0,0,0,0,0,0,0,1,0,0,0,0,0,0,0,0,0,0,15361.740000000002]
[null,"GUANAJUATO","ROML710901QS2","ROML710901MGTDRT00","LETICIA RODRIGUEZ MORALES","11DPT0007K",0,0,0,0,0,0,0,1,0,0,0,0,0,0,0,0,0,0,5562.2]
[null,"GUANAJUATO","DIVA711128CB2","DIVA711128MMCZGL03","ALEJANDRA DIAZ VEGA","11DPT0007K",0,0,0,0,0,0,0,1,0,0,0,0,0,0,0,0,0,0,14016.240000000002]
[null,"GUANAJUATO","LAMV790816VD9","LAMV790816MGTRNN04","VANESSA GEOVANNA LARIOS MINJARES","11DPT0007K",0,0,0,0,0,0,0,1,0,0,0,0,0,0,0,0,0,0,11919.000000000002]
[null,"GUANAJUATO","MOVM841118GC2","MOVM841118MGTNRR09","MARIELA JOCELYN MONTIEL VERA","11DPT0007K",0,0,0,0,0,0,0,1,0,0,0,0,0,0,0,0,0,0,3668.4]
[null,"GUANAJUATO","MEZJ750302AC9","MEZJ750302HGTNPR00","JORGE MENDOZA ZAPATA","11DPT0007K",0,0,0,0,0,0,0,1,0,0,0,0,0,0,0,0,0,0,19220.920000000002]
[null,"GUANAJUATO","GUMR8110123U3","GUMR811012HCHZNM08","RAMIRO GUZMAN MONTES","11DPT0007K",0,0,0,0,0,0,0,1,0,0,0,0,0,0,0,0,0,0,12051.43]
[null,"GUANAJUATO","OIAE780131HL9","OIAE780131HGTNLD06","EDGAR JIONEL ONTIVEROS ALCALA","11DPT0007K",0,0,0,0,0,0,0,1,0,0,0,0,0,0,0,0,0,0,18593.2]
[null,"GUANAJUATO","OEGR7911068I7","OEGR791106MGTRMS01","ROSA MARIA ORNELAS GOMEZ","11DPT0007K",0,0,0,0,0,0,0,1,0,0,0,0,0,0,0,0,0,0,15514.29]
[null,"GUANAJUATO","CEDC850505LX0","CEDC850505HGTRRR07","CARLOS ADRIAN CERVANTES DURAN","11DPT0007K",0,0,0,0,0,0,0,1,0,0,0,0,0,0,0,0,0,0,11783.33]
[null,"GUANAJUATO","GOOE760928BN1","GOOE760928HGTMRN01","ENRIQUE ALEJANDRO GOMEZ OROPEZA","11DPT0007K",0,0,0,0,0,0,0,1,0,0,0,0,0,0,0,0,0,0,18663.030000000002]
[null,"GUANAJUATO","HEAM5406144E9","HEAM540614MDFRRR09","MARISELA HERRERA ARVIZU","11DPT0007K",0,0,0,0,0,0,0,1,0,0,0,0,0,0,0,0,0,0,18660.660000000003]
[null,"GUANAJUATO","RALS8203241F7","RALS820324MGTMZL03","SILVIA AYDEE RAMIREZ LOZANO","11DPT0007K",0,0,0,0,0,0,0,1,0,0,0,0,0,0,0,0,0,0,10852.370000000003]
[null,"GUANAJUATO","FERA670304TV9","FERA670304HGTRCL01","ALBERTO FERNANDEZ RICO","11DPT0007K",0,0,0,0,0,0,0,1,0,0,0,0,0,0,0,0,0,0,3575.7000000000003]
[null,"GUANAJUATO","CAGS660709C18","CAGS660709MGTHRS01","SUSANA CHAVEZ GUERRA","11DPT0007K",0,0,0,0,0,0,0,1,0,0,0,0,0,0,0,0,0,0,13971.77]
[null,"GUANAJUATO","MORB790906FV5","MORB790906MGTNSR05","BERTHA ALICIA MONJARAZ RIOS","11DPT0007K",0,0,0,0,0,0,0,1,0,0,0,0,0,0,0,0,0,0,24965.710000000003]
[null,"GUANAJUATO","MAMX651202NJ5","MXME651202MGTTRV07","EVA MATA MARTINEZ","11DPT0007K",0,0,0,0,0,0,0,1,0,0,0,0,0,0,0,0,0,0,22520.1]
[null,"GUANAJUATO","RUBS800124TR0","RUBS800124HGTZRL06","SAUL RUIZ BERBENA","11DPT0007K",0,0,0,0,0,0,0,1,0,0,0,0,0,0,0,0,0,0,29347.199999999997]
[null,"GUANAJUATO","RORL860709G29","RORL860709MGTDML06","LILIA BERENICE RODRIGUEZ RAMIREZ","11DPT0007K",0,0,0,0,0,0,0,1,0,0,0,0,0,0,0,0,0,0,18971.18]
[null,"GUANAJUATO","RAVM831112KP8","RAVM831112MGTMLN01","MONICA DE LA LUZ RAMIREZ VILLANUEVA","11DPT0007K",0,0,0,0,0,0,0,1,0,0,0,0,0,0,0,0,0,0,28990.940000000002]
[null,"GUANAJUATO","OELL840306742","OELL840306MGTRNR06","LAURA DEL ROCIO ORNELAS LUNA","11DPT0007K",0,0,0,0,0,0,0,1,0,0,0,0,0,0,0,0,0,0,20090.599999999999]
[null,"GUANAJUATO","AARJ840101C55","AARJ840101HGTLYS03","JESUS ISRAEL ALBA REYES","11DPT0007K",0,0,0,0,0,0,0,1,0,0,0,0,0,0,0,0,0,0,18264.18]
[null,"GUANAJUATO","RICM7009187Q5","RICM700918HGTVSG07","MIGUEL ANGEL RIVERA CISNEROS","11DPT0007K",0,0,0,0,0,0,0,1,0,0,0,0,0,0,0,0,0,0,22634.74]
[null,"GUANAJUATO","MARJ740212TP0","MARJ740212HGTRDS04","JOSE DE JESUS MARTINEZ RODRIGUEZ","11DPT0007K",0,0,0,0,0,0,0,1,0,0,0,0,0,0,0,0,0,0,7018.97]
[null,"GUANAJUATO","RELL7409136N7","RELL740913HGTYRS09","JOSE LUIS REYES LARA","11DPT0007K",0,0,0,0,0,0,0,1,0,0,0,0,0,0,0,0,0,0,3178.4]
[null,"GUANAJUATO","GOBA8411109SA","GOBA841110MGTNNL06","ALMA CECILIA GONZALEZ BUENDIA","11DPT0007K",0,0,0,0,0,0,0,1,0,0,0,0,0,0,0,0,0,0,5959.5]
[null,"GUANAJUATO","GAML640822UM9","GAML640822MDFRNT04","MARIA LETICIA GARCIA MENDEZ","11DPT0007K",0,0,0,0,0,0,0,1,0,0,0,0,0,0,0,0,0,0,25709.39]
[null,"GUANAJUATO","COFO8404084A4","COFO840408HGTNRS02","OSCAR  ALEJANDRO CONCHAS FRANCO","11DPT0007K",0,0,0,0,0,0,0,1,0,0,0,0,0,0,0,0,0,0,10722.83]
[null,"GUANAJUATO","GAML700607499","GAML700607HGTLXS02","LUIS ROBERTO GALLEGOS MUÑOZ","11DPT0007K",0,0,0,0,0,0,0,1,0,0,0,0,0,0,0,0,0,0,5164.8999999999996]
[null,"GUANAJUATO","HUQL680518G68","HUQL680518HGTRNS08","LUIS GERARDO HURTADO QUINTANA","11DPT0007K",0,0,0,0,0,0,0,1,0,0,0,0,0,0,0,0,0,0,4585.5]
[null,"GUANAJUATO","RAMM8704167H6","RAMM870416MCMNRR00","MARGARITA ZARAHY RANGEL MARTINEZ","11DPT0007K",0,0,0,0,0,0,0,1,0,0,0,0,0,0,0,0,0,0,9535.2000000000007]
[null,"GUANAJUATO","GUVC900306RV8","GUVC900306HGTTNH09","CHRISTIAN JUAN DE DIOS GUTIERREZ VENEGAS","11DPT0007K",0,0,0,0,0,0,0,1,0,0,0,0,0,0,0,0,0,0,8601.83]
[null,"GUANAJUATO","AAGL5509065W0","AAGL550906HGTRZS02","JOSE LUIS ARAIZA GUZMAN","11DPT0007K",0,0,0,0,0,0,0,1,0,0,0,0,0,0,0,0,0,0,3973]
[null,"GUANAJUATO","LOGM890424T1A","LOGM890424MGTPTL01","MELISSA LOPEZ GUTIERREZ","11DPT0007K",0,0,0,0,0,0,0,1,0,0,0,0,0,0,0,0,0,0,2121]
[null,"GUANAJUATO","GARG881113FU7","GARG881113HGTRDL05","GUILLERMO GARCIA RODRIGUEZ","11DPT0007K",0,0,0,0,0,0,0,1,0,0,0,0,0,0,0,0,0,0,7070]
[null,"GUANAJUATO","MORO871110AJ6","MORO871110HGTRYS05","OSCAR ANDRES MORALES REYES","11DPT0007K",0,0,0,0,0,0,0,1,0,0,0,0,0,0,0,0,0,0,3973]
[null,"GUANAJUATO","GAGF890420BW4","GAGF890420HNLRRR09","FRANCISCO GARZA GUERRA","11DPT0007K",0,0,0,0,0,0,0,1,0,0,0,0,0,0,0,0,0,0,3973]
[null,"GUANAJUATO","PIMG610824350","PIMG610824HGTXLB08","GABRIEL PIÑA MOLINA","11DPT0007K",0,0,0,0,0,0,0,1,0,0,0,0,0,0,0,0,0,0,6754.1]
[null,"GUANAJUATO","BIGG740809I66","BIGG740809MGTRMD06","MA. GUADALUPE BRIZUELA GAMIÑO","11DPT0007K",0,0,0,0,0,0,0,1,0,0,0,0,0,0,0,0,0,0,13931.02]
[null,"GUANAJUATO","CAGI700403K87","CAGI700403MGTRNR05","MA. IRENE CARRANCO GONZALEZ","11DPT0007K",0,0,0,0,0,0,0,1,0,0,0,0,0,0,0,0,0,0,5656]
[null,"GUANAJUATO","HEIL950924F53","HEIL950924HGTRRS00","LUIS RICARDO HERNANDEZ IRASTORZA","11DPT0007K",0,0,0,0,0,0,0,1,0,0,0,0,0,0,0,0,0,0,6457.27]
[null,"GUANAJUATO","SAGI670217B71","SAGI670217MGTNRM01","IMELDA SANTOYO GARCIA","11DPT0007K",0,0,0,0,0,0,0,1,0,0,0,0,0,0,0,0,0,0,5302.5]
[null,"GUANAJUATO","GARJ800225JL6","GARJ800225HGTSBR09","JOSE ANDRES GASCA RUBIO","11DPT0007K",0,0,0,0,0,0,0,1,0,0,0,0,0,0,0,0,0,0,2292.7600000000002]
[null,"GUANAJUATO","AAMA8811265W2","AAMA881126HGTMRN06","ANGEL FRANCISCO AMAYA MORALES","11DPT0007K",0,0,0,0,0,0,0,1,0,0,0,0,0,0,0,0,0,0,3535]
[null,"GUANAJUATO","FIHI930930DZ4","FIHI930930HGTGRS01","JOSE ISRAEL FIGUEROA HERNANDEZ","11DPT0007K",0,0,0,0,0,0,0,1,0,0,0,0,0,0,0,0,0,0,4336.2700000000004]
[null,"GUANAJUATO","PAGA670111I35","PAGA670111HNTLRR03","ARMANDO PALOMARES GARCIA","11DPT0007K",0,0,0,0,0,0,0,1,0,0,0,0,0,0,0,0,0,0,8437.32]
[null,"GUANAJUATO","AUCR760401U5A","AUCR760401HGTGRC06","RICARDO AGUILAR CORONA","11DPT0010Y",0,0,0,0,0,0,0,1,0,0,0,0,0,0,0,0,0,0,10267.120000000001]
[null,"GUANAJUATO","AURJ751104NX7","AURJ751104HGTGDN09","JUAN CARLOS AGUIRRE RODRIGUEZ","11DPT0010Y",0,0,0,0,0,0,0,1,0,0,0,0,0,0,0,0,0,0,23326.87]
[null,"GUANAJUATO","AASR710311P25","AASR710311MGTLNC02","ROCIO DEL CARMEN ALMANZA SANDOVAL","11DPT0010Y",0,0,0,0,0,0,0,1,0,0,0,0,0,0,0,0,0,0,22160.46]
[null,"GUANAJUATO","AALJ72112271A","AALJ721122MGTLZN08","JUANA CECILIA ALVAREZ LOZANO","11DPT0010Y",0,0,0,0,0,0,0,1,0,0,0,0,0,0,0,0,0,0,13428.59]
[null,"GUANAJUATO","AAPM8304305FA","AAPM830430MGTLRY09","MAYRA DE GUADALUPE CELENE ALVAREZ PEREZ","11DPT0010Y",0,0,0,0,0,0,0,1,0,0,0,0,0,0,0,0,0,0,19910.080000000002]
[null,"GUANAJUATO","AEGE750228CT2","AEGE750228MGTRMR09","ERIKA AREVALO GOMEZ","11DPT0010Y",0,0,0,0,0,0,0,1,0,0,0,0,0,0,0,0,0,0,18488.260000000002]
[null,"GUANAJUATO","AOOV770724DZ8","AOOV770724MGTRRR09","VERONICA ARZOLA ORTEGA","11DPT0010Y",0,0,0,0,0,0,0,1,0,0,0,0,0,0,0,0,0,0,16020.920000000002]
[null,"GUANAJUATO","BAVB810501LRA","BAVB810501MGTRLL01","BLANCA ELIZABETH BARAJAS VALLEJO","11DPT0010Y",0,0,0,0,0,0,0,1,0,0,0,0,0,0,0,0,0,0,18234.72]
[null,"GUANAJUATO","CAGG7503244Z4","CAGG750324MGTBTB00","GABRIELA DEL CARMEN CABRERA GUTIERREZ","11DPT0010Y",0,0,0,0,0,0,0,1,0,0,0,0,0,0,0,0,0,0,20430.050000000003]
[null,"GUANAJUATO","CACX831109CP9","CXCA831109MGTMHM07","AMERICA CAMPOS CHAGOYA","11DPT0010Y",0,0,0,0,0,0,0,1,0,0,0,0,0,0,0,0,0,0,3973]
[null,"GUANAJUATO","CALA6404086Z8","CALA640408HGTDXL04","ALBERTO CAUDILLO LIÑAN","11DPT0010Y",0,0,0,0,0,0,0,1,0,0,0,0,0,0,0,0,0,0,24086.840000000004]
[null,"GUANAJUATO","CARL761027511","CARL761027MGTDZD04","LIDIA KAREM CAUDILLO RIZO","11DPT0010Y",0,0,0,0,0,0,0,1,0,0,0,0,0,0,0,0,0,0,15111.210000000001]
[null,"GUANAJUATO","EIDJ571003UH1","EIDC571003HGTSMS06","J COSME ESPINOZA DOMINGUEZ","11DPT0010Y",0,0,0,0,0,0,0,1,0,0,0,0,0,0,0,0,0,0,11999.03]
[null,"GUANAJUATO","FIOM790619I13","FIOM790619HDFLRH07","MAHY ROLANDO FILOMENO ORTIZ","11DPT0010Y",0,0,0,0,0,0,0,1,0,0,0,0,0,0,0,0,0,0,17325.419999999998]
[null,"GUANAJUATO","GAME651110B38","GAME651110HDFRRD00","EDUARDO GARCIA MORALES","11DPT0010Y",0,0,0,0,0,0,0,1,0,0,0,0,0,0,0,0,0,0,5804.75]
[null,"GUANAJUATO","GOAA670428AHA","GOAA670428MGTNLR05","ARACELI GONZALEZ ALVAREZ","11DPT0010Y",0,0,0,0,0,0,0,1,0,0,0,0,0,0,0,0,0,0,17859.14]
[null,"GUANAJUATO","GOHV780329HP0","GOHV780329MGTNRR00","VERONICA GONZALEZ HERNANDEZ","11DPT0010Y",0,0,0,0,0,0,0,1,0,0,0,0,0,0,0,0,0,0,14249.640000000001]
[null,"GUANAJUATO","HEDT700419HG2","HEDT700419HGTRRR01","JOSE TERESO HERNANDEZ DURAN","11DPT0010Y",0,0,0,0,0,0,0,1,0,0,0,0,0,0,0,0,0,0,3178.4]
[null,"GUANAJUATO","HERE800329V17","HERE800329HGTRDD03","EDGAR IVAN HERNANDEZ RODRIGUEZ","11DPT0010Y",0,0,0,0,0,0,0,1,0,0,0,0,0,0,0,0,0,0,19766.98]
[null,"GUANAJUATO","HIBA631027337","HIBA631027HGTNLN08","ANTONIO HINOJOSA BALANDRAN","11DPT0010Y",0,0,0,0,0,0,0,1,0,0,0,0,0,0,0,0,0,0,8740.6]
[null,"GUANAJUATO","JUBE7310241I6","JUBE731024MGTRLL05","ELIDUVINA JUAREZ BALANDRAN","11DPT0010Y",0,0,0,0,0,0,0,1,0,0,0,0,0,0,0,0,0,0,11534.670000000002]
[null,"GUANAJUATO","LORC760609NB1","LORC760609MDFPVL08","CLAUDETTE LOPEZ DE LA RIVA","11DPT0010Y",0,0,0,0,0,0,0,1,0,0,0,0,0,0,0,0,0,0,32990.61]
[null,"GUANAJUATO","LOVJ660127MI1","LOVJ660127HGTPLN03","JUAN LOPEZ VALENCIA","11DPT0010Y",0,0,0,0,0,0,0,1,0,0,0,0,0,0,0,0,0,0,8921.0400000000009]
[null,"GUANAJUATO","MAVR720809AXA","MAVR720809MGTNZS05","ROSA BEATRIZ MANJARREZ VAZQUEZ","11DPT0010Y",0,0,0,0,0,0,0,1,0,0,0,0,0,0,0,0,0,0,3154.4400000000005]
[null,"GUANAJUATO","MEMV791203112","MEVM791203HGTDZR15","MARIO MEDINA VAZQUEZ","11DPT0010Y",0,0,0,0,0,0,0,1,0,0,0,0,0,0,0,0,0,0,8778.67]
[null,"GUANAJUATO","MORA600920UJ0","MORA600920MGTSVN08","MA ANGELES MOSQUEDA RUVALCABA","11DPT0010Y",0,0,0,0,0,0,0,1,0,0,0,0,0,0,0,0,0,0,32120.54]
[null,"GUANAJUATO","MORR630513CT2","MORR630513HGTSVD06","RODOLFO MOSQUEDA RUVALCABA","11DPT0010Y",0,0,0,0,0,0,0,1,0,0,0,0,0,0,0,0,0,0,9738.4600000000009]
[null,"GUANAJUATO","NETN640509LW1","NETN640509MNLRRR02","NORA MERCEDES NEIRA TORRES","11DPT0010Y",0,0,0,0,0,0,0,1,0,0,0,0,0,0,0,0,0,0,2923.46]
[null,"GUANAJUATO","PATD7212262V2","PATD721226MGTCRL02","DULCE CONCEPCION PACHECO TORRES","11DPT0010Y",0,0,0,0,0,0,0,1,0,0,0,0,0,0,0,0,0,0,9021.9700000000012]
[null,"GUANAJUATO","PEGO840715TW6","PEGO840715MGTRRL04","OLGA CRISTINA PEREZ GUERRERO","11DPT0010Y",0,0,0,0,0,0,0,1,0,0,0,0,0,0,0,0,0,0,3178.4]
[null,"GUANAJUATO","PEGS750625V73","PEGS750625HGTRRR05","SERGIO JAVIER PEREZ GUERRERO","11DPT0010Y",0,0,0,0,0,0,0,1,0,0,0,0,0,0,0,0,0,0,9870.2900000000009]
[null,"GUANAJUATO","POAA7404163G8","POAA740416MDFRCN05","ANA LILIA PROA ACEVEDO","11DPT0010Y",0,0,0,0,0,0,0,1,0,0,0,0,0,0,0,0,0,0,5643.3]
[null,"GUANAJUATO","QUOG780110GB9","QUOG780110HGTNRN00","GONZALO QUINTANA ORTEGA","11DPT0010Y",0,0,0,0,0,0,0,1,0,0,0,0,0,0,0,0,0,0,15346.33]
[null,"GUANAJUATO","RACM561219L8A","RACM561219HGTMNR07","MARIO RAMIREZ CONTRERAS","11DPT0010Y",0,0,0,0,0,0,0,1,0,0,0,0,0,0,0,0,0,0,2190.1]
[null,"GUANAJUATO","RARM6206207M6","RARM620620HGTMDN03","MANUEL RAMIREZ RODRIGUEZ","11DPT0010Y",0,0,0,0,0,0,0,1,0,0,0,0,0,0,0,0,0,0,13431.55]
[null,"GUANAJUATO","RASA6006139AA","RASA600613HGTMLN04","ANTONIO RAMIREZ SOLIS","11DPT0010Y",0,0,0,0,0,0,0,1,0,0,0,0,0,0,0,0,0,0,16483.43]
[null,"GUANAJUATO","RAPB721103D6A","RAPB721103MMNMZT09","BEATRIZ EUGENIA RAMOS PAZ","11DPT0010Y",0,0,0,0,0,0,0,1,0,0,0,0,0,0,0,0,0,0,22561.71]
[null,"GUANAJUATO","RICA770621C14","RICA770621HDFCRL02","ALEJANDRO RICO CARMONA","11DPT0010Y",0,0,0,0,0,0,0,1,0,0,0,0,0,0,0,0,0,0,10317.39]
[null,"GUANAJUATO","RIRS720206SN4","RIRS720206MGTVML08","SOLEDAD SUSANA RIVERA RAMIREZ","11DPT0010Y",0,0,0,0,0,0,0,1,0,0,0,0,0,0,0,0,0,0,6754.07]
[null,"GUANAJUATO","ROGA700124964","ROGA700124MGTCZN09","ANA ELENA ROCHA GUZMAN","11DPT0010Y",0,0,0,0,0,0,0,1,0,0,0,0,0,0,0,0,0,0,9020.36]
[null,"GUANAJUATO","ROMR620310CS2","ROMR620310MDFMNC01","ROCIO ROMERO MENA","11DPT0010Y",0,0,0,0,0,0,0,1,0,0,0,0,0,0,0,0,0,0,9171]
[null,"GUANAJUATO","ROMO790623E30","ROMO790623HGTSRL08","OLIMPO ROSILLO MORENO","11DPT0010Y",0,0,0,0,0,0,0,1,0,0,0,0,0,0,0,0,0,0,5646.62]
[null,"GUANAJUATO","SOGC7802151Z2","SOGC780215MDFLRL01","CLAUDIA SOLACHE GARCIA","11DPT0010Y",0,0,0,0,0,0,0,1,0,0,0,0,0,0,0,0,0,0,5788.99]
[null,"GUANAJUATO","SUCG780821BZ7","SUCG780821HGTRSL03","GUILLERMO SUAREZ CASTRO","11DPT0010Y",0,0,0,0,0,0,0,1,0,0,0,0,0,0,0,0,0,0,10317.39]
[null,"GUANAJUATO","TEAA800207442","TEAA800207MGTRGL00","ALEJANDRA ISABEL TREJO AGUILAR","11DPT0010Y",0,0,0,0,0,0,0,1,0,0,0,0,0,0,0,0,0,0,21933.22]
[null,"GUANAJUATO","VELL651008V35","VELL651008MDFLGR02","MARIA DE LOURDES JUANA VELAZQUEZ LUGO","11DPT0010Y",0,0,0,0,0,0,0,1,0,0,0,0,0,0,0,0,0,0,3905.31]
[null,"GUANAJUATO","VESX850703GKA","VESX850703MGTLLC16","XOCHITL TOMASA VELAZQUEZ SILVA","11DPT0010Y",0,0,0,0,0,0,0,1,0,0,0,0,0,0,0,0,0,0,19147.93]
[null,"GUANAJUATO","DIRS790526AS6","DIRS790526MJCZVR00","SAIRA ESTHER DIAZ RIVERA","11DPT0010Y",0,0,0,0,0,0,0,1,0,0,0,0,0,0,0,0,0,0,25826.14]
[null,"GUANAJUATO","AAFO86011729A","AAFO860117MGTRRL08","OLGA ELIZABETH ARAUJO FERNANDEZ","11DPT0010Y",0,0,0,0,0,0,0,1,0,0,0,0,0,0,0,0,0,0,18588.23]
[null,"GUANAJUATO","SAMD841004RK2","SAMD841004MGTNLN03","DINORHA GEORGINA SANTIAGO MELCHOR","11DPT0010Y",0,0,0,0,0,0,0,1,0,0,0,0,0,0,0,0,0,0,13596.5]
[null,"GUANAJUATO","REBJ861120CG2","REBJ861120HGTYNN00","JUAN CARLOS REYNOSO BANDERAS","11DPT0010Y",0,0,0,0,0,0,0,1,0,0,0,0,0,0,0,0,0,0,3535]
[null,"GUANAJUATO","ROFA780327DH3","ROFA780327HGTDLL03","JOSE ALVARO RODRIGUEZ FLORES","11DPT0010Y",0,0,0,0,0,0,0,1,0,0,0,0,0,0,0,0,0,0,3535]
[null,"GUANAJUATO","AELE9402049E4","AELE940204HGTRPD09","EDUARDO ARREDONDO LOPEZ","11DPT0010Y",0,0,0,0,0,0,0,1,0,0,0,0,0,0,0,0,0,0,1299.5]
[null,"GUANAJUATO","AEPE451004F87","AEPE451004HGTRZD06","EDMUNDO GONTRAN ARELLANO PIZANO","11DPT0008J",0,0,0,0,0,0,0,1,0,0,0,0,0,0,0,0,0,0,4028.45]
[null,"GUANAJUATO","BIEF750826Q65","BIEF750826HGTRSL05","FILIBERTO BRISEÑO ESPITIA","11DPT0008J",0,0,0,0,0,0,0,1,0,0,0,0,0,0,0,0,0,0,22842.920000000006]
[null,"GUANAJUATO","COCJ840424II1","COCJ840424HTLCNR00","JAIRO COCOLETZI CONDE","11DPT0008J",0,0,0,0,0,0,0,1,0,0,0,0,0,0,0,0,0,0,10958.85]
[null,"GUANAJUATO","CIAV791109IT0","CIAV791109MGTRRR05","VERONICA CRISANTO ARRIAGA","11DPT0008J",0,0,0,0,0,0,0,1,0,0,0,0,0,0,0,0,0,0,14300.980000000001]
[null,"GUANAJUATO","CUMJ850922E29","CUMJ850922MGTVRV00","JAVIERA MARIANA CUEVAS MIRELES","11DPT0008J",0,0,0,0,0,0,0,1,0,0,0,0,0,0,0,0,0,0,26188.48]
[null,"GUANAJUATO","DEGJ790106AH3","DEGJ790106HGTLRR08","JORGE ALBERTO DELGADO GUERRERO","11DPT0008J",0,0,0,0,0,0,0,1,0,0,0,0,0,0,0,0,0,0,29079.72]
[null,"GUANAJUATO","EIEA830501N66","EIEA830501MGTSSN05","ANDREA ESPITIA ESPITIA","11DPT0008J",0,0,0,0,0,0,0,1,0,0,0,0,0,0,0,0,0,0,17481.2]
[null,"GUANAJUATO","EIGG680608R24","EIGG680608HGTSNR01","GERARDO ESPITIA GONZALEZ","11DPT0008J",0,0,0,0,0,0,0,1,0,0,0,0,0,0,0,0,0,0,26385.519999999997]
[null,"GUANAJUATO","GAFR660603435","GAFR660603MGTRRS00","ROSAICELA CRISTINA GARCIA FRIAS","11DPT0008J",0,0,0,0,0,0,0,1,0,0,0,0,0,0,0,0,0,0,31105.27]
[null,"GUANAJUATO","GACP660324G26","GACP660324HGTLPD03","PEDRO GALVEZ CAPORAL","11DPT0008J",0,0,0,0,0,0,0,1,0,0,0,0,0,0,0,0,0,0,24038.019999999997]
[null,"GUANAJUATO","GAPG840330FB1","GAPG840330MMCRRB02","GABRIELA GARCIA PEREZ","11DPT0008J",0,0,0,0,0,0,0,1,0,0,0,0,0,0,0,0,0,0,19383.599999999999]
[null,"GUANAJUATO","GOHM731017127","GOHM731017HGTMRG05","MIGUEL ANGEL GOMEZ HERNANDEZ","11DPT0008J",0,0,0,0,0,0,0,1,0,0,0,0,0,0,0,0,0,0,12051.43]
[null,"GUANAJUATO","GOGF7511182R7","GOGF751118HGTNSR05","FRANCISCO JAVIER GONZALEZ GASCA","11DPT0008J",0,0,0,0,0,0,0,1,0,0,0,0,0,0,0,0,0,0,24811.95]
[null,"GUANAJUATO","GOPA710319IB0","GOPA710319HGTNRD02","ADAN ALEJANDRO GONZALEZ PRESA","11DPT0008J",0,0,0,0,0,0,0,1,0,0,0,0,0,0,0,0,0,0,10890.58]
[null,"GUANAJUATO","GOPR781214HT1","GOPR781214HGTNRD05","RODOLFO GONZALEZ PRESA","11DPT0008J",0,0,0,0,0,0,0,1,0,0,0,0,0,0,0,0,0,0,14434.58]
[null,"GUANAJUATO","HEAR7110051U4","HEAR711005HDFRRY04","RAYMUNDO HERNANDEZ ARRIAGA","11DPT0008J",0,0,0,0,0,0,0,1,0,0,0,0,0,0,0,0,0,0,20856.52]
[null,"GUANAJUATO","HEEF6801012R8","HEEF680101HHGRSL09","FELIPE HERNANDEZ ESTRADA","11DPT0008J",0,0,0,0,0,0,0,1,0,0,0,0,0,0,0,0,0,0,30035.350000000002]
[null,"GUANAJUATO","HEFJ700120711","HEFG700120HGTRSD12","J. GUADALUPE HERNANDEZ FISCAL","11DPT0008J",0,0,0,0,0,0,0,1,0,0,0,0,0,0,0,0,0,0,9171]
[null,"GUANAJUATO","JULA7109296W5","JULA710929HGTRNL01","ALEJANDRO JUAREZ LEON","11DPT0008J",0,0,0,0,0,0,0,1,0,0,0,0,0,0,0,0,0,0,23065.9]
[null,"GUANAJUATO","JULB700329347","JULB700329HGTRNN09","BENITO JUAREZ LEON","11DPT0008J",0,0,0,0,0,0,0,1,0,0,0,0,0,0,0,0,0,0,20426.019999999997]
[null,"GUANAJUATO","LACD700106TJ4","LACD700106HMCGRV02","DAVID LAGUNA CARRANCO","11DPT0008J",0,0,0,0,0,0,0,1,0,0,0,0,0,0,0,0,0,0,23093.32]
[null,"GUANAJUATO","LOGS791206JH1","LOGS791206HGTPPR07","SERGIO LOPEZ GUAPO","11DPT0008J",0,0,0,0,0,0,0,1,0,0,0,0,0,0,0,0,0,0,19884.38]
[null,"GUANAJUATO","LOVV821208K16","LOVV821208HGTPZC03","VICTOR HUGO LOPEZ VAZQUEZ","11DPT0008J",0,0,0,0,0,0,0,1,0,0,0,0,0,0,0,0,0,0,14846.989999999998]
[null,"GUANAJUATO","LOVT730719N69","LOVT730719MGTPLR04","MARIA TERESITA LOPEZ VILLAGOMEZ","11DPT0008J",0,0,0,0,0,0,0,1,0,0,0,0,0,0,0,0,0,0,28586.300000000003]
[null,"GUANAJUATO","MACD620420JFA","MACD620420HGTRRV07","DAVID MARTINEZ CURTIDOR","11DPT0008J",0,0,0,0,0,0,0,1,0,0,0,0,0,0,0,0,0,0,19080.980000000003]
[null,"GUANAJUATO","MAMG691216UYA","MAMG691216HGTRRD04","JOSE GUADALUPE RAUL MARTINEZ MORENO","11DPT0008J",0,0,0,0,0,0,0,1,0,0,0,0,0,0,0,0,0,0,21357.29]
[null,"GUANAJUATO","MOYS790226DL6","MOYS790226MGTNXC08","MARIA DEL SOCORRO MONTALVO YAÑEZ","11DPT0008J",0,0,0,0,0,0,0,1,0,0,0,0,0,0,0,0,0,0,16301.280000000002]
[null,"GUANAJUATO","OOSJ630117DK1","OOSJ630117HGTRNN00","JUAN MANUEL OROPEZA SANCHEZ","11DPT0008J",0,0,0,0,0,0,0,1,0,0,0,0,0,0,0,0,0,0,32557.360000000001]
[null,"GUANAJUATO","PAAJ6210093M0","PAAE621009HGTTCN04","J ENCARNACION MOISES PATIÑO ACOSTA","11DPT0008J",0,0,0,0,0,0,0,1,0,0,0,0,0,0,0,0,0,0,8475.7300000000014]
[null,"GUANAJUATO","QUMN8108073JA","QUMN810807MGTNRR05","NEIRA JENNIFER QUINTERO MORENO","11DPT0008J",0,0,0,0,0,0,0,1,0,0,0,0,0,0,0,0,0,0,13041.02]
[null,"GUANAJUATO","RAFB620409PS9","RAFB620409MNLMNL08","BLANCA ESTHELA RAMOS FUENTES","11DPT0008J",0,0,0,0,0,0,0,1,0,0,0,0,0,0,0,0,0,0,30035.350000000002]
[null,"GUANAJUATO","RIRJ8606049A1","RIRJ860604HGTSJN07","JUAN MANUEL RIOS ROJAS","11DPT0008J",0,0,0,0,0,0,0,1,0,0,0,0,0,0,0,0,0,0,14434.6]
[null,"GUANAJUATO","ROQJ571205C63","ROQJ571205HGTBNV03","JAVIER ROBLES QUINTANILLA","11DPT0008J",0,0,0,0,0,0,0,1,0,0,0,0,0,0,0,0,0,0,10071.130000000001]
[null,"GUANAJUATO","ROGD8306177Y6","ROGD830617HGTDLG05","JOSE DIEGO RODRIGUEZ GALLEGOS","11DPT0008J",0,0,0,0,0,0,0,1,0,0,0,0,0,0,0,0,0,0,6290.58]
[null,"GUANAJUATO","ROJL7510077S9","ROJL751007MGTJMR17","LAURA MARICELA ROJAS JIMENEZ","11DPT0008J",0,0,0,0,0,0,0,1,0,0,0,0,0,0,0,0,0,0,31996.800000000003]
[null,"GUANAJUATO","RONE740321QJ6","RONE740321MGTJTS01","MARIA ESTHER ROJAS NIETO","11DPT0008J",0,0,0,0,0,0,0,1,0,0,0,0,0,0,0,0,0,0,31996.800000000003]
[null,"GUANAJUATO","TOLJ711229Q89","TOLJ711229HGTRPV00","JAVIER TORRES LOPEZ","11DPT0008J",0,0,0,0,0,0,0,1,0,0,0,0,0,0,0,0,0,0,30149.98]
[null,"GUANAJUATO","VAME680312QT2","VAME680312MGTZRL00","ELISA VAZQUEZ MARTINEZ","11DPT0008J",0,0,0,0,0,0,0,1,0,0,0,0,0,0,0,0,0,0,28468.620000000003]
[null,"GUANAJUATO","VEGR7209154U4","VEGR720915MDFNLC00","MARIA DEL ROCIO VENTURA GALLEGOS","11DPT0008J",0,0,0,0,0,0,0,1,0,0,0,0,0,0,0,0,0,0,10774.02]
[null,"GUANAJUATO","VALS820325LX7","VALS820325MGTLNL09","SILVIA NANCY VALADEZ LEON","11DPT0008J",0,0,0,0,0,0,0,1,0,0,0,0,0,0,0,0,0,0,30570.31]
[null,"GUANAJUATO","HEMR760314HY6","HEMR760314HGTRRL06","RAUL HERNANDEZ MARTINEZ","11DPT0008J",0,0,0,0,0,0,0,1,0,0,0,0,0,0,0,0,0,0,13903.68]
[null,"GUANAJUATO","AUME740716A41","AUME740716HPLGDN13","ENRIQUE AGUILAR MEDRANO","11DPT0008J",0,0,0,0,0,0,0,1,0,0,0,0,0,0,0,0,0,0,22594.559999999998]
[null,"GUANAJUATO","HEMB820716LV7","HEMB820716MGTRDR06","BRENDA HERNANDEZ MEDINA","11DPT0008J",0,0,0,0,0,0,0,1,0,0,0,0,0,0,0,0,0,0,23684.52]
[null,"GUANAJUATO","GOVA7403201E8","GOVA740320HGTMLR06","JOSE ARMANDO GOMEZ VALENCIA","11DPT0008J",0,0,0,0,0,0,0,1,0,0,0,0,0,0,0,0,0,0,28486.23]
[null,"GUANAJUATO","AETA681104M99","AETA681104MGTRPL00","ALEJANDRA ARREGUIN TAPIA","11DPT0008J",0,0,0,0,0,0,0,1,0,0,0,0,0,0,0,0,0,0,15140.25]
[null,"GUANAJUATO","CAFJ650317IR5","CAFJ650317HGTRLR08","JORGE CARRANCO FLORES","11DPT0008J",0,0,0,0,0,0,0,1,0,0,0,0,0,0,0,0,0,0,8533.380000000001]
[null,"GUANAJUATO","ROFA621121CR4","ROFA621121HMCDLR04","ARTURO RODRIGUEZ FLORES","11DPT0008J",0,0,0,0,0,0,0,1,0,0,0,0,0,0,0,0,0,0,8130.5]
[null,"GUANAJUATO","AUGJ780722V55","AUGJ780722HGTGMN00","JUAN SIMON AGUILAR GOMEZ","11DPT0011X",0,0,0,0,0,0,0,1,0,0,0,0,0,0,0,0,0,0,5032.47]
[null,"GUANAJUATO","AALJ750316LPA","AALJ750316HGTYLS05","JOSE AYALA LULE","11DPT0011X",0,0,0,0,0,0,0,1,0,0,0,0,0,0,0,0,0,0,14329.14]
[null,"GUANAJUATO","BAEJ7111265C6","BAEJ711126HGTTSS04","JESUS MARIO BAUTISTA ESCAMILLA","11DPT0011X",0,0,0,0,0,0,0,1,0,0,0,0,0,0,0,0,0,0,29243.130000000005]
[null,"GUANAJUATO","CARH670101MS3","CARH670101HGTRZC08","HECTOR CARDENAS RUIZ","11DPT0011X",0,0,0,0,0,0,0,1,0,0,0,0,0,0,0,0,0,0,21208.11]
[null,"GUANAJUATO","CAER830626JA4","CAER830626MGTRSY00","REYNA LILIANA CARDOSO ESCUTIA","11DPT0011X",0,0,0,0,0,0,0,1,0,0,0,0,0,0,0,0,0,0,8270.4599999999991]
[null,"GUANAJUATO","CABG7405015A5","CABG740501MGTSRB06","GABRIELA CASTRO BARBOSA","11DPT0011X",0,0,0,0,0,0,0,1,0,0,0,0,0,0,0,0,0,0,26328.73]
[null,"GUANAJUATO","CILH750107I47","CILH750107MGTSPL00","HILDA LUCIA CISNEROS LOPEZ","11DPT0011X",0,0,0,0,0,0,0,1,0,0,0,0,0,0,0,0,0,0,16150.809999999998]
[null,"GUANAJUATO","EAMA860511UL8","EAMA860511MMNSRN08","ANA LUCIA ESCALANTE MARIN","11DPT0011X",0,0,0,0,0,0,0,1,0,0,0,0,0,0,0,0,0,0,12316.3]
[null,"GUANAJUATO","MOSA681126R27","MOSA681126MGTNRN06","MA DE LOS ANGELES MONTERO SIERRA","11DPT0011X",0,0,0,0,0,0,0,1,0,0,0,0,0,0,0,0,0,0,33768.68]
[null,"GUANAJUATO","GAMA5108287F5","GAMA510828HGTRRG09","AGUSTIN GARDIAZABAL MORALES","11DPT0011X",0,0,0,0,0,0,0,1,0,0,0,0,0,0,0,0,0,0,22010.409999999996]
[null,"GUANAJUATO","GUCT560830E19","GUCT560830MGTRSR17","MA TERESA GUERRERO CASTRO","11DPT0011X",0,0,0,0,0,0,0,1,0,0,0,0,0,0,0,0,0,0,34315.130000000005]
[null,"GUANAJUATO","HECM670422CC4","HECM670422MDFRBR02","MARIA MARCELA HERRERA CEBALLOS","11DPT0011X",0,0,0,0,0,0,0,1,0,0,0,0,0,0,0,0,0,0,34340.699999999997]
[null,"GUANAJUATO","LUCF7002115Q9","LUCF700211HGTLND05","FIDEL LULE CONTRERAS","11DPT0011X",0,0,0,0,0,0,0,1,0,0,0,0,0,0,0,0,0,0,10840.85]
[null,"GUANAJUATO","MABR8302104V5","MABR830210HGTRRB02","ROBERTO MARTINEZ BARRERA","11DPT0011X",0,0,0,0,0,0,0,1,0,0,0,0,0,0,0,0,0,0,883.75]
[null,"GUANAJUATO","MAHA821225TQ5","MAHA821225MGTRRL02","ALEJANDRA MARTINEZ HERNANDEZ","11DPT0011X",0,0,0,0,0,0,0,1,0,0,0,0,0,0,0,0,0,0,18720.019999999997]
[null,"GUANAJUATO","MERA6410168B4","MERA641016HGTDZL14","ALEJANDRO MEDINA REZA","11DPT0011X",0,0,0,0,0,0,0,1,0,0,0,0,0,0,0,0,0,0,15972.830000000002]
[null,"GUANAJUATO","NACJ810605U92","NACJ810605HGTRRR09","JORGE ALBERTO NARVAEZ CARDOSO","11DPT0011X",0,0,0,0,0,0,0,1,0,0,0,0,0,0,0,0,0,0,3775.4]
[null,"GUANAJUATO","NAFE720728918","NAFE720728MDFVRV08","EVANGELINA NAVARRETE FARFAN","11DPT0011X",0,0,0,0,0,0,0,1,0,0,0,0,0,0,0,0,0,0,18046.190000000002]
[null,"GUANAJUATO","PACM790918HT8","PACM790918HGTNRR13","MAURICIO PANIAGUA CARRILLO","11DPT0011X",0,0,0,0,0,0,0,1,0,0,0,0,0,0,0,0,0,0,25403.24]
[null,"GUANAJUATO","PEHS851206HS7","PEHS851206HGTXRL09","JOSE SALUD PEÑA HERNANDEZ","11DPT0011X",0,0,0,0,0,0,0,1,0,0,0,0,0,0,0,0,0,0,21002.109999999997]
[null,"GUANAJUATO","PATF850801UJA","PATF850801HGTLPR02","FRANCISCO EVERARDO PLAZA TAPIA","11DPT0011X",0,0,0,0,0,0,0,1,0,0,0,0,0,0,0,0,0,0,18529.29]
[null,"GUANAJUATO","RISA740722842","RISA740722MGTCNL08","ALEJANDRA RICALDE SANCHEZ","11DPT0011X",0,0,0,0,0,0,0,1,0,0,0,0,0,0,0,0,0,0,17594.34]
[null,"GUANAJUATO","SACF740918BK7","SACF740918HJCNML11","FELIX SANCHEZ CAMPOS","11DPT0011X",0,0,0,0,0,0,0,1,0,0,0,0,0,0,0,0,0,0,12048.529999999999]
[null,"GUANAJUATO","SAPG631009QMA","SAPG631009MGTNRD02","GUADALUPE SANCHEZ PARRA","11DPT0011X",0,0,0,0,0,0,0,1,0,0,0,0,0,0,0,0,0,0,8484]
[null,"GUANAJUATO","SIPH640527P81","SIPH640527HGTRRG09","HUGO EVERARDO SIERRA PARADA","11DPT0011X",0,0,0,0,0,0,0,1,0,0,0,0,0,0,0,0,0,0,29003.590000000004]
[null,"GUANAJUATO","ZAMJ740416IL1","ZAMJ740416HDFMXR00","JORGE ZAMORA MUÑIZ","11DPT0011X",0,0,0,0,0,0,0,1,0,0,0,0,0,0,0,0,0,0,6901.42]
[null,"GUANAJUATO","HEMY820605MZ2","HEMY820605MGTRNL07","YOLANDA HERNANDEZ MONTOYA","11DPT0011X",0,0,0,0,0,0,0,1,0,0,0,0,0,0,0,0,0,0,25393.11]
[null,"GUANAJUATO","LIRK810903L47","LIRK810903MCHNLR02","KARLA ROCIO LINO DEL REAL","11DPT0011X",0,0,0,0,0,0,0,1,0,0,0,0,0,0,0,0,0,0,2436.77]
[null,"GUANAJUATO","SACM860807655","SACM860807HGTMMN00","JOSE MANUEL SAMANO CAMARGO","11DPT0011X",0,0,0,0,0,0,0,1,0,0,0,0,0,0,0,0,0,0,29462.760000000002]
[null,"GUANAJUATO","LUML8603214V6","LUML860321MGTNDN02","LINA LUNA MEDINA","11DPT0011X",0,0,0,0,0,0,0,1,0,0,0,0,0,0,0,0,0,0,21351.42]
[null,"GUANAJUATO","GACL6901175Y4","GACL690117HGTRRN01","LEONEL GARCIA CRUZ","11DPT0011X",0,0,0,0,0,0,0,1,0,0,0,0,0,0,0,0,0,0,14818.08]
[null,"GUANAJUATO","RAGE851021JI8","RAGE851021MGTYML08","ELVIA SUSANA RAYA GOMEZ","11DPT0011X",0,0,0,0,0,0,0,1,0,0,0,0,0,0,0,0,0,0,27184.17]
[null,"GUANAJUATO","GARR8203151UA","GARR820315HHGRBY08","REYMUNDO GARCIA ROBLES","11DPT0011X",0,0,0,0,0,0,0,1,0,0,0,0,0,0,0,0,0,0,10929.060000000001]
[null,"GUANAJUATO","GOLU740104CZ2","GOXL740104HGTNXS05","JOSE LUIS GONZALEZ","11DPT0011X",0,0,0,0,0,0,0,1,0,0,0,0,0,0,0,0,0,0,2659.6400000000003]
[null,"GUANAJUATO","GAAM880803SI2","GAAM880803MGTNLR00","MARIANA GANTES ALCANTAR","11DPT0011X",0,0,0,0,0,0,0,1,0,0,0,0,0,0,0,0,0,0,2168.13]
[null,"GUANAJUATO","AUMJ800706AM9","AUMJ800706HMCGRL14","JOEL AGUILLON MORALES","11DPT0012W",0,0,0,0,0,0,0,1,0,0,0,0,0,0,0,0,0,0,18149.989999999998]
[null,"GUANAJUATO","AEDI770518KX0","AEDI770518HGTRRS01","ISRAEL ARMANDO ARREDONDO DORANTES","11DPT0012W",0,0,0,0,0,0,0,1,0,0,0,0,0,0,0,0,0,0,15041.7]
[null,"GUANAJUATO","CACV851205PW0","CACV851205MQTBRR00","VERA CABELLO CORONA","11DPT0012W",0,0,0,0,0,0,0,1,0,0,0,0,0,0,0,0,0,0,15198.2]
[null,"GUANAJUATO","EIHA701029QW9","EIHA701029HGTSRL01","ALEJANDRO ESPINOSA HERNANDEZ","11DPT0012W",0,0,0,0,0,0,0,1,0,0,0,0,0,0,0,0,0,0,10942.29]
[null,"GUANAJUATO","HELM570929SP8","HELM570929HQTRRG04","MIGUEL HERNANDEZ LIRA","11DPT0012W",0,0,0,0,0,0,0,1,0,0,0,0,0,0,0,0,0,0,11825.45]
[null,"GUANAJUATO","JAAM590516MH6","JAAM590516HGTMRN03","MANUEL JAIME ARELLANO","11DPT0012W",0,0,0,0,0,0,0,1,0,0,0,0,0,0,0,0,0,0,16143.18]
[null,"GUANAJUATO","LOZE710604574","LOZE710604MGTZRG00","MA. EUGENIA LOZADA ZARAZUA","11DPT0012W",0,0,0,0,0,0,0,1,0,0,0,0,0,0,0,0,0,0,13289.67]
[null,"GUANAJUATO","MEGR720113GQ8","MEGR720113HMNRNM02","RAMIRO MERCADO GONZALEZ","11DPT0012W",0,0,0,0,0,0,0,1,0,0,0,0,0,0,0,0,0,0,12481.84]
[null,"GUANAJUATO","MUIM841205CWA","MUIM841205MQTXBR03","MARIANA MUÑOZ IBARRA","11DPT0012W",0,0,0,0,0,0,0,1,0,0,0,0,0,0,0,0,0,0,19274.010000000002]
[null,"GUANAJUATO","OAVO8206077E6","OAVO820607HMNCZM08","OMAR ANTONIO OCAMPO VAZQUEZ","11DPT0012W",0,0,0,0,0,0,0,1,0,0,0,0,0,0,0,0,0,0,17331.82]
[null,"GUANAJUATO","OIMG610814NA3","OIMG610814MGTRLD00","MA GUADALUPE ORTIZ MELENDEZ","11DPT0012W",0,0,0,0,0,0,0,1,0,0,0,0,0,0,0,0,0,0,8324.6]
[null,"GUANAJUATO","PARB8612287J6","PARB861228MGTCDR09","BARBARA PALOMA PACHECO RODRIGUEZ","11DPT0012W",0,0,0,0,0,0,0,1,0,0,0,0,0,0,0,0,0,0,21295.11]
[null,"GUANAJUATO","PEGA8608144V9","PEGA860814MGTRTD07","MARIA AIDA PEREZ GUTIERREZ","11DPT0012W",0,0,0,0,0,0,0,1,0,0,0,0,0,0,0,0,0,0,24096.940000000002]
[null,"GUANAJUATO","PEQP6003137R3","PEQP600313MQTRNT01","PATRICIA ANTONIA PEREZ QUINTERO","11DPT0012W",0,0,0,0,0,0,0,1,0,0,0,0,0,0,0,0,0,0,32289.88]
[null,"GUANAJUATO","PABJ671110D69","PABJ671110HJCLRS08","JOSE DE JESUS PLACENCIA BARAJAS","11DPT0012W",0,0,0,0,0,0,0,1,0,0,0,0,0,0,0,0,0,0,21953.379999999997]
[null,"GUANAJUATO","RASN800226H40","RASN800226HGTNRS07","NESTOR RANGEL SUAREZ","11DPT0012W",0,0,0,0,0,0,0,1,0,0,0,0,0,0,0,0,0,0,16871.84]
[null,"GUANAJUATO","RERE660715NDA","RERE660715HGTYMN06","ENRIQUE REYES ROMERO","11DPT0012W",0,0,0,0,0,0,0,1,0,0,0,0,0,0,0,0,0,0,26773.9]
[null,"GUANAJUATO","RIHS8511232P3","RIHS851123MGTVRC00","MARIA SOCORRO RIVERA HERNANDEZ","11DPT0012W",0,0,0,0,0,0,0,1,0,0,0,0,0,0,0,0,0,0,24980.690000000002]
[null,"GUANAJUATO","ROEL820326QF8","ROEL820326MGTCSZ05","MARIA DE LA LUZ ROCHA ESCOBAR","11DPT0012W",0,0,0,0,0,0,0,1,0,0,0,0,0,0,0,0,0,0,16982.75]
[null,"GUANAJUATO","ROGJ7510022G2","ROGJ751002HGTDNL09","J JOEL RODRIGUEZ GONZALEZ","11DPT0012W",0,0,0,0,0,0,0,1,0,0,0,0,0,0,0,0,0,0,7280.51]
[null,"GUANAJUATO","RORJ620506HP8","RORJ620506HTLDMN05","JUAN RODRIGUEZ ROMERO","11DPT0012W",0,0,0,0,0,0,0,1,0,0,0,0,0,0,0,0,0,0,18328.78]
[null,"GUANAJUATO","ROFM640322BG7","ROFM640322HGTMRR00","MARTIN ROMERO FERRO","11DPT0012W",0,0,0,0,0,0,0,1,0,0,0,0,0,0,0,0,0,0,14400.45]
[null,"GUANAJUATO","SAPG700911SZ4","SAPG700911HDFNRS05","GUSTAVO SANCHEZ PEREZ","11DPT0012W",0,0,0,0,0,0,0,1,0,0,0,0,0,0,0,0,0,0,21208.54]
[null,"GUANAJUATO","SATE820405F51","SATE820405MGTNRV00","EVA MARIA DEL ROSARIO SANCHEZ TURRUBIARTES","11DPT0012W",0,0,0,0,0,0,0,1,0,0,0,0,0,0,0,0,0,0,18881.34]
[null,"GUANAJUATO","SOZC590907935","SOZC590907HQTRXN08","JOSE CONRADO SORIA ZUÑIGA","11DPT0012W",0,0,0,0,0,0,0,1,0,0,0,0,0,0,0,0,0,0,26366.94]
[null,"GUANAJUATO","SORR730605V46","SORR730605HDFTMD03","RODOLFO SOTO ROMERO","11DPT0012W",0,0,0,0,0,0,0,1,0,0,0,0,0,0,0,0,0,0,20749.39]
[null,"GUANAJUATO","VAMG850109N64","VAMG850109MBSZNB01","GABRIELA VAZQUEZ MONJARAZ","11DPT0012W",0,0,0,0,0,0,0,1,0,0,0,0,0,0,0,0,0,0,21335.58]
[null,"GUANAJUATO","VAPG660502A11","VAPG660502HMCZRR05","GERMAN VAZQUEZ PERALTA","11DPT0012W",0,0,0,0,0,0,0,1,0,0,0,0,0,0,0,0,0,0,21100.989999999998]
[null,"GUANAJUATO","ZARI821025R29","ZARI821025MGTRBG09","MARIA IGNACIA ZARAZUA RUBIO","11DPT0012W",0,0,0,0,0,0,0,1,0,0,0,0,0,0,0,0,0,0,20359.79]
[null,"GUANAJUATO","MASA840303K12","MASA840303MDFRNN08","MARIA DE LOS ANGELES MARTINEZ SANCHEZ","11DPT0012W",0,0,0,0,0,0,0,1,0,0,0,0,0,0,0,0,0,0,10516.619999999999]
[null,"GUANAJUATO","GOHJ740202PJ6","GOHJ740202MGTMRN01","MA JUANA GOMEZ HERNANDEZ","11DPT0012W",0,0,0,0,0,0,0,1,0,0,0,0,0,0,0,0,0,0,11668.43]
[null,"GUANAJUATO","GOHS8907177Z1","GOHS890717MQTMRN05","SANDRA IRAIS GOMEZ HERNANDEZ","11DPT0012W",0,0,0,0,0,0,0,1,0,0,0,0,0,0,0,0,0,0,9096.5]
[null,"GUANAJUATO","GARB840625CP8","GARB840625MQTLDR08","BRENDA LIDIA GALLEGOS RODRIGUEZ","11DPT0012W",0,0,0,0,0,0,0,1,0,0,0,0,0,0,0,0,0,0,23772.89]
[null,"GUANAJUATO","BASC910503127","BASC910503MGTZNR03","MARIA CRUZ BAEZA SANCHEZ","11DPT0012W",0,0,0,0,0,0,0,1,0,0,0,0,0,0,0,0,0,0,11902.86]
[null,"GUANAJUATO","AEPI820115AQ1","AEPI820115MDFRLS04","ISABEL ARREDONDO PLATA","11DPT0012W",0,0,0,0,0,0,0,1,0,0,0,0,0,0,0,0,0,0,13845.43]
[null,"GUANAJUATO","ZARJ781201E25","ZARJ781201HGTRNS07","JESUS ZARAZUA RANGEL","11DPT0012W",0,0,0,0,0,0,0,1,0,0,0,0,0,0,0,0,0,0,11135.239999999998]
[null,"GUANAJUATO","CAMJ890730SG6","CAMJ890730MDFSDZ09","JAZMIN CASASOLA MEDINA","11DPT0012W",0,0,0,0,0,0,0,1,0,0,0,0,0,0,0,0,0,0,12385.77]
[null,"GUANAJUATO","PEGR750725A34","PEGR750725HDFRTC00","RICARDO PEREZ GUTIERREZ","11DPT0012W",0,0,0,0,0,0,0,1,0,0,0,0,0,0,0,0,0,0,11812.77]
[null,"GUANAJUATO","RORE431022TB0","RORE431022HGTDMD08","EDILBERTO RODRIGUEZ ROMERO","11DPT0012W",0,0,0,0,0,0,0,1,0,0,0,0,0,0,0,0,0,0,25984.489999999998]
[null,"GUANAJUATO","PEBG910930PM0","PEBG910930MQTRCD08","MARIA GUADALUPE PEREZ BECERRA","11DPT0012W",0,0,0,0,0,0,0,1,0,0,0,0,0,0,0,0,0,0,3496.7199999999993]
[null,"GUANAJUATO","AUMA910826RH0","AUMA910826MGTGXL03","ALEJANDRA AGUILLON MUÑOZ","11DPT0012W",0,0,0,0,0,0,0,1,0,0,0,0,0,0,0,0,0,0,13124.95]
[null,"GUANAJUATO","ZABA871015J40","ZABA871015HGTRCM04","AMANDO ZARAZUA BECERRA","11DPT0012W",0,0,0,0,0,0,0,1,0,0,0,0,0,0,0,0,0,0,3383.0299999999997]
[null,"GUANAJUATO","MOHS911002I27","MOHS911002HMCNRR00","SERGIO MONTES DE OCA HURTADO","11DPT0012W",0,0,0,0,0,0,0,1,0,0,0,0,0,0,0,0,0,0,1809.5499999999997]
[null,"GUANAJUATO","SOMJ860107SDA","SOMJ860107MTSSNS08","JESSICA SOSA MENA","11DPT0012W",0,0,0,0,0,0,0,1,0,0,0,0,0,0,0,0,0,0,22163.55]
[null,"GUANAJUATO","BAMV8801104X4","BAMV880110MGTRNR09","VERONICA GUADALUPE BRAVO MONTES","11DPT0012W",0,0,0,0,0,0,0,1,0,0,0,0,0,0,0,0,0,0,3535]
[null,"GUANAJUATO","MESL721106M79","MESL721106HMCNNC01","LUCIANO MENDOZA SANCHEZ","11DPT0012W",0,0,0,0,0,0,0,1,0,0,0,0,0,0,0,0,0,0,15259.44]
[null,"GUANAJUATO","NOIG870606719","NOIG870606HMCGNS09","GUSTAVO NOGUEZ INIESTA","11DPT0012W",0,0,0,0,0,0,0,1,0,0,0,0,0,0,0,0,0,0,17262.599999999999]
[null,"GUANAJUATO","GORC720101QI2","GORC720101MMNNBR04","CRISTINA GONZALEZ ROBLES","11DPT0012W",0,0,0,0,0,0,0,1,0,0,0,0,0,0,0,0,0,0,16546.400000000001]
[null,"GUANAJUATO","HEMJ750321M79","HEMJ750321HPLRRV10","JAVIER HERRERA MARTINEZ","11DPT0012W",0,0,0,0,0,0,0,1,0,0,0,0,0,0,0,0,0,0,2789.59]
[null,"GUANAJUATO","GACI810611U19","GACI810611HGTRRS03","JOSE ISRAEL GARCIA CORONA","11DPT0012W",0,0,0,0,0,0,0,1,0,0,0,0,0,0,0,0,0,0,1992.5700000000002]
[null,"GUANAJUATO","LOHF8609268M2","LOHF860926MGTPRR03","MARIA FERNANDA LOPEZ HERNANDEZ","11DPT0012W",0,0,0,0,0,0,0,1,0,0,0,0,0,0,0,0,0,0,7970.27]
[null,"GUANAJUATO","LEBA771021UG8","LEBA771021HGTDSR05","ARNULFO LEDESMA BASALDUA","11DPT0012W",0,0,0,0,0,0,0,1,0,0,0,0,0,0,0,0,0,0,4218.66]
[null,"GUANAJUATO","HEMM911106CQ0","HEMM911106MQTRRR07","MARIANA GUADALUPE HERRERA MORALES","11DPT0012W",0,0,0,0,0,0,0,1,0,0,0,0,0,0,0,0,0,0,2599]
[null,"GUANAJUATO","AAAL5409208IA","AAXA540920HDFLXL04","JOSE ALEJANDRO ALVAREZ","11DPT0013V",0,0,0,0,0,0,0,1,0,0,0,0,0,0,0,0,0,0,23242.65]
[null,"GUANAJUATO","AAMT5503211V3","AAMT550321MGTLRR02","MARIA TERESA ALVAREZ MARES","11DPT0013V",0,0,0,0,0,0,0,1,0,0,0,0,0,0,0,0,0,0,22246.98]
[null,"GUANAJUATO","BURL821104LM8","BURL821104MGTTMT09","LETICIA BUTANDA RAMIREZ","11DPT0013V",0,0,0,0,0,0,0,1,0,0,0,0,0,0,0,0,0,0,21649.19]
[null,"GUANAJUATO","COML571122DD6","COML571122MGTRRT18","LETICIA CORNEJO MARTINEZ","11DPT0013V",0,0,0,0,0,0,0,1,0,0,0,0,0,0,0,0,0,0,22774.959999999999]
[null,"GUANAJUATO","DOIB750304RM3","DOIB750304HGTRNN07","BENJAMIN DORANTES INFANTE","11DPT0013V",0,0,0,0,0,0,0,1,0,0,0,0,0,0,0,0,0,0,12726]
[null,"GUANAJUATO","HERA790726J96","HERA790726MGTRMN07","ANA VERONICA HERNANDEZ RAMIREZ","11DPT0013V",0,0,0,0,0,0,0,1,0,0,0,0,0,0,0,0,0,0,25334.190000000002]
[null,"GUANAJUATO","LORM590406948","LORG590406MGTPDD05","MA. GUADALUPE LOPEZ RODRIGUEZ","11DPT0013V",0,0,0,0,0,0,0,1,0,0,0,0,0,0,0,0,0,0,31994.63]
[null,"GUANAJUATO","MORJ631227S89","MORJ631227HGTTMN01","JUAN MOTA RAMIREZ","11DPT0013V",0,0,0,0,0,0,0,1,0,0,0,0,0,0,0,0,0,0,14832.53]
[null,"GUANAJUATO","RIGM700422KM3","RIGM700422MGTVNG06","MA. MAGDALENA RIVERA GONZALEZ","11DPT0013V",0,0,0,0,0,0,0,1,0,0,0,0,0,0,0,0,0,0,25093.279999999999]
[null,"GUANAJUATO","SAPJ7305052R5","SAPJ730505HGTNRN06","JUAN CARLOS SANCHEZ PEREZ","11DPT0013V",0,0,0,0,0,0,0,1,0,0,0,0,0,0,0,0,0,0,24728.27]
[null,"GUANAJUATO","VEVS430308H18","VEVS430308MGTRLL04","MA SOLEDAD VERA VALTIERRA","11DPT0013V",0,0,0,0,0,0,0,1,0,0,0,0,0,0,0,0,0,0,21106.250000000004]
[null,"GUANAJUATO","VIBM750212ED8","VIBM750212MDFLRN06","MONICA VILCHIS BARCENAS","11DPT0013V",0,0,0,0,0,0,0,1,0,0,0,0,0,0,0,0,0,0,31051.96]
[null,"GUANAJUATO","DULJ8108233XA","DULJ810823HGTQPN02","JUAN IGNACIO DUQUE LOPEZ","11DPT0013V",0,0,0,0,0,0,0,1,0,0,0,0,0,0,0,0,0,0,23348.15]
[null,"GUANAJUATO","MEGC861127FF5","MEGC861127HGTZRR00","CARLOS FRANCISCO MEZA GARCIA","11DPT0013V",0,0,0,0,0,0,0,1,0,0,0,0,0,0,0,0,0,0,17528.120000000003]
[null,"GUANAJUATO","MAEC6907295B4","MAEC690729MGTTSL04","CLAUDIA MATA ESTRADA","11DPT0013V",0,0,0,0,0,0,0,1,0,0,0,0,0,0,0,0,0,0,25658.23]
[null,"GUANAJUATO","RAEM750806613","RAEM750806MDFMLN07","MONICA MARCELA RAMIREZ ELIZALDE","11DPT0013V",0,0,0,0,0,0,0,1,0,0,0,0,0,0,0,0,0,0,15987.67]
[null,"GUANAJUATO","GOAJ880125GX4","GOAJ880125HGTNLS06","JOSUE ABRAHAM GONZaLEZ ALCANTAR","11DPT0013V",0,0,0,0,0,0,0,1,0,0,0,0,0,0,0,0,0,0,14229.52]
[null,"GUANAJUATO","MARM860927BI6","MARM860927MGTRVN09","MARIA MONTSERRAT MARES RIVERA","11DPT0013V",0,0,0,0,0,0,0,1,0,0,0,0,0,0,0,0,0,0,12528.19]
[null,"GUANAJUATO","REDA870319HH9","REDA870319HGTGVR03","ARTURO REGALADO DaVILA","11DPT0013V",0,0,0,0,0,0,0,1,0,0,0,0,0,0,0,0,0,0,18283.899999999998]
[null,"GUANAJUATO","SECJ780511UPA","SECJ780511MGTRHN02","JUANA MARiA CONCEPCIoN SERRANO CHAGOYA","11DPT0013V",0,0,0,0,0,0,0,1,0,0,0,0,0,0,0,0,0,0,17409.88]
[null,"GUANAJUATO","MOCL7210035P7","MOCL721003MGTRLL04","LILIA ADRIANA MORENO CALDERAS","11DPT0013V",0,0,0,0,0,0,0,1,0,0,0,0,0,0,0,0,0,0,6328.01]
[null,"GUANAJUATO","OINM651022J76","OINM651022HGTRVR07","MARTiN ORTIZ NAVARRO","11DPT0013V",0,0,0,0,0,0,0,1,0,0,0,0,0,0,0,0,0,0,21202.240000000002]
[null,"GUANAJUATO","LOSC860106KF2","LOSC860106HGTPRH07","CHRISTIAN EMMANUEL LoPEZ SUaREZ","11DPT0013V",0,0,0,0,0,0,0,1,0,0,0,0,0,0,0,0,0,0,16520.849999999999]
[null,"GUANAJUATO","ROAA890923NX1","ROAA890923MGTMLR00","ARACELI ROMERO ALDERETE","11DPT0013V",0,0,0,0,0,0,0,1,0,0,0,0,0,0,0,0,0,0,14089.74]
[null,"GUANAJUATO","EILL500310BA8","EILL500310MDFLLL09","LILIA SUSANA ELIZALDE LLOPIS","11DPT0013V",0,0,0,0,0,0,0,1,0,0,0,0,0,0,0,0,0,0,21386.77]
[null,"GUANAJUATO","CAMJ6704193Z4","CAMJ670419HGTRRS00","JOSE DE JESUS CARRILLO MARTINEZ","11DPT0013V",0,0,0,0,0,0,0,1,0,0,0,0,0,0,0,0,0,0,23182.65]
[null,"GUANAJUATO","MAFM7705021D2","MAFM770502MGTCNR08","MARICRUZ MACIAS FUENTES","11DPT0013V",0,0,0,0,0,0,0,1,0,0,0,0,0,0,0,0,0,0,10862.46]
[null,"GUANAJUATO","HEMG701231TT3","HEMG701231HGTRRL00","GUILLERMO HERNANDEZ MARTINEZ","11DPT0013V",0,0,0,0,0,0,0,1,0,0,0,0,0,0,0,0,0,0,6091.93]
[null,"GUANAJUATO","VAMA890131B41","VAMA890131MGTZRR09","ARELY VAZQUEZ MORALES","11DPT0013V",0,0,0,0,0,0,0,1,0,0,0,0,0,0,0,0,0,0,8045.3200000000006]
[null,"GUANAJUATO","CANL660925TG9","CANL660925HJCSVS04","LUIS GUILLERMO CASTELLANOS NAVARRO","11DPT0013V",0,0,0,0,0,0,0,1,0,0,0,0,0,0,0,0,0,0,8230.73]
[null,"GUANAJUATO","VESF650920AD9","VESF650920HNLGLR08","FROYLAN VEGA SALAZAR","11DPT0013V",0,0,0,0,0,0,0,1,0,0,0,0,0,0,0,0,0,0,10542.080000000002]
[null,"GUANAJUATO","MAFV670203JA9","MAFV670203MGTCNR06","VERONICA MACiAS FUENTES","11DPT0013V",0,0,0,0,0,0,0,1,0,0,0,0,0,0,0,0,0,0,6160.64]
[null,"GUANAJUATO","LACC8208037T6","LACC820803MGTRBL02","CLARA BERENICE LARA COBIAN","11DPT0013V",0,0,0,0,0,0,0,1,0,0,0,0,0,0,0,0,0,0,2542.7200000000003]
[null,"GUANAJUATO","RECF741129SW1","RECF741129HJCYRR05","FRANCISCO JAVIER DE LOS REYES CRUZ","11DPT0013V",0,0,0,0,0,0,0,1,0,0,0,0,0,0,0,0,0,0,10840.67]
[null,"GUANAJUATO","GOPR871116UA7","GOPR871116MGTNLS07","ROSA ISELA GONZaLEZ PALACIOS","11DPT0013V",0,0,0,0,0,0,0,1,0,0,0,0,0,0,0,0,0,0,5482.7400000000007]
[null,"GUANAJUATO","LOGL7610287C2","LOGL761028HGTPRS09","LUIS PASCUAL LoPEZ GUERRERO","11DPT0013V",0,0,0,0,0,0,0,1,0,0,0,0,0,0,0,0,0,0,3045.9700000000003]
[null,"GUANAJUATO","SAJM650712IR3","SAJM650712HMNNCG01","MIGUEL ANGEL SANCHEZ JACOBO","11DPT0013V",0,0,0,0,0,0,0,1,0,0,0,0,0,0,0,0,0,0,6701.1299999999992]
[null,"GUANAJUATO","COMM6011273IA","COMM601127MGTNRR08","MARGARITA CONTRERAS MARMOLEJO","11DPT0013V",0,0,0,0,0,0,0,1,0,0,0,0,0,0,0,0,0,0,6328.01]
[null,"GUANAJUATO","ROAD891227G7A","ROAD891227MGTMDN01","DIANA VERONICA ROMERO ADONA","11DPT0013V",0,0,0,0,0,0,0,1,0,0,0,0,0,0,0,0,0,0,5406.19]
[null,"GUANAJUATO","COAE9110233T9","COAE911023HGTRGD00","EDGAR ULISES CORDOVA AGUIRRE","11DPT0013V",0,0,0,0,0,0,0,1,0,0,0,0,0,0,0,0,0,0,3072.45]
[null,"GUANAJUATO","OECA580713U8A","OECA580713MGTJNM01","AMALIA OJEDA CONTRERAS","11DPT0013V",0,0,0,0,0,0,0,1,0,0,0,0,0,0,0,0,0,0,7031.1]
[null,"GUANAJUATO","VARR690117882","VARR690117MDFRVC00","MA DEL ROCIO VARGAS RIVERA","11DPT0013V",0,0,0,0,0,0,0,1,0,0,0,0,0,0,0,0,0,0,4767.6000000000004]
[null,"GUANAJUATO","CAPD830504746","CAPD830504HGTRTG05","DIEGO FELIPE CARDENAS PATIÑO","11DPT0014U",0,0,0,0,0,0,0,1,0,0,0,0,0,0,0,0,0,0,35040.590000000004]
[null,"GUANAJUATO","AACJ6404113K8","AACJ640411HGTNBV01","JAVIER ANDRADE CIBRIAN","11DPT0014U",0,0,0,0,0,0,0,1,0,0,0,0,0,0,0,0,0,0,29855.09]
[null,"GUANAJUATO","EALA741207MR5","EALA741207MGTSND01","ADRIANA ESCAMILLA LUNA","11DPT0014U",0,0,0,0,0,0,0,1,0,0,0,0,0,0,0,0,0,0,14316.77]
[null,"GUANAJUATO","EAGL600822HR9","EAGL600822HGTSNR08","LORENZO PABLO ESTRADA GONZALEZ","11DPT0014U",0,0,0,0,0,0,0,1,0,0,0,0,0,0,0,0,0,0,8173.8600000000006]
[null,"GUANAJUATO","GAAA750801K73","GAAA750801MGTYVN02","ANGELICA MARIA GAYTAN AVILA","11DPT0014U",0,0,0,0,0,0,0,1,0,0,0,0,0,0,0,0,0,0,33301.5]
[null,"GUANAJUATO","RIMF850611721","RIMF850611MGTNJB09","FABIOLA RINCON MOJICA","11DPT0014U",0,0,0,0,0,0,0,1,0,0,0,0,0,0,0,0,0,0,33998.589999999997]
[null,"GUANAJUATO","SACG751101985","SACG751101HDFNRR03","GERARDO JAVIER SANCHEZ CARRANZA","11DPT0014U",0,0,0,0,0,0,0,1,0,0,0,0,0,0,0,0,0,0,23133.239999999998]
[null,"GUANAJUATO","SEHJ520104JY1","SEHR520104HGTRRG15","J. RIGOBERTO SERVIN HERNANDEZ","11DPT0014U",0,0,0,0,0,0,0,1,0,0,0,0,0,0,0,0,0,0,12661.19]
[null,"GUANAJUATO","SAPG841029E61","SAPG841029HGTNRD01","JOSE GUADALUPE SANDOVAL PEREZ","11DPT0014U",0,0,0,0,0,0,0,1,0,0,0,0,0,0,0,0,0,0,17610.37]
[null,"GUANAJUATO","AEAJ830601BM3","AEAJ830601HGTRRN02","JUAN RAMON ARELLANO ARIAS","11DPT0014U",0,0,0,0,0,0,0,1,0,0,0,0,0,0,0,0,0,0,22178.92]
[null,"GUANAJUATO","SAMJ8108157T3","SAMJ810815HGTNTR06","JORGE ADRIAN SANCHEZ MATEHUALA","11DPT0014U",0,0,0,0,0,0,0,1,0,0,0,0,0,0,0,0,0,0,9866.27]
[null,"GUANAJUATO","VEFF790430A24","VEFF790430MGTNLT05","FATIMA NOHEMI VENEGAS FLORES","11DPT0014U",0,0,0,0,0,0,0,1,0,0,0,0,0,0,0,0,0,0,29147.31]
[null,"GUANAJUATO","CIHJ8210229R1","CIHJ821022HGTHRR04","JORGE LUIS CHIA HERNANDEZ","11DPT0014U",0,0,0,0,0,0,0,1,0,0,0,0,0,0,0,0,0,0,24568.270000000004]
[null,"GUANAJUATO","PELJ9208313F3","PELJ920831HSPRPN06","JUAN MARIO PEREZ LOPEZ","11DPT0014U",0,0,0,0,0,0,0,1,0,0,0,0,0,0,0,0,0,0,7310.3200000000006]
[null,"GUANAJUATO","LUAM950619UA1","LUAM950619HNLNLG07","MIGUEL ALBERTO LUNA ALONSO","11DPT0014U",0,0,0,0,0,0,0,1,0,0,0,0,0,0,0,0,0,0,2789.59]
[null,"Total Personas : ",{"$f":"COUNTA(C18:C1192)","v":1175},null,null,null,null,null,null,null,null,null,null,null,null,null,null,null,null,null,null,"Total Recursos Ejercidos:",null,null,{"$f":"SUBTOTAL(109,Tabla11[Total de recursos presupuestales ejercidos en servicios personales en el periodo\n(2)])","v":42012175.270000115}]
[]
[null,"Fuente : Información proporcionada por las Entidades Federativas."]

{"sheet":"II C y 1_","index":5,"n_rows":1196,"n_cols":22,"rows_kept":1196,"cut":false,"hidden":false,"merged":[[1190,18,1190,19],[11,6,12,6],[11,7,12,7],[11,18,11,19],[11,3,12,3],[11,4,12,4],[11,1,12,1],[11,2,12,2],[11,5,12,5],[11,20,12,20],[11,21,12,21],[11,8,12,8],[11,9,11,15],[11,16,12,16],[11,17,12,17]]}
[]
[]
[]
[]
[]
[]
[]
[null,"Formato: Personal Federalizado por Registro Federal de Contribuyentes"]
[null,{"$f":"IF('Caratula Resumen'!D22=\"Elige el Periodo…\",\"\",'Caratula Resumen'!D22)","v":"Fondo de Aportaciones para la Educación Tecnológica y de Adultos/Colegio Nacional de Educación Profesional Técnica (FAETA/CONALEP)"},null,null,null,null,null,null,null,null,null,null,null,null,null,null,null,null,null,null,"1er. Trimestre de 2017"]
[]
[]
[null,"Entidad Federativa","Clave CT","Turno","RFC","CURP","Nombre","Funcion Real","Horas que labora en el Centro de Trabajo","Clave Presupuestal",null,null,null,null,null,null,"Tipo de Categoría","Identificador de Contrato de Honorarios","Periodo de efecto de pago en el trimestre",null,"Percepciones pagadas en el Periodo de Comisión con Presupuesto Federal*","Percepciones pagadas en el Periodo de Comisión con Presupuesto de otra fuente*"]
[null,null,null,null,null,null,null,null,null,"Partida Presupuestal","Código de Pago","Clave de Unidad","Clave de Sub Unidad","Clave de Categoría","Horas Semana Mes ","Número de Plaza",null,null,"Inicial","Termino"]
[]
[null,"Entidad Federativa","Clave CT","Turno","RFC","CURP","Nombre","Funcion Real","Horas que labora en el Centro de Trabajo","Partida Presupuestal","Código de Pago","Clave de Unidad","Clave de Sub Unidad","Clave de Categoría","Horas semana mes","Número de plaza","Tipo de Categoría","Identificador de Contrato de Honorarios","Periodo de efecto de pago en el trimestre\nInicial","Periodo de efecto de pago en el trimestre\nTermino","Percepciones pagadas en el Periodo de Comisión con Presupuesto Federal*","Percepciones pagadas en el Periodo de Comisión con Presupuesto de otra fuente*"]
[null,"GUANAJUATO","11APT0001T",100,"RAMA640606EP1","RAMA640606HGTNXL06","ALBERTO RANGEL MUÑOZ",2314,"8.0",1130,1003,"00","00","ED01201","00.0","2619",2,"",20170101,20170331,49350.3]
[null,"GUANAJUATO","11APT0001T",100,"GOLA7812182KA","GOLA781218MQTMPN05","ANA GLORIA GOMEZ LOPEZ",2314,"8.0",1130,1003,"00","00","CF33204","00.0","11094",2,"",20170101,20170331,87234.580000000016]
[null,"GUANAJUATO","11APT0001T",100,"RAMD6103291R4","RAMD610329HGTMNV10","DAVID RAMIREZ MONJARAZ",2314,"8.0",1130,1003,"00","00","CF21202","00.0","1687",2,"",20170101,20170331,45826.590000000004]
[null,"GUANAJUATO","11APT0001T",100,"AAMD810413AX6","AAMD810413MGTNRN03","DIANA LORENA ANAYA MARTINEZ",2314,"8.0",1130,1003,"00","00","CF04201","00.0","11092",2,"",20170101,20170331,43193.86]
[null,"GUANAJUATO","11APT0001T",100,"ZALE620903MK9","ZALE620903HGTVND01","EDUARDO ZAVALA LEON",2314,"8.0",1130,1003,"00","00","CF33204","00.0","11089",2,"",20170101,20170331,85570.520000000019]
[null,"GUANAJUATO","11APT0001T",100,"GUJE870107661","GUJE870107MGTTRL01","ELIZABETH VERONICA GUTIERREZ JUAREZ",2314,"8.0",1130,1003,"00","00","CF33204","00.0","2546",2,"",20170101,20170331,73186.049999999988]
[null,"GUANAJUATO","11APT0001T",100,"ZAHE711130S69","ZAHE711130MDFMRR03","ERIKA DE LOS ANGELES ZAMORA HERNANDEZ",2314,"8.0",1130,1003,"00","00","CF33206","00.0","13498",2,"",20170101,20170331,122951.46000000002]
[null,"GUANAJUATO","11APT0001T",100,"PESE6410262W2","PESE641026HTSRNR02","ERNESTO PEREZ SANCHEZ",548,"8.0",1130,1003,"00","00","CF01601","00.0","11098",5,"",20170101,20170331,75710.899999999994]
[null,"GUANAJUATO","11APT0001T",100,"VARG660927MXA","VARG660927MDFLSL01","GLORIA GUADALUPE VALENZUELA RIOS",548,"8.0",1130,1003,"00","00","CF01601","00.0","11090",5,"",20170101,20170331,95806.31]
[null,"GUANAJUATO","11APT0001T",100,"EIPA861113S53","EIPA861113HGTSRB08","JOSE ABRAHAM ESPINOZA PORRAS",2314,"8.0",1130,1003,"00","00","CF34202","00.0","5581",2,"",20170101,20170331,39979.200000000004]
[null,"GUANAJUATO","11APT0001T",100,"COAJ850104JY6","COAJ850104HGTNMN00","JUAN MAURICIO CONTRERAS AMARO",2314,"8.0",1130,1003,"00","00","S01201","00.0","2653",2,"",20170101,20170331,21959.4]
[null,"GUANAJUATO","11APT0001T",100,"OERL7305255H3","OERL730525HGTJDS00","LUIS ALBERTO OJEDA RODRIGUEZ",548,"8.0",1130,1003,"00","00","CF11102","00.0","14556",5,"",20170101,20170331,121036.85]
[null,"GUANAJUATO","11APT0001T",100,"RALU580110A37","RAXL580110HGTMXS01","LUIS FERNANDO RAMOS",548,"8.0",1130,1003,"00","00","CF02105","00.0","14601",5,"",20170101,20170331,83101.77]
[null,"GUANAJUATO","11APT0001T",100,"EAVG760111871","EAVG760111MGTSLD04","MA. GUADALUPE ESPARZA VALENCIA",2314,"8.0",1130,1003,"00","00","CF33204","00.0","2605",2,"",20170101,20170331,75422.36]
[null,"GUANAJUATO","11APT0001T",100,"MABM8602122N2","MABM860212MGTRRL21","MELISSA MARISELA MARTINEZ BARRIOS",2314,"8.0",1130,1003,"00","00","S01201","00.0","2647",2,"",20170101,20170331,35619.650000000009]
[null,"GUANAJUATO","11APT0001T",100,"GONM790924B46","GONM790924HGTNVG00","MIGUEL ANGEL GONZALEZ NAVARRO",2314,"8.0",1130,1003,"00","00","CF33204","00.0","2578",2,"",20170101,20170331,86054.580000000016]
[null,"GUANAJUATO","11APT0001T",100,"MANR8209073S1","MANR820907HGTCGT04","RITO MACIAS NEGRETE",548,"8.0",1130,1003,"00","00","CF01601","00.0","11035",5,"",20170101,20170331,95806.31]
[null,"GUANAJUATO","11APT0001T",100,"ZERY820116NN8","ZERY820116MGTNCD08","YADIRA BERENICE ZENDEJAS ROCHA",2314,"8.0",1130,1003,"00","00","A01801","00.0","18846",2,"",20170101,20170331,58106.450000000012]
[null,"GUANAJUATO","11DPT0006L",100,"JUPA730712HA3","JUPA730712MGTRRN04","ANA LAURA JUAREZ PEREZ",2314,"8.0",1130,1003,"01",63,"CF18203","00.0","7703",2,"",20170101,20170331,50877.77]
[null,"GUANAJUATO","11DPT0006L",100,"AERG571209NWA","AERG571209HGTRML09","GILBERTO ARREOLA ROMERO",2314,"8.0",1130,1003,"01",63,"S01202","00.0","7707",2,"",20170101,20170331,41529.53]
[null,"GUANAJUATO","11DPT0006L",100,"EAMG8704104G8","EAMG870410MGTSRR00","GRECIA ROXANNA ESPARZA MARES",2314,"8.0",1130,1003,"01",63,"S01201","00.0","7709",2,"",20170101,20170331,36439.56]
[null,"GUANAJUATO","11DPT0006L",100,"EIMJ880812BK0","EIMJ880812MGTLRH07","JHOANA IVON ELIZALDE MARTINEZ",2314,"8.0",1130,1003,"01",63,"CF18201","00.0","7699",2,"",20170101,20170331,34823.72]
[null,"GUANAJUATO","11DPT0006L",100,"PAJJ830708SK1","PAJJ830708HQTTMR06","JORGE ADALBERTO PATIÑO JIMENEZ",2314,"8.0",1130,1003,"01",63,"CF33204","00.0","7693",2,"",20170101,20170331,58042.350000000006]
[null,"GUANAJUATO","11DPT0006L",100,"SIRO600318LE2","SIRO600318HGTRDC04","JOSE OCTAVIO SIERRA RODRIGUEZ",2314,"8.0",1130,1003,"01",63,"CF33204","00.0","7708",2,"",20170101,20170331,90198.399999999994]
[null,"GUANAJUATO","11DPT0006L",100,"LOAP6711257L7","LOAP671125HGTPGB09","JOSE PABLO LOPEZ AGUIRRE",2314,"8.0",1130,1003,"01",63,"A03202","00.0","7687",2,"",20170101,20170331,42181.899999999994]
[null,"GUANAJUATO","11DPT0006L",100,"MAFJ5906036T8","MAFJ590603HGTRRN00","JUAN MANUEL MARTINEZ FRIAS",2314,"8.0",1130,1003,"01",63,"ED01201","00.0","18886",2,"",20170101,20170331,52787.1]
[null,"GUANAJUATO","11DPT0006L",100,"MOSJ790615LD6","MOSJ790615HGTLNN00","JUAN MOLINA SANCHEZ",2314,"8.0",1130,1003,"01",63,"A03202","00.0","7688",2,"",20170101,20170331,40653.699999999997]
[null,"GUANAJUATO","11DPT0006L",100,"YEGL891123ML2","YEGL891123MGTPRR08","LAURA VERONICA YEPEZ GARCIA",2314,"8.0",1130,1003,"01",63,"S01201","00.0","7712",2,"",20170101,20170331,34383.100000000006]
[null,"GUANAJUATO","11DPT0006L",100,"AARL760126331","AARL760126HGTLMN06","LEONARDO ALVAREZ ROMO",2314,"8.0",1130,1003,"01",63,"CF04201","00.0","7691",2,"",20170101,20170331,34597.449999999997]
[null,"GUANAJUATO","11DPT0006L",100,"AARL760126331","AARL760126HGTLMN14","LEONARDO ISRAEL ALVAREZ ROMO",2314,"8.0",1130,1003,"01",63,"CF04201","00.0","7691",2,"",20170101,20170331,9326.6]
[null,"GUANAJUATO","11DPT0006L",100,"PAHM630123LJ6","PAHM630123HGTNRN05","MANUEL PANTOJA HERRERA",2314,"8.0",1130,1003,"01",63,"CF33206","00.0","13986",2,"",20170101,20170331,138423.48000000001]
[null,"GUANAJUATO","11DPT0006L",100,"SAMG651113CLA","SAMG651113MGTVDD08","MARIA GUADALUPE SAAVEDRA MEDRANO",2314,"8.0",1130,1003,"01",63,"CF34201","00.0","7700",2,"",20170101,20170331,47200.020000000004]
[null,"GUANAJUATO","11DPT0006L",100,"HEGN8708165Y4","HEGN870816MGTRRY05","NAYELI HERREJON GUERRERO",2314,"8.0",1130,1003,"01",63,"CF18201","00.0","7705",2,"",20170101,20170331,34072.080000000009]
[null,"GUANAJUATO","11DPT0006L",100,"GUFO930509HR3","GUFO930509MGTVRL06","OLIVIA GUEVARA FARFAN",2314,"8.0",1130,1003,"01",63,"S01201","00.0","7716",2,"",20170101,20170331,35869.07]
[null,"GUANAJUATO","11DPT0006L",100,"COMP630327QN2","COMP630327HGTNRB00","PABLO GERARDO CONTRERAS MARTINEZ",2314,"8.0",1130,1003,"01",63,"CF33206","00.0","13987",2,"",20170101,20170331,138938.46000000002]
[null,"GUANAJUATO","11DPT0006L",100,"CIGP680809983","CIGP680809HGTDRB07","PABLO MARTIN CID GARCIA",2314,"8.0",1130,1003,"01",63,"CF33206","00.0","13988",2,"",20170101,20170331,125369.7]
[null,"GUANAJUATO","11DPT0006L",100,"TOMP701231IUA","TOMP701231MGTRJT08","PATRICIA TORRES MEJIA",2314,"8.0",1130,1003,"01",63,"CF33203","00.0","7702",2,"",20170101,20170331,50022.500000000007]
[null,"GUANAJUATO","11DPT0006L",100,"MOSP780508DF7","MOSP780508HGTLND02","PEDRO MOLINA SANCHEZ",2314,"8.0",1130,1003,"01",63,"CF18203","00.0","7713",2,"",20170101,20170331,47531.810000000005]
[null,"GUANAJUATO","11DPT0006L",100,"MAZR720405LB8","MAZR720405HMNRTC01","RICARDO MARTINEZ ZETINA",2314,"8.0",1130,1003,"01",63,"CF33204","00.0","7693",2,"",20170101,20170331,27678.32]
[null,"GUANAJUATO","11DPT0006L",100,"NAVS621206356","NAVS621206MGTVLN00","SANDRA JUANA NAVA VELAZQUEZ",2314,"8.0",1130,1003,"01",63,"CF33204","00.0","7704",2,"",20170101,20170331,89686.399999999994]
[null,"GUANAJUATO","11DPT0006L",100,"JALS470121DUA","JALS470121HMNMPR04","SERGIO JAIMES LOPEZ",548,"8.0",1130,1003,"01",63,"CF02103","00.0","12618",5,"",20170101,20170331,97723.59]
[null,"GUANAJUATO","11DPT0006L",100,"AALS670904235","AALS670904MGTNPL09","SILVIA ANAYA LOPEZ",2314,"8.0",1130,1003,"01",63,"CF33204","00.0","7715",2,"",20170101,20170331,85384.290000000008]
[null,"GUANAJUATO","11DPT0006L",100,"QUDW870430HH4","QUDW870430MGTNMN07","WENDY YAZMIN QUINTANA DOMINGUEZ",2314,"8.0",1130,1003,"01",63,"CF21202","00.0","7721",2,"",20170101,20170331,43977.270000000004]
[null,"GUANAJUATO","11DPT0001Q",100,"LOLA870110SJ9","LOLA870110MGTPPL02","ALMA ALEJANDRA LOPEZ LOPEZ",2314,"8.0",1130,1003,"00","28","CF33204","00.0","2553",2,"",20170101,20170331,70020.31]
[null,"GUANAJUATO","11DPT0001Q",100,"LIRA890608KM8","LIRA890608MGTZZL06","ALMA ROSARIO LIZARRAGA RUIZ",2314,"8.0",1130,1003,"00","28","S01201","00.0","2556",2,"",20170101,20170331,35148.840000000004]
[null,"GUANAJUATO","11DPT0001Q",100,"TIRA931025MA1","TIRA931025MGTRMN09","ANA CECILIA TIERRABLANCA ROMERO",2314,"8.0",1130,1003,"00","28","CF18201","00.0","2535",2,"",20170101,20170331,31527.940000000002]
[null,"GUANAJUATO","11DPT0001Q",100,"RIAA790529868","RIAA790529MMNSGN11","ANA KATHERINE RIOS AGUILAR",548,"8.0",1130,1003,"00","28","CF02105","00.0","14595",5,"",20170101,20170331,83101.77]
[null,"GUANAJUATO","11DPT0001Q",100,"EICA780130NQ1","EICA780130MGTSRN03","ANA MARIA ESPINOZA CERVANTES",2314,"8.0",1130,1003,"00","28","A03202","00.0","2492",2,"",20170101,20170331,41086.43]
[null,"GUANAJUATO","11DPT0001Q",100,"MOHA6909151AA","MOHA690915MGTRRN03","ANDREA MORALES HERNANDEZ",2314,"8.0",1130,1003,"00","28","S01202","00.0","2548",2,"",20170101,20170331,37537.600000000006]
[null,"GUANAJUATO","11DPT0001Q",100,"MAGB8208194P2","MAGB820819MGTLRL08","BLANCA ELIA MALDONADO GARCIA",2314,"8.0",1130,1003,"00","28","CF33204","00.0","2524",2,"",20170101,20170331,73592.639999999999]
[null,"GUANAJUATO","11DPT0001Q",100,"OAMC600520F43","OAMC600520HSLLLR01","CARLOS JAVIER OLAVEZ MELESIO",2314,"8.0",1130,1003,"00","28","CF19201","00.0","2543",2,"",20170101,20170331,52104.12]
[null,"GUANAJUATO","11DPT0001Q",100,"ZALC5604237Q2","ZALC560423HGTVPR01","CARLOS ZAVALA LOPEZ",2314,"8.0",1130,1003,"00","28","A03202","00.0","2497",2,"",20170101,20170331,45415.6]
[null,"GUANAJUATO","11DPT0001Q",100,"GALE770303QD2","GALE770303HGTRSD04","EDUARDO GARCIA LESSO",2314,"8.0",1130,1003,"00","28","CF33204","00.0","2545",2,"",20170101,20170331,67212.770000000019]
[null,"GUANAJUATO","11DPT0001Q",100,"RERE8505068T2","RERE850506HMNYMD04","EDUARDO REYES RAMIREZ",2314,"8.0",1130,1003,"00","28","S01202","00.0","2508",2,"",20170101,20170331,35414.78]
[null,"GUANAJUATO","11DPT0001Q",100,"QUGE620101NK4","QUGE620101HGTNRF01","EFRAIN QUINTANA GARCIA",2314,"8.0",1130,1003,"00","28","S01202","00.0","2552",2,"",20170101,20170331,37659.620000000003]
[null,"GUANAJUATO","11DPT0001Q",100,"NIHE721201VC3","NIHE721201HGTTRS04","EUSEBIO MIGUEL ANGEL NIETO HERNANDEZ",2314,"8.0",1130,1003,"00","28","S01202","00.0","2541",2,"",20170101,20170331,37252.250000000007]
[null,"GUANAJUATO","11DPT0001Q",100,"AATE760606N24","AATE760606MGTLNV03","EVA ALMANZA TINOCO",2314,"8.0",1130,1003,"00","28","S01202","00.0","9252",2,"",20170101,20170331,42937.74]
[null,"GUANAJUATO","11DPT0001Q",100,"TOCF910415931","TOCF910415MGTRRT00","FATIMA DEL ROSARIO TORRES CERVANTES",2314,"8.0",1130,1003,"00","28","S01201","00.0","2558",2,"",20170101,20170331,39545.270000000004]
[null,"GUANAJUATO","11DPT0001Q",100,"GOMG8812289D6","GOMG881228HQTMLB01","GABRIEL GOMEZ MOLINERO",2314,"8.0",1130,1003,"00","28","CF33204","00.0","2530",2,"",20170101,20170331,67212.770000000019]
[null,"GUANAJUATO","11DPT0001Q",100,"RAAG5908278S6","RAAG590827HMNNBL08","GUILLERMO RANGEL ABURTO",2314,"8.0",1130,1003,"00","28","CF18203","00.0","4397",2,"",20170101,20170331,60602.340000000004]
[null,"GUANAJUATO","11DPT0001Q",100,"GAOH8102061G0","GAOH810206HDFLLM04","HUMBERTO ISRAEL GALVAN OLVERA",2314,"8.0",1130,1003,"00","28","S01202","00.0","2520",2,"",20170101,20170331,38595.08]
[null,"GUANAJUATO","11DPT0001Q",100,"JAMJ591122Q73","JAMJ591122HGTRNV07","JAVIER JARALEÑO MANCERA",2314,"8.0",1130,1003,"00","28","A03202","00.0","9832",2,"",20170101,20170331,45577.98]
[null,"GUANAJUATO","11DPT0001Q",100,"BEEJ790327230","BEEJ790327HGTLSN06","JUAN GUSTAVO BELMAN ESPINOSA",2314,"8.0",1130,1003,"00","28","S01202","00.0","2512",2,"",20170101,20170331,38034.550000000003]
[null,"GUANAJUATO","11DPT0001Q",100,"GIAJ670517N7A","GIAJ670517HGTRLN07","JUAN MANUEL GRIMALDO ALFARO",2314,"8.0",1130,1003,"00","28","CF34201","00.0","10177",2,"",20170101,20170331,52063.920000000006]
[null,"GUANAJUATO","11DPT0001Q",100,"ROEJ700824751","ROEJ700824HVZMSL05","JULIO CESAR ROMERO ESCOBAR",2314,"8.0",1130,1003,"00","28","S01201","00.0","2506",2,"",20170101,20170331,34910.080000000009]
[null,"GUANAJUATO","11DPT0001Q",100,"GOGK890902JT3","GOGK890902MGTNLR04","KARLA RAFAELA GONZALEZ GALLARDO",2314,"8.0",1130,1003,"00","28","CF33204","00.0","2526",2,"",20170101,20170331,79421.709999999992]
[null,"GUANAJUATO","11DPT0001Q",100,"MAGC661126AJ5","MAGC661126MGTLNR18","MA. CARMEN MALDONADO GONZALEZ",2314,"8.0",1130,1003,"00","28","CF33206","00.0","12910",2,"",20170101,20170331,123130.63]
[null,"GUANAJUATO","11DPT0001Q",100,"HEMM6706104M9","HEMM670610MGTRNR09","MA. MERCEDES HERRERA MANCERA",2314,"8.0",1130,1003,"00","28","CF33206","00.0","12912",2,"",20170101,20170331,132605.65]
[null,"GUANAJUATO","11DPT0001Q",100,"NUBS660923RQA","NUBS660923MGTXRL07","MA. SILVIA NUÑEZ BARRERA",2314,"8.0",1130,1003,"00","28","CF21202","00.0","2547",2,"",20170101,20170331,52006.7]
[null,"GUANAJUATO","11DPT0001Q",100,"SAGM730131V93","SAGM730131MDFNRR07","MARCELA SANCHEZ GARCIA",2314,"8.0",1130,1003,"00","28","CF33206","00.0","12914",2,"",20170101,20170331,103001.35]
[null,"GUANAJUATO","11DPT0001Q",100,"TEHM7408294G1","TEHM740829HGTLRR02","MARCO ANTONIO TELLEZ HERRERA",2314,"8.0",1130,1003,"00","28","S01201","00.0","2501",2,"",20170101,20170331,32136.820000000003]
[null,"GUANAJUATO","11DPT0001Q",100,"FABC530210FR5","FABC530210MDFRRR00","MARIA DEL CARMEN FRANCO BOURET",2314,"8.0",1130,1003,"00","28","CF33202","00.0","2551",2,"",20170101,20170331,47559.22]
[null,"GUANAJUATO","11DPT0001Q",100,"SARR700714SU4","SARR700714MGTCMS06","MARIA DEL ROSARIO SAUCILLO RAMIREZ",2314,"8.0",1130,1003,"00","28","CF33204","00.0","2540",2,"",20170101,20170331,75030.289999999994]
[null,"GUANAJUATO","11DPT0001Q",100,"MUSF920131FC2","MUSF920131MGTXCR06","MARIA FERNANDA MUÑOZ SAUCILLO",2314,"8.0",1130,1003,"00","28","S01202","00.0","2534",2,"",20170101,20170331,35624.25]
[null,"GUANAJUATO","11DPT0001Q",100,"CARM520206UK0","CARM520206HGTBCR09","MARIO CABRERA RICO",548,"8.0",1130,1003,"00","28","CF02103","00.0","12566",5,"",20170101,20170331,97723.59]
[null,"GUANAJUATO","11DPT0001Q",100,"GAMM680220L32","GAMM680220MGTLRR01","MARTHA NORMA GALLEGOS MARISCAL",2314,"8.0",1130,1003,"00","28","ED01201","00.0","2509",2,"",20170101,20170331,51219.42]
[null,"GUANAJUATO","11DPT0001Q",100,"VAAM631105TU4","VAAM631105HGTLYR06","MARTIN VALENTE AYALA",2314,"8.0",1130,1003,"00","28","CF19201","00.0","2496",2,"",20170101,20170331,50844.87000000001]
[null,"GUANAJUATO","11DPT0001Q",100,"BACM8402274W0","BACM840227HGTRNG03","MIGUEL ANGEL BARRON CONEJO",2314,"8.0",1130,1003,"00","28","CF33206","00.0","12911",2,"",20170101,20170331,102396.77999999998]
[null,"GUANAJUATO","11DPT0001Q",100,"JOOM700802BM5","JOOM700802HGTYRG06","MIGUEL ANGEL JOYA ORTIZ",2314,"8.0",1130,1003,"00","28","CF33206","00.0","12916",2,"",20170101,20170331,126491.48000000001]
[null,"GUANAJUATO","11DPT0001Q",100,"AUDM660425P52","AUDM660425MGTGRR18","MIRIAM AGUILAR DURON",2314,"8.0",1130,1003,"00","28","CF33206","00.0","12913",2,"",20170101,20170331,133678.15]
[null,"GUANAJUATO","11DPT0001Q",100,"VEMM8610222D9","VEMM861022MGTRNR00","MIRIAM SOLEDAD VERA MENDIETA",2314,"8.0",1130,1003,"00","28","CF18201","00.0","2515",2,"",20170101,20170331,33871.880000000005]
[null,"GUANAJUATO","11DPT0001Q",100,"MEMM740704297","MEMM740704MDFDRR03","MIRNA MEDINA MARIN",2314,"8.0",1130,1003,"00","28","S01202","00.0","2542",2,"",20170101,20170331,40426.839999999997]
[null,"GUANAJUATO","11DPT0001Q",100,"MELN680719F21","MELN680719MGTLDR00","NORMA LETICIA MELGOZA LEDESMA",2314,"8.0",1130,1003,"00","28","CF34201","00.0","2504",2,"",20170101,20170331,51537.66]
[null,"GUANAJUATO","11DPT0001Q",100,"RURO710818A13","RURO710818MGTZFL04","OLGA AMALIA RUIZ RUFINO",2314,"8.0",1130,1003,"00","28","CF33202","00.0","2517",2,"",20170101,20170331,65608.75]
[null,"GUANAJUATO","11DPT0001Q",100,"MIAO8312189C2","MIAO831218HDFLPM04","OMAR MILLAN APUD",2314,"8.0",1130,1003,"00","28","CF33204","00.0","2519",2,"",20170101,20170331,69344.3]
[null,"GUANAJUATO","11DPT0001Q",100,"PIOP550618BT2","PIOP550618HGTCLB08","PABLO PICHARDO OLVERA",2314,"8.0",1130,1003,"00","28","A03202","00.0","2494",2,"",20170101,20170331,61578.41]
[null,"GUANAJUATO","11DPT0001Q",100,"GAAR6310249B2","GAAR631024HGTLRF01","RAFAEL GALLEGOS ARELLANO",2314,"8.0",1130,1003,"00","28","ED01201","00.0","2511",2,"",20170101,20170331,59264.160000000003]
[null,"GUANAJUATO","11DPT0001Q",100,"ROPR4911033YA","ROPR491103HGTDTF04","RAFAEL RODRIGUEZ PATIÑO",2314,"8.0",1130,1003,"00","28","S01202","00.0","2539",2,"",20170101,20170331,40833.58]
[null,"GUANAJUATO","11DPT0001Q",100,"ROMR681004UF2","ROMR681004HGTDRM02","RAMIRO RODRIGUEZ MARTINEZ",2314,"8.0",1130,1003,"00","28","CF18203","00.0","2507",2,"",20170101,20170331,58778.140000000007]
[null,"GUANAJUATO","11DPT0001Q",100,"BAUR7105213K8","BAUR710521MDFRRT02","RITA BARCENAS URBINA",2314,"8.0",1130,1003,"00","28","A03202","00.0","2495",2,"",20170101,20170331,59123.090000000011]
[null,"GUANAJUATO","11DPT0001Q",100,"VEGR631014AK5","VEGR631014HGTLRB01","RUBEN VELAZQUEZ GARCIA",2314,"8.0",1130,1003,"00","28","S01202","00.0","2527",2,"",20170101,20170331,43587.97]
[null,"GUANAJUATO","11DPT0001Q",100,"ROHR681221N53","ROHR681221MGTJRB00","RUBISELA ROJAS HUARACHA",2314,"8.0",1130,1003,"00","28","CF33204","00.0","10599",2,"",20170101,20170331,88339.4]
[null,"GUANAJUATO","11DPT0001Q",100,"TOSS530312KL6","TOSS530312HDFRMM05","SAMUEL TORRES SUMOZA",2314,"8.0",1130,1003,"00","28","S01202","00.0","2555",2,"",20170101,20170331,36549.5]
[null,"GUANAJUATO","11DPT0001Q",100,"PACS810122DT6","PACS810122MGTLRR02","SARA PALOMINO CARREÑO",2314,"8.0",1130,1003,"00","28","S01202","00.0","2525",2,"",20170101,20170331,33266.339999999997]
[null,"GUANAJUATO","11DPT0001Q",100,"CEFS680324L40","CEFS680324HJCRLL06","SAUL CERPA FLORES",2314,"8.0",1130,1003,"00","28","S01202","00.0","2544",2,"",20170101,20170331,38528.43]
[null,"GUANAJUATO","11DPT0001Q",100,"CAGT7903078F3","CAGT790307HGTMRM01","TOMAS ESTEBAN CAMACHO GARCIA",2314,"8.0",1130,1003,"00","28","S01201","00.0","2533",2,"",20170101,20170331,31846.530000000002]
[null,"GUANAJUATO","11DPT0001Q",100,"ROBY7612249Q3","ROBY761224MMCDCN00","YUNUEN RODRIGUEZ BECERRA",2314,"8.0",1130,1003,"00","28","CF34202","00.0","2537",2,"",20170101,20170331,42833.740000000005]
[null,"GUANAJUATO","11DPT0008J",100,"ROZA560516SE3","ROZA560516HGTJPB08","ABEL ROJAS ZAPATERO",2314,"8.0",1130,1003,"02","33","CF33203","00.0","10178",2,"",20170101,20170331,65429.920000000006]
[null,"GUANAJUATO","11DPT0008J",100,"RACA8011159T0","RACA801115MGTMRD05","ADELA RAMIREZ CERRITOS",2314,"8.0",1130,1003,"02","33","S01202","00.0","10174",2,"",20170101,20170331,38025.68]
[null,"GUANAJUATO","11DPT0008J",100,"COVA700831PW6","COVA700831MGRNRM03","AMADA CONDE VERA",2314,"8.0",1130,1003,"02","33","T08201","00.0","760",2,"",20170101,20170331,60933.820000000014]
[null,"GUANAJUATO","11DPT0008J",100,"SABA620417HF9","SABA620417HVZNTN05","ANICETO SANTIAGO BAUTISTA",2314,"8.0",1130,1003,"02","33","CF33206","00.0","13504",2,"",20170101,20170331,137419.64000000001]
[null,"GUANAJUATO","11DPT0008J",100,"ROVA500401GUA","ROVA500401HGTJLR05","ARTURO ROJAS VALENCIA",2314,"8.0",1130,1003,"02","33","S01202","00.0","8084",2,"",20170101,20170331,43545.020000000004]
[null,"GUANAJUATO","11DPT0008J",100,"LAVD841123J58","LAVD841123HGTGRN02","DANIEL LAGUNA VARGAS",2314,"8.0",1130,1003,"02","33","S01201","00.0","10179",2,"",20170101,20170331,33069.880000000005]
[null,"GUANAJUATO","11DPT0008J",100,"RASE540830U28","RASE540830HGTYLL02","ELEAZAR RAYAS SILVA",2314,"8.0",1130,1003,"02","33","CF18203","00.0","10187",2,"",20170101,20170331,52205.210000000006]
[null,"GUANAJUATO","11DPT0008J",100,"JACF700609GI1","JACF700609HGTRML07","FELIPE JARAMILLO CAMPOS",2314,"8.0",1130,1003,"02","33","S01202","00.0","10195",2,"",20170101,20170331,36502.080000000002]
[null,"GUANAJUATO","11DPT0008J",100,"COVF720114623","COVF720114HGTNRR02","FRANCISCO JAVIER CONDE VERA",2314,"8.0",1130,1003,"02","33","S01201","00.0","10181",2,"",20170101,20170331,34521.310000000005]
[null,"GUANAJUATO","11DPT0008J",100,"RAFG691106392","RAFG691106HGTMRR04","GERARDO RAMIREZ FERNANDEZ",548,"8.0",1130,1003,"02","33","CF02104","00.0","12749",5,"",20170101,20170331,95731.82]
[null,"GUANAJUATO","11DPT0008J",100,"CUMG550523TM9","CUMG550523MDFRRL06","GLORIA ARACELI CRUZ MARTIN DEL CAMPO",548,"8.0",1130,1003,"02","33","CF02105","00.0","14600",5,"",20170101,20170331,26272.400000000001]
[null,"GUANAJUATO","11DPT0008J",100,"GOCH8410237R3","GOCH841023HGTNBC04","HECTOR HUGO GONZALEZ CABRERA",2314,"8.0",1130,1003,"02","33","CF18201","00.0","10175",2,"",20170101,20170331,34558.000000000007]
[null,"GUANAJUATO","11DPT0008J",100,"ROHH851230UU9","ROHH851230HGTJRR04","HERNAN ROJAS HERNANDEZ",2314,"8.0",1130,1003,"02","33","S01201","00.0","2532",2,"",20170101,20170331,34249.880000000005]
[null,"GUANAJUATO","11DPT0008J",100,"MOFD480314HT2","MOFD480314HGTRLL00","JOSE DOLORES MORALES FLORES",2314,"8.0",1130,1003,"02","33","S01202","00.0","10194",2,"",20170101,20170331,45326.239999999998]
[null,"GUANAJUATO","11DPT0008J",100,"ROGJ7905253Y5","ROGJ790525HPLJDN05","JOSE JUAN ROJAS GODOY",2314,"8.0",1130,1003,"02","33","CF33206","00.0","13502",2,"",20170101,20170331,123072.39000000001]
[null,"GUANAJUATO","11DPT0008J",100,"RASJ781020U88","RASJ781020MGTZSS02","JOSEFINA RAZO SOSA",2314,"8.0",1130,1003,"02","33","CF33206","00.0","14312",2,"",20170101,20170331,88029.39]
[null,"GUANAJUATO","11DPT0008J",100,"BARJ8305267S1","BARJ830526HGTRYN02","JUAN ANGEL BRAVO REYES",2314,"8.0",1130,1003,"02","33","CF33206","00.0","13503",2,"",20170101,20170331,64647.68]
[null,"GUANAJUATO","11DPT0008J",100,"FOJU6701074Z1","FOXJ670107HGTLXN09","JUAN ANTONIO FLORES",2314,"8.0",1130,1003,"02","33","CF33204","00.0","10193",2,"",20170101,20170331,85834.46]
[null,"GUANAJUATO","11DPT0008J",100,"MELJ7904219Z8","MELJ790421HGTLDN03","JUAN MAURICIO MELGOZA LEDESMA",2314,"8.0",1130,1003,"02","33","CF19201","00.0","10190",2,"",20170101,20170331,42880.78]
[null,"GUANAJUATO","11DPT0008J",100,"OETL661122IZ6","OETL661122MGTRRZ06","LUZ CECILIA ORTEGA TORRES",2314,"8.0",1130,1003,"02","33","CF04201","00.0","2491",2,"",20170101,20170331,70533.78]
[null,"GUANAJUATO","11DPT0008J",100,"AAOL550422TB5","AAOL550422MGTRRZ00","LUZ VERONICA ARANDA OROZCO",548,"8.0",1130,1003,"02","33","CF02105","00.0","14600",5,"",20170101,20170331,34906.930000000008]
[null,"GUANAJUATO","11DPT0008J",100,"AEAC630530Q21","AEAC630530MGTLLN08","MA. CONCEPCION ALEJOS ALONSO",2314,"8.0",1130,1003,"02","33","CF33204","00.0","10196",2,"",20170101,20170331,85151.889999999985]
[null,"GUANAJUATO","11DPT0008J",100,"LAVA8108019Q9","LAVA810801MGTGRN09","MARIA DE LOS ANGELES LAGUNA VARGAS",2314,"8.0",1130,1003,"02","33","CF33206","00.0","14313",2,"",20170101,20170331,123156.93000000002]
[null,"GUANAJUATO","11DPT0008J",100,"ROCS8704055G4","ROCS870405MMCDSL06","MARIA DEL SOL RODRIGUEZ CASTRO",2314,"8.0",1130,1003,"02","33","CF33204","00.0","10188",2,"",20170101,20170331,73879.87999999999]
[null,"GUANAJUATO","11DPT0008J",100,"PACM941015U40","PACM941015MGTLRR06","MARIANA PALOMINO CARREÑO",2314,"8.0",1130,1003,"02","33","S01201","00.0","10189",2,"",20170101,20170331,34059.430000000008]
[null,"GUANAJUATO","11DPT0008J",100,"VIVM841025NR4","VIVM841025MGTLRL07","MELINA VILLARREAL VARGAS",2314,"8.0",1130,1003,"02","33","CF33206","00.0","13505",2,"",20170101,20170331,100832.71]
[null,"GUANAJUATO","11DPT0008J",100,"CAAO740517PC6","CAAO740517HGTMRC05","OCTAVIANO CAMPOS ARRIAGA",2314,"8.0",1130,1003,"02","33","CF33204","00.0","2522",2,"",20170101,20170331,84832.46]
[null,"GUANAJUATO","11DPT0008J",100,"BAJR800429CA7","BAJR800429MGTLRC00","ROCIO BALDERAS JUAREZ",2314,"8.0",1130,1003,"02","33","T08201","00.0","770",2,"",20170101,20170331,46155.570000000007]
[null,"GUANAJUATO","11DPT0008J",100,"GUTR690427DSA","GUTR690427MDFPRC02","ROCIO GUAPO TORRECILLAS",2314,"8.0",1130,1003,"02","33","T08201","00.0","514",2,"",20170101,20170331,50360.260000000009]
[null,"GUANAJUATO","11DPT0008J",100,"SALS651213I40","SALS651213MGTNNN03","SANJUANA SANCHEZ LUNA",2314,"8.0",1130,1003,"02","33","CF04201","00.0","10172",2,"",20170101,20170331,53388.33]
[null,"GUANAJUATO","11DPT0008J",100,"NUCS580811UI9","NUCS580811MGTXRS04","SUSANA NUÑEZ CERRITOS",2314,"8.0",1130,1003,"02","33","A03202","00.0","5548",2,"",20170101,20170331,47282.909999999996]
[null,"GUANAJUATO","11DPT0008J",100,"EICT8203073V8","EICT820307HGTSRM05","TOMAS ROGELIO ESPINOZA CERVANTES",2314,"8.0",1130,1003,"02","33","ED01201","00.0","4430",2,"",20170101,20170331,45027.64]
[null,"GUANAJUATO","11DPT0008J",100,"GAFV6609298F9","GAFV660929MGTRRR06","VERONICA ROCIO GRANADOS FRIAS",2314,"8.0",1130,1003,"02","33","CF21202","00.0","10176",2,"",20170101,20170331,47238.2]
[null,"GUANAJUATO","11DPT0002P",100,"ROSA621019UW4","ROSA621019HGTDNG01","AGAPITO RODRIGUEZ SANCHEZ",2314,"8.0",1130,1003,"00","29","CF19201","00.0","2583",2,"",20170101,20170331,50206.020000000004]
[null,"GUANAJUATO","11DPT0002P",100,"SARA881017KA5","SARA881017HGTNXL07","ALBERTO ALEXANDRO SANTILLAN REA",2314,"8.0",1130,1003,"00","29","S01201","00.0","2590",2,"",20170101,20170331,33909.64]
[null,"GUANAJUATO","11DPT0002P",100,"CAGX680903LH5","CXGA680903HGTHNL08","ALBERTO CHAO GONZALEZ",548,"8.0",1130,1003,"00","29","CF02103","00.0","12628",5,"",20170101,20170331,97723.59]
[null,"GUANAJUATO","11DPT0002P",100,"GUAA600320L51","GUAA600320MGTTLL03","ALEJANDRA GUTIERREZ ALVAREZ",2314,"8.0",1130,1003,"00","29","CF21202","00.0","2588",2,"",20170101,20170331,46338.22]
[null,"GUANAJUATO","11DPT0002P",100,"COCA760915JU4","COCA760915HGTRLL02","ALEJANDRO CORIA CALDERON",2314,"8.0",1130,1003,"00","29","S01202","00.0","2593",2,"",20170101,20170331,36927.5]
[null,"GUANAJUATO","11DPT0002P",100,"DONA780620F80","DONA780620HGTMTL04","ALEJANDRO DOMINGUEZ NIETO",2314,"8.0",1130,1003,"00","29","S01201","00.0","2635",2,"",20170101,20170331,33069.880000000005]
[null,"GUANAJUATO","11DPT0002P",100,"VAEA7904041V2","VAEA790404HGTLLL05","ALEJANDRO VALADEZ ELIAS",2314,"8.0",1130,1003,"00","29","S01202","00.0","2582",2,"",20170101,20170331,35573.42]
[null,"GUANAJUATO","11DPT0002P",100,"ROBA710226BG0","RXBA710226MGTBRL07","ALMA ROBLES BRAVO",2314,"8.0",1130,1003,"00","29","CF34201","00.0","2587",2,"",20170101,20170331,45579.540000000008]
[null,"GUANAJUATO","11DPT0002P",100,"CUHC5501119F9","CUHC550111HGTLNS08","CESAR CUELLAR HINOJOSA",2314,"8.0",1130,1003,"00","29","A03202","00.0","2565",2,"",20170101,20170331,48366.33]
[null,"GUANAJUATO","11DPT0002P",100,"BERC880813NK7","BERC880813MGTLMN05","CINDIA ELIZABETH BELTRAN RAMOS",2314,"8.0",1130,1003,"00","29","CF33202","00.0","2592",2,"",20170101,20170331,49125.479999999996]
[null,"GUANAJUATO","11DPT0002P",100,"HEGC870427C96","HEGC870427HCSRNR00","CRISTOBAL DE JESUS HERNANDEZ GONZALEZ",2314,"8.0",1130,1003,"00","29","S01201","00.0","2567",2,"",20170101,20170331,33069.880000000005]
[null,"GUANAJUATO","11DPT0002P",100,"MOFD741006FM4","MOFD741006HGTSLV05","DAVID MOSQUEDA FLORES",2314,"8.0",1130,1003,"00","29","CF18203","00.0","11914",2,"",20170101,20170331,44348.71]
[null,"GUANAJUATO","11DPT0002P",100,"MEAE910606I30","MEAE910606HGTJGD01","EDGAR EMMANUEL MEJIA AGUILA",2314,"8.0",1130,1003,"00","29","S01201","00.0","2574",2,"",20170101,20170331,34189.56]
[null,"GUANAJUATO","11DPT0002P",100,"CIEE710907TK8","CIEE710907HDFSSD04","EDUARDO ALEJANDRO CISNEROS ESPINOZA",2314,"8.0",1130,1003,"00","29","S01201","00.0","2607",2,"",20170101,20170331,33069.880000000005]
[null,"GUANAJUATO","11DPT0002P",100,"JUHF791105831","JUHF791105HDFRLR06","FERNANDO JUAREZ HELGUERA",2314,"8.0",1130,1003,"00","29","S01201","00.0","2579",2,"",20170101,20170331,33277.230000000003]
[null,"GUANAJUATO","11DPT0002P",100,"GATG451128UX1","GATG451128HDFYRS05","GUSTAVO GAYTAN TORRES",2314,"8.0",1130,1003,"00","29","CF33206","00.0","13248",2,"",20170101,20170331,102396.77999999998]
[null,"GUANAJUATO","11DPT0002P",100,"MABH800524BY7","MABH800524HMNRRG02","HUGO MARTINEZ BARRERA",2314,"8.0",1130,1003,"00","29","CF33206","00.0","13247",2,"",20170101,20170331,102396.77999999998]
[null,"GUANAJUATO","11DPT0002P",100,"CASI750121969","CASI750121HGTSNS13","ISAAC CASTRO SANTILLANES",2314,"8.0",1130,1003,"00","29","CF18203","00.0","2576",2,"",20170101,20170331,47220.119999999995]
[null,"GUANAJUATO","11DPT0002P",100,"VEGJ461124SB6","VEGG461124HGTLLD01","J. GUADALUPE VELAZQUEZ GALLARDO",2314,"8.0",1130,1003,"00","29","A03202","00.0","2564",2,"",20170101,20170331,47960.38]
[null,"GUANAJUATO","11DPT0002P",100,"SASJ650121CF2","SAST650121HGTNMR00","J. TRINIDAD SANCHEZ SAMANO",2314,"8.0",1130,1003,"00","29","CF33204","00.0","9176",2,"",20170101,20170331,77339.209999999992]
[null,"GUANAJUATO","11DPT0002P",100,"MADJ760413GFA","MADJ760413HGTTZQ01","JOAQUIN MATA DIAZ",2314,"8.0",1130,1003,"00","29","A03202","00.0","2563",2,"",20170101,20170331,45334.409999999996]
[null,"GUANAJUATO","11DPT0002P",100,"LAMA800707D83","LAMA800707HGTRRL05","JOSE ALEJANDRO LARA MERCADO",2314,"8.0",1130,1003,"00","29","S01202","00.0","2570",2,"",20170101,20170331,37281.620000000003]
[null,"GUANAJUATO","11DPT0002P",100,"DEJA790116DM3","DEJA790116HMCLMN00","JOSE ANTONIO DELGADO JIMENEZ",2314,"8.0",1130,1003,"00","29","CF33206","00.0","13544",2,"",20170101,20170331,122951.46000000002]
[null,"GUANAJUATO","11DPT0002P",100,"SAVJ890118LK2","SAVJ890118HGTNZS05","JOSE DE JESUS SANCHEZ VAZQUEZ",2314,"8.0",1130,1003,"00","29","CF34202","00.0","2600",2,"",20170101,20170331,38198.410000000003]
[null,"GUANAJUATO","11DPT0002P",100,"MADM900319GN9","MADM900319HGTTZN05","JOSE MANUEL MATA DIAZ",2314,"8.0",1130,1003,"00","29","S01201","00.0","2594",2,"",20170101,20170331,33069.880000000005]
[null,"GUANAJUATO","11DPT0002P",100,"GAHJ561230M55","GAHJ561230HGTRRN04","JUAN GRANADOS HERNANDEZ",2314,"8.0",1130,1003,"00","29","CF33206","00.0","13249",2,"",20170101,20170331,121742.39999999999]
[null,"GUANAJUATO","11DPT0002P",100,"MEVJ760816A58","MEVJ760816HGTJLL19","JULIO ENRIQUE MEJIA VILLANUEVA",2314,"8.0",1130,1003,"00","29","CF33206","00.0","13252",2,"",20170101,20170331,126657.16]
[null,"GUANAJUATO","11DPT0002P",100,"RAHL900721A16","RAHL900721MGTNRL09","LILIANA BERENICE RANGEL HERNANDEZ",2314,"8.0",1130,1003,"00","29","S01201","00.0","11702",2,"",20170101,20170331,31222.110000000004]
[null,"GUANAJUATO","11DPT0002P",100,"SAHL6309234X5","SAHL630923HGTNRS00","LUIS MIGUEL SANCHEZ HERNANDEZ",2314,"8.0",1130,1003,"00","29","CF33204","00.0","2603",2,"",20170101,20170331,94034.34]
[null,"GUANAJUATO","11DPT0002P",100,"SALM811102IP0","SALG811102MGTNGD00","MA. GUADALUPE SANCHEZ LAGUNA",2314,"8.0",1130,1003,"00","29","CF33204","00.0","2599",2,"",20170101,20170331,67212.770000000019]
[null,"GUANAJUATO","11DPT0002P",100,"SAHI6701211M4","SAHI670121MGTNRN07","MA. INES SANDOVAL HERNANDEZ",2314,"8.0",1130,1003,"00","29","CF04201","00.0","2561",2,"",20170101,20170331,80145.75]
[null,"GUANAJUATO","11DPT0002P",100,"CAVM730609CSA","CAVT730609MGTRRR04","MA. TERESA CARPIO VARGAS",2314,"8.0",1130,1003,"00","29","ED01201","00.0","2571",2,"",20170101,20170331,50110.590000000004]
[null,"GUANAJUATO","11DPT0002P",100,"MACP790228577","MACP790228MGTRSL06","MARIA DEL PILAR MARTINEZ CASTRO",2314,"8.0",1130,1003,"00","29","S01202","00.0","2604",2,"",20170101,20170331,35878.46]
[null,"GUANAJUATO","11DPT0002P",100,"GOGF910421775","GOGF910421MGTNLR03","MARIA FERNANDA GONZALEZ GALLARDO",2314,"8.0",1130,1003,"00","29","S01201","00.0","2585",2,"",20170101,20170331,34558.000000000007]
[null,"GUANAJUATO","11DPT0002P",100,"EIPM591011QG5","EIPM591011MGTSRR09","MARTHA ALICIA ESPINOSA PEREZ",2314,"8.0",1130,1003,"00","29","CF33206","00.0","13246",2,"",20170101,20170331,118347.80000000002]
[null,"GUANAJUATO","11DPT0002P",100,"GOGM920808LU4","GOGM920808MGTNNR00","MARTHA ELENA GONZALEZ GONZALEZ",2314,"8.0",1130,1003,"00","29","CF18201","00.0","2573",2,"",20170101,20170331,10979.7]
[null,"GUANAJUATO","11DPT0002P",100,"DEHM860518J96","DEHM860518HMCLRG02","MIGUEL ANGEL DELGADO HERNANDEZ",2314,"8.0",1130,1003,"00","29","CF34202","00.0","305",2,"",20170101,20170331,38856.69]
[null,"GUANAJUATO","11DPT0002P",100,"GULM790929U80","GULM790929HGTRGG04","MIGUEL ANGEL GUERRERO LAGUNA",2314,"8.0",1130,1003,"00","29","ED01201","00.0","2602",2,"",20170101,20170331,44135.29]
[null,"GUANAJUATO","11DPT0002P",100,"PALM711130LV9","PALM711130HGTRGG02","MIGUEL ANGEL PARAMO LAGUNA",2314,"8.0",1130,1003,"00","29","CF34201","00.0","2596",2,"",20170101,20170331,45843.9]
[null,"GUANAJUATO","11DPT0002P",100,"LOBM750809KY1","LOBM750809HGTPRG01","MIGUEL LOPEZ BARRAGAN",2314,"8.0",1130,1003,"00","29","S01202","00.0","2597",2,"",20170101,20170331,37410.39]
[null,"GUANAJUATO","11DPT0002P",100,"SACM851223UV7","SACM851223MDFNSN01","MONSERRAT SANCHEZ CISNEROS",2314,"8.0",1130,1003,"00","29","S01201","00.0","2601",2,"",20170101,20170331,33423.090000000004]
[null,"GUANAJUATO","11DPT0002P",100,"AARM7802157H4","AARM780215MGTLDY03","MYRIAM DEL ROSARIO ALVARADO RODRIGUEZ",2314,"8.0",1130,1003,"00","29","S01201","00.0","11909",2,"",20170101,20170331,32691.880000000005]
[null,"GUANAJUATO","11DPT0002P",100,"CAPR810416EKA","CAPR810416HGTLRB07","ROBERTO CALDERON PEREZ",2314,"8.0",1130,1003,"00","29","CF33204","00.0","2560",2,"",20170101,20170331,73552.81]
[null,"GUANAJUATO","11DPT0002P",100,"SAGS78112652A","SAGS781126HGTLTS16","SASHA EMMANUEL SALINAS GUTIERREZ",2314,"8.0",1130,1003,"00","29","S01202","00.0","2568",2,"",20170101,20170331,38207.410000000003]
[null,"GUANAJUATO","11DPT0002P",100,"CUVY830805JA3","CUVY830805MGTSRH00","YAHAIRA ALICIA ELENA CUESTAS VARGAS",2314,"8.0",1130,1003,"00","29","S01201","00.0","2595",2,"",20170101,20170331,32603.350000000006]
[null,"GUANAJUATO","11DPT0002P",100,"MOFY680125UV7","MOFY680125MGTSLL00","YOLANDA MOSQUEDA FLORES",2314,"8.0",1130,1003,"00","29","T08201","00.0","690",2,"",20170101,20170331,49557.880000000005]
[null,"GUANAJUATO","11DPT0002P",100,"RODY660703MQ8","RODY660703MGTXLL07","YOLANDA ROA DELGADO",2314,"8.0",1130,1003,"00","29","CF33204","00.0","2598",2,"",20170101,20170331,86424.959999999992]
[null,"GUANAJUATO","11DPT0003O",100,"PAPA810618AR6","PAPA810618HGTLLB03","ABRAHAM PALACIOS PALACIOS",2314,"8.0",1130,1003,"00","30","S01202","00.0","2637",2,"",20170101,20170331,35708.979999999996]
[null,"GUANAJUATO","11DPT0003O",100,"CALA611023U79","CALA611023MZSRZD15","ADRIANA CARDENAS LOZA",2314,"8.0",1130,1003,"00","30","CF33206","00.0","14317",2,"",20170101,20170331,121742.39999999999]
[null,"GUANAJUATO","11DPT0003O",100,"FOSA610902SG9","FOSA610902MGTLNL09","ALEJANDRA PATRICIA FLORES SANDOVAL",2314,"8.0",1130,1003,"00","30","CF33204","00.0","2611",2,"",20170101,20170331,89196.46]
[null,"GUANAJUATO","11DPT0003O",100,"NIRA700123GK9","NIRA700123MGTTVN01","ANA LAURA NIETO RIVERA",2314,"8.0",1130,1003,"00","30","CF33206","00.0","14316",2,"",20170101,20170331,131213.70000000001]
[null,"GUANAJUATO","11DPT0003O",100,"HEHA900701U81","HEHA900701MGTRRN03","ANA LETICIA HERNANDEZ HERRERA",2314,"8.0",1130,1003,"00","30","S01202","00.0","2630",2,"",20170101,20170331,35759.210000000006]
[null,"GUANAJUATO","11DPT0003O",100,"NAME6411037H1","NAME641103MDFVDV03","EVA NAVARRO MADRIGAL",2314,"8.0",1130,1003,"00","30","A03202","00.0","9169",2,"",20170101,20170331,39298.230000000003]
[null,"GUANAJUATO","11DPT0003O",100,"RARE590716V64","RARE590716MJCMMV05","EVELIA DEL CARMEN RAMIREZ RAMIREZ",2314,"8.0",1130,1003,"00","30","CF33203","00.0","9197",2,"",20170101,20170331,54554.920000000006]
[null,"GUANAJUATO","11DPT0003O",100,"CACF600221UD2","CACF600221HSPMSR07","FORTUNATO CAMACHO CASTILLO",2314,"8.0",1130,1003,"00","30","S01202","00.0","2659",2,"",20170101,20170331,36280.160000000003]
[null,"GUANAJUATO","11DPT0003O",100,"GAGH790601EB0","GAGH790601HGTYNC00","HECTOR ALFONSO GAYTAN GONZALEZ",2314,"8.0",1130,1003,"00","30","S01201","00.0","2618",2,"",20170101,20170331,7319.8]
[null,"GUANAJUATO","11DPT0003O",100,"HECH720907NC1","HECH720907MDFRNL01","HILDA HERNANDEZ CANCHOLA",2314,"8.0",1130,1003,"00","30","S01201","00.0","2500",2,"",20170101,20170331,35421.22]
[null,"GUANAJUATO","11DPT0003O",100,"ROVJ5612313Z1","ROVS561231HGTBNL05","J. SILVESTRE ROBLEDO VENEGAS",2314,"8.0",1130,1003,"00","30","ED01201","00.0","2656",2,"",20170101,20170331,65444.110000000008]
[null,"GUANAJUATO","11DPT0003O",100,"AEGJ5311191A4","AEGJ531119HGTSRR09","JORGE ASCENCIO GARCIA",2314,"8.0",1130,1003,"00","30","S01202","00.0","2650",2,"",20170101,20170331,44148.97]
[null,"GUANAJUATO","11DPT0003O",100,"GARJ690126G3A","GARJ690126HQTRVN01","JOSE JUAN GARCIA RIVERA",2314,"8.0",1130,1003,"00","30","S01202","00.0","2633",2,"",20170101,20170331,34579.210000000006]
[null,"GUANAJUATO","11DPT0003O",100,"MAMJ620217DW9","MAMJ620217HGTRNN03","JUAN ANTONIO MARTINEZ MONCIBAIS",2314,"8.0",1130,1003,"00","30","CF33204","00.0","2638",2,"",20170101,20170331,94852.4]
[null,"GUANAJUATO","11DPT0003O",100,"GALJ930324KX8","GALJ930324HGTRPN06","JUAN CARLOS GARCIA LOPEZ",2314,"8.0",1130,1003,"00","30","S01202","00.0","9200",2,"",20170101,20170331,35573.42]
[null,"GUANAJUATO","11DPT0003O",100,"ROGJ631018GD6","ROGJ631018HGTMRN04","JUAN JOSE ROMERO GARCIA",2314,"8.0",1130,1003,"00","30","CF19201","00.0","2620",2,"",20170101,20170331,50957.510000000009]
[null,"GUANAJUATO","11DPT0003O",100,"RORJ800328CB1","RORJ800328HGTDMN01","JUAN PABLO RODRIGUEZ RAMIREZ",2314,"8.0",1130,1003,"00","30","CF18203","00.0","9186",2,"",20170101,20170331,40701.449999999997]
[null,"GUANAJUATO","11DPT0003O",100,"HECL6401228X2","HECL640122MDFRLT03","LETICIA HERNANDEZ CALVILLO",2314,"8.0",1130,1003,"00","30","CF21202","00.0","2663",2,"",20170101,20170331,49623.990000000005]
[null,"GUANAJUATO","11DPT0003O",100,"JIOL8008248F7","JIOL800824MGTMRZ11","LIZETH ARIADNA JIMENEZ ORTEGA",2314,"8.0",1130,1003,"00","30","CF33204","00.0","2510",2,"",20170101,20170331,81511.810000000012]
[null,"GUANAJUATO","11DPT0003O",100,"ROFL910916ES9","ROFL910916MGTBNR05","LORENA ROBLEDO FONSECA",2314,"8.0",1130,1003,"00","30","CF18202","00.0","11099",2,"",20170101,20170331,32213.110000000004]
[null,"GUANAJUATO","11DPT0003O",100,"SAML830406CC2","SAML830406HDFNNS01","LUIS ENRIQUE SANCHEZ MENDOZA",2314,"8.0",1130,1003,"00","30","CF33206","00.0","13322",2,"",20170101,20170331,89392.36]
[null,"GUANAJUATO","11DPT0003O",100,"GOML690426EW2","GOML690426MGTNDZ08","LUZ ESTELA GONZALEZ MEDINA",2314,"8.0",1130,1003,"00","30","CF33204","00.0","2666",2,"",20170101,20170331,87838.399999999994]
[null,"GUANAJUATO","11DPT0003O",100,"BUSG720302VE9","BUSG720302MGTLND02","MA GUADALUPE BULLONS SANTIAGO",2314,"8.0",1130,1003,"00","30","A03202","00.0","9164",2,"",20170101,20170331,43763.3]
[null,"GUANAJUATO","11DPT0003O",100,"AOVP751006KA9","AOVP751006MGTLLL04","MA. DEL PILAR ALMONACI VALADEZ",2314,"8.0",1130,1003,"00","30","CF33204","00.0","2518",2,"",20170101,20170331,86853.37]
[null,"GUANAJUATO","11DPT0003O",100,"OIOM621117BE8","OIOM621117HGTLLN02","MANUEL MARTIN OLIVA OLIVA",2314,"8.0",1130,1003,"00","30","CF18203","00.0","2648",2,"",20170101,20170331,57207.340000000004]
[null,"GUANAJUATO","11DPT0003O",100,"FAAF540219KI2","FAAF540219MGTRGX06","MARIA FE FRAUSTO AGUILAR",2314,"8.0",1130,1003,"00","30","CF34201","00.0","2622",2,"",20170101,20170331,54435.900000000009]
[null,"GUANAJUATO","11DPT0003O",100,"HEFM781229PE6","HEFM781229MGTRRL06","MARIA MILAGROS HERNANDEZ FRAUSTO",2314,"8.0",1130,1003,"00","30","A03202","00.0","2613",2,"",20170101,20170331,37138.949999999997]
[null,"GUANAJUATO","11DPT0003O",100,"CAGM670126RV9","CAGM670126MGTHNR09","MARTHA DELIA CHAVEZ GONZALEZ",2314,"8.0",1130,1003,"00","30","CF33206","00.0","13682",2,"",20170101,20170331,121742.39999999999]
[null,"GUANAJUATO","11DPT0003O",100,"TAPM7310026U1","TAPM731002HDFRSG06","MIGUEL ANGEL TAURINO PASTEN",2314,"8.0",1130,1003,"00","30","A03202","00.0","2614",2,"",20170101,20170331,39152.32]
[null,"GUANAJUATO","11DPT0003O",100,"LEOL8201231V2","LEXO820123MGTNXL07","OLGALIDIA . LEON",2314,"8.0",1130,1003,"00","30","CF33206","00.0","13685",2,"",20170101,20170331,23490.14]
[null,"GUANAJUATO","11DPT0003O",100,"GOPP5010306G6","GOPP501030HGTNRD05","PEDRO GONZALEZ PORTILLO",2314,"8.0",1130,1003,"00","30","CF33206","00.0","13685",2,"",20170101,20170331,51959.590000000004]
[null,"GUANAJUATO","11DPT0003O",100,"RARR701207IA9","RARR701207MDFMMT08","RITA RAMIREZ RAMIREZ",2314,"8.0",1130,1003,"00","30","CF04201","00.0","9170",2,"",20170101,20170331,45185.599999999999]
[null,"GUANAJUATO","11DPT0003O",100,"MALR690904B5A","MALR690904MGTRPS03","ROSA EUGENIA MARTINEZ LOPEZ",2314,"8.0",1130,1003,"00","30","CF34201","00.0","2649",2,"",20170101,20170331,50661.280000000006]
[null,"GUANAJUATO","11DPT0003O",100,"GOPR8103287J3","GOPR810328HDFMRB09","RUBEN GOMEZ PORTILLA",548,"8.0",1130,1003,"00","30","CF02103","00.0","12664",5,"",20170101,20170331,97723.59]
[null,"GUANAJUATO","11DPT0003O",100,"DAFT8701278E1","DAFT870127MZSVLN04","TANIA LIZETH DAVILA FLORES",2314,"8.0",1130,1003,"00","30","S01202","00.0","2623",2,"",20170101,20170331,36343.259999999995]
[null,"GUANAJUATO","11DPT0003O",100,"GUFV820306TSA","GUFV820306HGRZLC04","VICTOR MANUEL GUZMAN FLORES",2314,"8.0",1130,1003,"00","30","CF33206","00.0","13684",2,"",20170101,20170331,110860.50000000001]
[null,"GUANAJUATO","11DPT0007K",100,"MORA580316U78","MORA580316HGTJML06","ALEJANDRO MOJICA RAMIREZ",2314,"8.0",1130,1003,"02","03","CF18203","00.0","2641",2,"",20170101,20170331,50777.880000000005]
[null,"GUANAJUATO","11DPT0007K",100,"BAPA711019KLA","BAPA711019MGTRRN03","ANA LOURDES BARAJAS PEREZ",2314,"8.0",1130,1003,"02","03","CF33204","00.0","3880",2,"",20170101,20170331,87325.299999999988]
[null,"GUANAJUATO","11DPT0007K",100,"CEVB731120C46","CEVB731120HGTDRR00","BERNARDO CEDILLO VERA",2314,"8.0",1130,1003,"02","03","S01201","00.0","9183",2,"",20170101,20170331,37098.340000000004]
[null,"GUANAJUATO","11DPT0007K",100,"IAVC761114FE1","IAVC761114MNTBLL00","CLAUDIA ELIZABETH IBARRA VILLANUEVA",2314,"8.0",1130,1003,"02","03","CF33206","00.0","13320",2,"",20170101,20170331,120130.24000000001]
[null,"GUANAJUATO","11DPT0007K",100,"JAMC821119QK9","JAMC821119MGTMSL07","CLAUDIA MARCELA JAIME MOSQUEDA",2314,"8.0",1130,1003,"02","03","S01202","00.0","9206",2,"",20170101,20170331,38944.620000000003]
[null,"GUANAJUATO","11DPT0007K",100,"GUGE730901EC4","GUGE730901MGTTNS07","ESPERANZA GUTIERREZ GONZALEZ",2314,"8.0",1130,1003,"02","03","CF04201","00.0","2612",2,"",20170101,20170331,48554.45]
[null,"GUANAJUATO","11DPT0007K",100,"MAGF780719PC1","MAGF780719MGTRNT03","FATIMA MARTINEZ GONZALEZ",2314,"8.0",1130,1003,"02","03","S01201","00.0","9171",2,"",20170101,20170331,32691.880000000005]
[null,"GUANAJUATO","11DPT0007K",100,"ROGF800428M80","ROGF800428HGTDZD06","FIDEL RODRIGUEZ GUZMAN",2314,"8.0",1130,1003,"02","03","CF33204","00.0","9201",2,"",20170101,20170331,59830.910000000011]
[null,"GUANAJUATO","11DPT0007K",100,"CAUF560705QGA","CAUF560705HGTHRL05","FILOMENO CHAGOYA URRUTIA",2314,"8.0",1130,1003,"02","03","S01201","00.0","9177",2,"",20170101,20170331,44658.46]
[null,"GUANAJUATO","11DPT0007K",100,"SAGG7304218VA","SAGG730421MGTNLL02","GLORIA SANCHEZ GALVAN",2314,"8.0",1130,1003,"02","03","CF19201","00.0","9188",2,"",20170101,20170331,48335.810000000005]
[null,"GUANAJUATO","11DPT0007K",100,"CADG5812029W6","CADG581202MGTHLR09","GRACIELA CHAVEZ DELGADO",2314,"8.0",1130,1003,"02","03","CF21202","00.0","9211",2,"",20170101,20170331,53563.83]
[null,"GUANAJUATO","11DPT0007K",100,"OILH810313JS5","OILH810313HGTVGC18","HECTOR GERARDO OVIEDO LUGO",2314,"8.0",1130,1003,"02","03","S01201","00.0","9203",2,"",20170101,20170331,30289.050000000003]
[null,"GUANAJUATO","11DPT0007K",100,"ROMJ501119M55","ROMI501119HGTCZS06","J. ISABEL ROCHA MEZA",2314,"8.0",1130,1003,"02","03","S01201","00.0","9202",2,"",20170101,20170331,43555.4]
[null,"GUANAJUATO","11DPT0007K",100,"GARJ840526678","GARJ840526HGTRMV04","JAVIER ARTURO GARCIA ROMERO",2314,"8.0",1130,1003,"02","03","S01202","00.0","9193",2,"",20170101,20170331,40479.520000000004]
[null,"GUANAJUATO","11DPT0007K",100,"COEJ510401V7A","COEJ510401HZSNSS04","JESUS MARIA CONTRERAS ESPARZA",548,"8.0",1130,1003,"02","03","CF02103","00.0","12576",5,"",20170101,20170331,97723.59]
[null,"GUANAJUATO","11DPT0007K",100,"AOLJ820429DY4","AOLJ820429HGTCPL06","JOEL ADOLFO ACOSTA LOPEZ",2314,"8.0",1130,1003,"02","03","S01201","00.0","9192",2,"",20170101,20170331,36009.430000000008]
[null,"GUANAJUATO","11DPT0007K",100,"PERR730823M62","PERR730823HPLRMF15","JOSE RAFAEL PEREZ RAMOS",2314,"8.0",1130,1003,"02","03","S01201","00.0","9173",2,"",20170101,20170331,22337.4]
[null,"GUANAJUATO","11DPT0007K",100,"BAMJ651013MA3","BAMJ651013HGTRRN08","JUAN PEDRO BARBOSA MORALES",2314,"8.0",1130,1003,"02","03","CF33206","00.0","13321",2,"",20170101,20170331,97545.46]
[null,"GUANAJUATO","11DPT0007K",100,"ROGJ720412CD2","ROGJ720412HGTCNL01","JULIO BERNARDO ROCHA GONZALEZ",2314,"8.0",1130,1003,"02","03","CF33202","00.0","2652",2,"",20170101,20170331,51645.530000000006]
[null,"GUANAJUATO","11DPT0007K",100,"GOGL6009014D1","GOGL600901MGTNLN08","LINA ENGRACIA GONZALEZ GALLARDO",2314,"8.0",1130,1003,"02","03","CF18203","00.0","9181",2,"",20170101,20170331,54412.890000000014]
[null,"GUANAJUATO","11DPT0007K",100,"HEBL680226MH6","HEBL680226HDFRNS05","LUIS FELIPE HERRERA BUENDIA",2314,"8.0",1130,1003,"02","03","A03202","00.0","2609",2,"",20170101,20170331,44275.43]
[null,"GUANAJUATO","11DPT0007K",100,"GARL720427FX0","GARL720427MGTRMZ12","LUZ MA GARCIA ROMERO",2314,"8.0",1130,1003,"02","03","ED01201","00.0","9180",2,"",20170101,20170331,59575.250000000007]
[null,"GUANAJUATO","11DPT0007K",100,"ROGL591003DS4","ROGL591003MGTMNN05","MA LINA ROMERO GONZALEZ",2314,"8.0",1130,1003,"02","03","CF34202","00.0","4402",2,"",20170101,20170331,64438.46]
[null,"GUANAJUATO","11DPT0007K",100,"MUPT600105IQ9","MUPT600105MGTRRR07","MA TRINIDAD MURILLO PEREZ",2314,"8.0",1130,1003,"02","03","CF34201","00.0","9205",2,"",20170101,20170331,45944.240000000005]
[null,"GUANAJUATO","11DPT0007K",100,"RAHJ6410105C3","RAHJ641010MGTMRS04","MA. DE JESUS RAMIREZ HORTA",2314,"8.0",1130,1003,"02","03","CF33206","00.0","13317",2,"",20170101,20170331,142955.57999999999]
[null,"GUANAJUATO","11DPT0007K",100,"CACL650308V86","CACL650308MGTMLZ03","MA. DE LA LUZ CAMARILLO COLLAZO",2314,"8.0",1130,1003,"02","03","CF33206","00.0","10298",2,"",20170101,20170331,136363.56]
[null,"GUANAJUATO","11DPT0007K",100,"RIOS5803272M4","RIOS580327MZSVLC03","MA. DEL SOCORRO RIVERA OLVERA",2314,"8.0",1130,1003,"02","03","CF33204","00.0","9199",2,"",20170101,20170331,45174.509999999995]
[null,"GUANAJUATO","11DPT0007K",100,"SACA791207U75","SACA791207MGTLSL02","MARIA ALEJANDRA GUADALUPE SALAZAR CASTAÑEDA",548,"8.0",1130,1003,"02","03","CF02105","00.0","12840",5,"",20170101,20170331,83101.77]
[null,"GUANAJUATO","11DPT0007K",100,"OILP6802156K9","OILP680215MDFVGL09","MARIA DEL PILAR OVIEDO LUGO",2314,"8.0",1130,1003,"02","03","A03202","00.0","9168",2,"",20170101,20170331,45577.630000000005]
[null,"GUANAJUATO","11DPT0007K",100,"LOMA701120ND4","LOXM701120HGTPXR04","MARTIN EDUARDO LOPEZ _",2314,"8.0",1130,1003,"02","03","CF33206","00.0","13319",2,"",20170101,20170331,153365.54000000004]
[null,"GUANAJUATO","11DPT0007K",100,"MAMN910328KD9","MAMN910328HGTRDS06","NESTOR ISIDRO MARTINEZ MEDINA",2314,"8.0",1130,1003,"02","03","CF33204","00.0","9174",2,"",20170101,20170331,46802.79]
[null,"GUANAJUATO","11DPT0007K",100,"RARP630605NP2","RARP630605HJCMMD06","PEDRO RAMIREZ RAMIREZ",2314,"8.0",1130,1003,"02","03","S01202","00.0","2621",2,"",20170101,20170331,42753.740000000005]
[null,"GUANAJUATO","11DPT0007K",100,"PAZR620620HP0","PAZR620620MGTCPQ07","RAQUEL PACHECO ZAPIEN",2314,"8.0",1130,1003,"02","03","CF33204","00.0","9194",2,"",20170101,20170331,94305.41]
[null,"GUANAJUATO","11DPT0007K",100,"POMR6708302N1","POMR670830MGTRNS05","ROSA MARIA PORRAS MANRIQUE",2314,"8.0",1130,1003,"02","03","CF33204","00.0","2642",2,"",20170101,20170331,90297.41]
[null,"GUANAJUATO","11DPT0007K",100,"SETV690706LG3","SETV690706MDFRRR05","VERONICA SERRANO TORRES",2314,"8.0",1130,1003,"02","03","CF33206","00.0","13316",2,"",20170101,20170331,89708.689999999988]
[null,"GUANAJUATO","11DPT0007K",100,"GURW970309V10","GURW970309MGTTDN02","WENDI GUTIERREZ RODRIGUEZ",2314,"8.0",1130,1003,"02","03","S01201","00.0","9184",2,"",20170101,20170331,14891.6]
[null,"GUANAJUATO","11DPT0013V",100,"GUGA7312084M6","GUGA731208HGTTZL01","ALFREDO GUTIERREZ GUZMAN",2314,"8.0",1130,1003,"03","02","CF21202","00.0","18881",2,"",20170101,20170331,46482.270000000004]
[null,"GUANAJUATO","11DPT0013V",100,"RORC850223K78","RORC850223HGTDMR02","CARLOS ALBERTO RODRIGUEZ RAMIREZ",2314,"8.0",1130,1003,"03","02","CF18203","00.0","18879",2,"",20170101,20170331,73971.740000000005]
[null,"GUANAJUATO","11DPT0013V",100,"GUAC730716AX1","GUAC730716MGTTRL04","CLAUDIA CECILIA GUTIERREZ ARAMBULA",2314,"8.0",1130,1003,"03","02","CF33206","00.0","18851",2,"",20170101,20170331,11745.07]
[null,"GUANAJUATO","11DPT0013V",100,"JICC6704222W7","JICC670422MGTMRL00","CLAUDIA FABIOLA JIMENEZ CERRILLO",548,"8.0",1130,1003,"03","02","CF02104","00.0","18848",5,"",20170101,20170331,95731.82]
[null,"GUANAJUATO","11DPT0013V",100,"GUME761118NPA","GUME761118MGTLNR03","ERIKA ALEJANDRA GUILLEN MENDIOLA",2314,"8.0",1130,1003,"03","02","CF33206","00.0","18850",2,"",20170101,20170331,35235.21]
[null,"GUANAJUATO","11DPT0013V",100,"NIRG591215T84","NIRG591215MGTTVR06","GEORGINA DE LOURDES NIETO RIVERA",2314,"8.0",1130,1003,"03","02","CF33206","00.0","18852",2,"",20170101,20170331,138938.46000000002]
[null,"GUANAJUATO","11DPT0013V",100,"HEMG620422565","HEMG620422MGTRRR08","GRACIELA HERNANDEZ MARTINEZ",2314,"8.0",1130,1003,"03","02","CF33203","00.0","18858",2,"",20170101,20170331,45314.87]
[null,"GUANAJUATO","11DPT0013V",100,"MOLJ6908066K2","MOLJ690806HGTNRN01","JUAN ANTONIO MONTALVO LIRA",2314,"8.0",1130,1003,"03","02","CF33204","00.0","18855",2,"",20170101,20170331,72217.94]
[null,"GUANAJUATO","11DPT0013V",100,"HELJ790519GT9","HELJ790519HGTRPN03","JUAN MANUEL HERNANDEZ LOPEZ",2314,"8.0",1130,1003,"03","02","CF18203","00.0","18857",2,"",20170101,20170331,55922.500000000015]
[null,"GUANAJUATO","11DPT0013V",100,"ROSJ840320PL5","ROSJ840320MMCMGL06","JULIA OYUKI ROMERO SEGURA",2314,"8.0",1130,1003,"03","02","A03202","00.0","18880",2,"",20170101,20170331,45210.340000000004]
[null,"GUANAJUATO","11DPT0013V",100,"CAML820820U36","CAML820820HGTNNS09","LUIS MIGUEL CANO MENDOZA",2314,"8.0",1130,1003,"03","02","CF33204","00.0","18853",2,"",20170101,20170331,72401.850000000006]
[null,"GUANAJUATO","11DPT0013V",100,"EACA751029DJ3","EACA751029MGTSRN06","MA DE LOS ANGELES ESPARZA CORONA",2314,"8.0",1130,1003,"03","02","S01201","00.0","18882",2,"",20170101,20170331,34936.000000000007]
[null,"GUANAJUATO","11DPT0013V",100,"GURG711212BH3","GURG711212MGTRXD01","MA GUADALUPE GUARDADO REA",2314,"8.0",1130,1003,"03","02","A03202","00.0","18859",2,"",20170101,20170331,39244.97]
[null,"GUANAJUATO","11DPT0013V",100,"RELS650704P63","RELS650704MGTXZL00","MA. SOLEDAD REA LOZANO",2314,"8.0",1130,1003,"03","02","A01801","00.0","18877",2,"",20170101,20170331,60244.81]
[null,"GUANAJUATO","11DPT0013V",100,"ZERV770303SS4","ZERV770303MGTNCN07","MARIA VANESSA ZENDEJAS ROCHA",2314,"8.0",1130,1003,"03","02","A01801","00.0","18878",2,"",20170101,20170331,50392.61]
[null,"GUANAJUATO","11DPT0013V",100,"GASM690929112","GASM690929HDFRLR02","MARIO MIGUEL GARCIA SALINAS",2314,"8.0",1130,1003,"03","02","CF33204","00.0","18854",2,"",20170101,20170331,74638.22]
[null,"GUANAJUATO","11DPT0013V",100,"RUER840817TJ2","RUER840817HGTZSN07","RENE RUIZ ESPINOSA",2314,"8.0",1130,1003,"03","02","A01801","00.0","18856",2,"",20170101,20170331,47176.15]
[null,"GUANAJUATO","11DPT0013V",100,"ROMR861218274","ROMR861218HGTDGC00","RICARDO RODRIGUEZ MAGDALENO",2314,"8.0",1130,1003,"03","02","CF33206","00.0","18849",2,"",20170101,20170331,100904.06999999999]
[null,"GUANAJUATO","11DPT0013V",100,"MEES880125B67","MEES880125MGTZSN02","SANDRA MARGARITA MEZA ESTRADA",2314,"8.0",1130,1003,"03","02","S01201","00.0","18860",2,"",20170101,20170331,36457.950000000004]
[null,"GUANAJUATO","11DPT0004N",100,"SOPA800206QN0","SOPA800206HMCRRB02","ABNER ISAI SORIA PEREZ",2314,"8.0",1130,1003,"01","28","CF33204","00.0","10615",2,"",20170101,20170331,74376.820000000007]
[null,"GUANAJUATO","11DPT0004N",100,"GAZE690718GX3","GAZE690718MGTRVL07","ELIZABETH GARCIA ZAVALA",2314,"8.0",1130,1003,"01","28","CF04201","00.0","6498",2,"",20170101,20170331,50404.83]
[null,"GUANAJUATO","11DPT0004N",100,"GOGE730923ME8","GOGE730923MMNNNL00","ELIZABETH GONZALEZ GONZALEZ",2314,"8.0",1130,1003,"01","28","A03202","00.0","6497",2,"",20170101,20170331,44875.22]
[null,"GUANAJUATO","11DPT0004N",100,"AACG691218L13","AACG691218MMNLSR08","GRACIELA ALVAREZ CASTRO",2314,"8.0",1130,1003,"01","28","A03202","00.0","6496",2,"",20170101,20170331,47392.05]
[null,"GUANAJUATO","11DPT0004N",100,"DUAJ8704098Q4","DUAJ870409HGTRGR00","JORGE LUIS DURAN AGUILERA",2314,"8.0",1130,1003,"01","28","S01201","00.0","6520",2,"",20170101,20170331,34313.960000000006]
[null,"GUANAJUATO","11DPT0004N",100,"MAVJ651001UX7","MAVJ651001HGTRGS08","JOSE DE JESUS MARTINEZ VEGA",2314,"8.0",1130,1003,"01","28","S01201","00.0","6502",2,"",20170101,20170331,25150.05]
[null,"GUANAJUATO","11DPT0004N",100,"OEVL650213T59","OEVL650213MGTRLR01","LAURA INES ORTEGA VALADEZ",2314,"8.0",1130,1003,"01","28","CF33206","00.0","14314",2,"",20170101,20170331,141282.04999999999]
[null,"GUANAJUATO","11DPT0004N",100,"DIJL7203079A3","DIJL720307MGTGCR01","MA. DE LOURDES DIEGO JACOBO",2314,"8.0",1130,1003,"01","28","CF19201","00.0","6523",2,"",20170101,20170331,60309.610000000008]
[null,"GUANAJUATO","11DPT0004N",100,"PAGR7307144R1","PAGR730714MGTNMF00","MARIA DEL REFUGIO PANTOJA GOMEZ",2314,"8.0",1130,1003,"01","28","CF21202","00.0","6518",2,"",20170101,20170331,48115.7]
[null,"GUANAJUATO","11DPT0004N",100,"GACR6704153I2","GACR670415MGTRRT06","MARIA RITA GARCIA CERRATO",2314,"8.0",1130,1003,"01","28","CF19201","00.0","6506",2,"",20170101,20170331,52181.440000000002]
[null,"GUANAJUATO","11DPT0004N",100,"AUPM640422KR2","AUPM640422HGTGLR03","MARTIN AGUIRRE PALMERIN",2314,"8.0",1130,1003,"01","28","S01202","00.0","6509",2,"",20170101,20170331,46771.66]
[null,"GUANAJUATO","11DPT0004N",100,"MORM731010QZ9","MORM731010MVZLZR03","MIRSA MARICELA MOLGORA RAZO",548,"8.0",1130,1003,"01","28","CF02104","00.0","12767",5,"",20170101,20170331,95731.82]
[null,"GUANAJUATO","11DPT0004N",100,"LOGM731124S65","LOGM731124MMNPZN04","MONICA IVETT LOPEZ GUZMAN",2314,"8.0",1130,1003,"01","28","CF33206","00.0","13686",2,"",20170101,20170331,112069.56]
[null,"GUANAJUATO","11DPT0004N",100,"VASO730804UX2","VASO730804HGTRTC00","OCTAVIO VARGAS SOTO",2314,"8.0",1130,1003,"01","28","CF33206","00.0","13688",2,"",20170101,20170331,120907.20000000001]
[null,"GUANAJUATO","11DPT0004N",100,"SAHO620602LB0","SAHO620602HSRLRS06","OSMAN SALAZAR HERNANDEZ",2314,"8.0",1130,1003,"01","28","S01201","00.0","6507",2,"",20170101,20170331,35361.07]
[null,"GUANAJUATO","11DPT0004N",100,"LURR5303156L3","LURR530315HGTNMY04","RAYMUNDO LUNA RAMIREZ",2314,"8.0",1130,1003,"01","28","CF33206","00.0","14055",2,"",20170101,20170331,124623.35]
[null,"GUANAJUATO","11DPT0004N",100,"MEGR631011V43","MEGR631011MGTNRS04","ROSA MENDEZ GARCIA",2314,"8.0",1130,1003,"01","28","S01202","00.0","6514",2,"",20170101,20170331,42609.62]
[null,"GUANAJUATO","11DPT0004N",100,"TAAS6205308FA","TAAS620530MJCPLR01","SARA TAPIA ALCANTARA",2314,"8.0",1130,1003,"01","28","CF34201","00.0","6522",2,"",20170101,20170331,50881.62]
[null,"GUANAJUATO","11DPT0004N",100,"GARS670416A54","GARS670416MGTRYL05","SILVIA GARCIA REYES",2314,"8.0",1130,1003,"01","28","CF33204","00.0","10604",2,"",20170101,20170331,92398.229999999981]
[null,"GUANAJUATO","11DPT0004N",100,"LOGY890331RG1","LOGY890331MGTPZN04","YANNET LOPEZ GUZMAN",2314,"8.0",1130,1003,"01","28","S01201","00.0","6511",2,"",20170101,20170331,36546.36]
[null,"GUANAJUATO","11DPT0009I",100,"GUZA720514FG4","GUZA720514MDFTVL06","ALEJANDRA GUTIERREZ ZAVALA",2314,"8.0",1130,1003,"01","74","CF04201","00.0","8079",2,"",20170101,20170331,51027.990000000005]
[null,"GUANAJUATO","11DPT0009I",100,"MERA680725T53","MERA680725MGTJML04","ALMA DELIA MEJIA RAMOS",2314,"8.0",1130,1003,"01","74","A03202","00.0","8078",2,"",20170101,20170331,52011.02]
[null,"GUANAJUATO","11DPT0009I",100,"EICA641219IS3","EICA641219MGTLRL01","ALTAGRACIA ELIZARRARAS CERVANTES",2314,"8.0",1130,1003,"01","74","CF21202","00.0","8100",2,"",20170101,20170331,56903.83]
[null,"GUANAJUATO","11DPT0009I",100,"LOLA590613UN8","LOLA590613HGTPPN00","ANTONIO LOPEZ LOPEZ",2314,"8.0",1130,1003,"01","74","CF33206","00.0","13500",2,"",20170101,20170331,140399.12]
[null,"GUANAJUATO","11DPT0009I",100,"LILB720207HV3","LILB720207MGTNML02","BLANCA ESTELA LINARES LOMELI",2314,"8.0",1130,1003,"01","74","CF33202","00.0","8087",2,"",20170101,20170331,54752.000000000007]
[null,"GUANAJUATO","11DPT0009I",100,"AABC720527RL6","AABC720527HGTLRR03","CARLOS ALVARADO BARRIOS",2314,"8.0",1130,1003,"01","74","S01202","00.0","8097",2,"",20170101,20170331,44240.12]
[null,"GUANAJUATO","11DPT0009I",100,"EIVC851005GF2","EIVC851005HGTLRR07","CARLOS ELIZARRARAS VARGAS",2314,"8.0",1130,1003,"01","74","CF33206","00.0","14311",2,"",20170101,20170331,103576.77999999998]
[null,"GUANAJUATO","11DPT0009I",100,"MAZC781203890","MAZC781203HGTQRR06","CARLOS MAQUEDA ZARATE",2314,"8.0",1130,1003,"01","74","CF18201","00.0","8093",2,"",20170101,20170331,34558.000000000007]
[null,"GUANAJUATO","11DPT0009I",100,"EICC740626328","EICC740626MGTLRL02","CLAUDIA ELIZARRARAS CERVANTES",2314,"8.0",1130,1003,"01","74","S01201","00.0","8099",2,"",20170101,20170331,25975.05]
[null,"GUANAJUATO","11DPT0009I",100,"MAAG880919T71","MAAG880919MGTGYR06","GREGORIA MAGAÑA AYALA",2314,"8.0",1130,1003,"01","74","S01201","00.0","8085",2,"",20170101,20170331,18299.5]
[null,"GUANAJUATO","11DPT0009I",100,"ZUGJ521022BB6","ZUGJ521022HGTXRV02","JAVIER ZUÑIGA GARCIA",548,"8.0",1130,1003,"01","74","CF02103","00.0","12663",5,"",20170101,20170331,97723.59]
[null,"GUANAJUATO","11DPT0009I",100,"SOMJ580901N40","SOMJ580901HMNLRS02","JESUS SOLIS MARIN",2314,"8.0",1130,1003,"01","74","A03202","00.0","8076",2,"",20170101,20170331,49907.259999999995]
[null,"GUANAJUATO","11DPT0009I",100,"SAAA790117M77","SAAA790117HGTNRL19","JOSE ALFREDO SANCHEZ ARREDONDO",2314,"8.0",1130,1003,"01","74","CF33206","00.0","13499",2,"",20170101,20170331,112069.56]
[null,"GUANAJUATO","11DPT0009I",100,"ROPJ630922717","ROPJ630922MGTDRS08","JOSEFINA RODRIGUEZ PEREZ",2314,"8.0",1130,1003,"01","74","A03202","00.0","8080",2,"",20170101,20170331,46742.53]
[null,"GUANAJUATO","11DPT0009I",100,"GUZL770701FT7","GUZL770701MMCTVT09","LETICIA GUTIERREZ ZAVALA",2314,"8.0",1130,1003,"01","74","S01201","00.0","8081",2,"",20170101,20170331,10979.7]
[null,"GUANAJUATO","11DPT0009I",100,"MAZC650708TU1","MAZC650708MGTQRR01","MARIA CARMEN MAQUEDA ZARATE",2314,"8.0",1130,1003,"01","74","CF19201","00.0","8090",2,"",20170101,20170331,47035.450000000004]
[null,"GUANAJUATO","11DPT0009I",100,"EITG6112096F3","EITG611209MDFSBD05","MARIA GUADALUPE ESPINOSA TABLEROS",2314,"8.0",1130,1003,"01","74","CF33204","00.0","2591",2,"",20170101,20170331,84054.389999999985]
[null,"GUANAJUATO","11DPT0009I",100,"COCM710215JF9","COCM710215HMNBMR04","MARIO COBIAN CAMACHO",2314,"8.0",1130,1003,"01","74","CF33206","00.0","13501",2,"",20170101,20170331,125369.7]
[null,"GUANAJUATO","11DPT0009I",100,"MEGM680209QU7","MEGM680209MGTDZR08","MARTHA SUSANA MEDEL GUZMAN",2314,"8.0",1130,1003,"01","74","S01202","00.0","8082",2,"",20170101,20170331,36680.339999999997]
[null,"GUANAJUATO","11DPT0009I",100,"MARM6405079G7","MARM640507HGTGVR02","MARTIN MAGAÑA RIVERA",2314,"8.0",1130,1003,"01","74","CF33206","00.0","14310",2,"",20170101,20170331,123959.06]
[null,"GUANAJUATO","11DPT0009I",100,"VACM560124H46","VACM560124HGTZRR03","MAURILIO VAZQUEZ CERVANTES",2314,"8.0",1130,1003,"01","74","S01202","00.0","8092",2,"",20170101,20170331,47707.12]
[null,"GUANAJUATO","11DPT0009I",100,"CELM960313G89","CELM960313MGTRPY09","MAYRA FRANCISCA CERVANTES LOPEZ",2314,"8.0",1130,1003,"01","74","S01201","00.0","8089",2,"",20170101,20170331,35160.650000000009]
[null,"GUANAJUATO","11DPT0009I",100,"MATM660127GT0","MATM660127MGTGFN01","MONICA MAGAÑA TAFOYA",2314,"8.0",1130,1003,"01","74","CF33203","00.0","8091",2,"",20170101,20170331,57365.090000000004]
[null,"GUANAJUATO","11DPT0009I",100,"SARO9410041H4","SARO941004HGTNXL07","OLDAIR FERNANDO SANTILLAN REA",2314,"8.0",1130,1003,"01","74","CF18201","00.0","8098",2,"",20170101,20170331,32691.880000000005]
[null,"GUANAJUATO","11DPT0009I",100,"RELR6206286CA","RELR620628HGTYPG09","ROGELIO REYES LOPEZ",2314,"8.0",1130,1003,"01","74","CF18203","00.0","8094",2,"",20170101,20170331,57122.510000000009]
[null,"GUANAJUATO","11DPT0011X",100,"CALA880830IGA","CALA880830MGTLPD08","ADRIANA CALDERON LOPEZ",2314,"8.0",1130,1003,"02","49","CF04201","00.0","10296",2,"",20170101,20170331,43655.600000000006]
[null,"GUANAJUATO","11DPT0011X",100,"AOFA670123A81","AOFA670123MGTBLD06","ADRIANA DEL CARMEN ABONCE FLORES",2314,"8.0",1130,1003,"02","49","CF33206","00.0","14057",2,"",20170101,20170331,110860.50000000001]
[null,"GUANAJUATO","11DPT0011X",100,"ROGA640613DQ5","ROGA640613MDFJTN05","ANTONIA ESTELA ROJAS GUTIERREZ",2314,"8.0",1130,1003,"02","49","CF33206","00.0","14318",2,"",20170101,20170331,121540.87999999999]
[null,"GUANAJUATO","11DPT0011X",100,"RACB5510265G3","RACB551026HGTMSN05","BENITO RAMIREZ CASTILLO",2314,"8.0",1130,1003,"02","49","A03202","00.0","10292",2,"",20170101,20170331,49433.83]
[null,"GUANAJUATO","11DPT0011X",100,"AABC680116196","AABC680116MMCBNL09","CLAUDIA CECILIA DE JESUS ABDALA BUENDIA",2314,"8.0",1130,1003,"02","49","S01202","00.0","7692",2,"",20170101,20170331,44168.58]
[null,"GUANAJUATO","11DPT0011X",100,"MAJG650413GMA","MAJG650413HGTLRS08","GUSTAVO MALAGON JUAREZ",2314,"8.0",1130,1003,"02","49","CF33206","00.0","13689",2,"",20170101,20170331,131213.70000000001]
[null,"GUANAJUATO","11DPT0011X",100,"BAGJ5004309G9","BAGJ500430HGTRRR03","JORGE BARRERA GARCIA",2314,"8.0",1130,1003,"02","49","CF18201","00.0","10593",2,"",20170101,20170331,44713.409999999996]
[null,"GUANAJUATO","11DPT0011X",100,"MOMA590424218","MOMA590424HGTNLN04","JOSE ANTONIO MONCADA MALDONADO",2314,"8.0",1130,1003,"02","49","CF34201","00.0","10609",2,"",20170101,20170331,50661.280000000006]
[null,"GUANAJUATO","11DPT0011X",100,"NAZA870510IS9","NAZA870510HGTVVN07","JOSE ANTONIO NAVARRETE ZAVALA",2314,"8.0",1130,1003,"02","49","CF18201","00.0","6515",2,"",20170101,20170331,31033.110000000004]
[null,"GUANAJUATO","11DPT0011X",100,"RIGA780625KX0","RIGA780625HGTVMG07","JOSE AUGUSTO RIVERA GOMEZ",2314,"8.0",1130,1003,"02","49","S01202","00.0","10597",2,"",20170101,20170331,41089.58]
[null,"GUANAJUATO","11DPT0011X",100,"AECJ7908035L8","AECJ790803HGTLRS03","JOSE JESUS ALEJO CARREÑO",2314,"8.0",1130,1003,"02","49","S01201","00.0","10594",2,"",20170101,20170331,39039.400000000009]
[null,"GUANAJUATO","11DPT0011X",100,"RARL5612292P3","RARL561229HGTMMS07","JOSE LUIS RAMIREZ RAMIREZ",548,"8.0",1130,1003,"02","49","CF02103","00.0","12685",5,"",20170101,20170331,92669.46]
[null,"GUANAJUATO","11DPT0011X",100,"GAJJ660505P94","GAJJ660505HGTRMN06","JUAN GARCIA JIMENEZ",2314,"8.0",1130,1003,"02","49","CF19201","00.0","10602",2,"",20170101,20170331,50888.94]
[null,"GUANAJUATO","11DPT0011X",100,"AECM720103NB9","AECM720103MGTLRR09","MARCELA ALEJO CARREÑO",2314,"8.0",1130,1003,"02","49","CF33206","00.0","14056",2,"",20170101,20170331,133788.6]
[null,"GUANAJUATO","11DPT0011X",100,"CAAM930419DL1","CAAM930419HGTRLR08","MARCO ALEJANDRO CARDOSO ALVARADO",2314,"8.0",1130,1003,"02","49","S01201","00.0","10610",2,"",20170101,20170331,10979.7]
[null,"GUANAJUATO","11DPT0011X",100,"SARF810815QJ5","SARF810815MDFNCB12","MARIA FABIOLA SANCHEZ RICO",2314,"8.0",1130,1003,"02","49","S01201","00.0","10589",2,"",20170101,20170331,35951.269999999997]
[null,"GUANAJUATO","11DPT0011X",100,"MAMM8504029T1","MAMM850402MGTLLS09","MASSIEL MALDONADO MALDONADO",2314,"8.0",1130,1003,"02","49","S01202","00.0","10294",2,"",20170101,20170331,39015.78]
[null,"GUANAJUATO","11DPT0011X",100,"EAFM570902GM4","EAFM570902HGTSLS06","MOISES ESTRADA FLORES",2314,"8.0",1130,1003,"02","49","CF18201","00.0","6504",2,"",20170101,20170331,44458.39]
[null,"GUANAJUATO","11DPT0011X",100,"AAMR650620AB4","AAMR650620HGTLGB03","ROBERTO ALVARADO MAGAÑA",2314,"8.0",1130,1003,"02","49","CF19201","00.0","10606",2,"",20170101,20170331,50635.59]
[null,"GUANAJUATO","11DPT0011X",100,"GOLR590503HDA","GOLR590503HGTNDB04","ROBERTO GONZALEZ LEDESMA",2314,"8.0",1130,1003,"02","49","CF33206","00.0","14319",2,"",20170101,20170331,155697.04999999999]
[null,"GUANAJUATO","11DPT0011X",100,"ROPR8607125H9","ROPR860712MGTDNS08","ROSA AIDE RODRIGUEZ PANIAGUA",2314,"8.0",1130,1003,"02","49","CF33206","00.0","12915",2,"",20170101,20170331,102396.77999999998]
[null,"GUANAJUATO","11DPT0011X",100,"AAMR671130JR0","AAMR671130HGTLGB00","RUBEN ALVARADO MAGAÑA",2314,"8.0",1130,1003,"02","49","S01201","00.0","10613",2,"",20170101,20170331,36480.720000000001]
[null,"GUANAJUATO","11DPT0011X",100,"GOSA4507257Y0","GOXS450725HGTNXN07","SANTIAGO GONZALEZ",2314,"8.0",1130,1003,"02","49","S01202","00.0","10294",2,"",20170101,20170331,17038.170000000002]
[null,"GUANAJUATO","11DPT0011X",100,"SEES881205VA7","SEES881205MGTRSR08","SARA SERRANO ESTRADA",2314,"8.0",1130,1003,"02","49","CF33203","00.0","10611",2,"",20170101,20170331,45380.570000000007]
[null,"GUANAJUATO","11DPT0011X",100,"BAGS470901EG4","BAGS470901MGTRRL03","SILVIA BARRERA GARCIA",2314,"8.0",1130,1003,"02","49","S01202","00.0","10616",2,"",20170101,20170331,45326.239999999998]
[null,"GUANAJUATO","11DPT0011X",100,"LOCV8505084R9","LOCV850508MGTPRR07","VERONICA LOPEZ CARDOSO",2314,"8.0",1130,1003,"02","49","S01201","00.0","2557",2,"",20170101,20170331,39697.06]
[null,"GUANAJUATO","11DPT0011X",100,"GOLV650317F13","GOLV650317HGTNPC03","VICTOR MANUEL GONZALEZ LOPEZ",2314,"8.0",1130,1003,"02","49","S01201","00.0","10614",2,"",20170101,20170331,25150.05]
[null,"GUANAJUATO","11DPT0014U",100,"AALA880119VB9","AALA880119MGTLPL06","ALESSA ALVARADO LOPEZ",2314,"8.0",1130,1003,"03","03","A01801","00.0","18884",2,"",20170101,20170331,53552.66]
[null,"GUANAJUATO","11DPT0014U",100,"SOMC8307243E3","SOMC830724HGTTNH06","CHRISTIAN SOTO MENDOZA",2314,"8.0",1130,1003,"03","03","CF33206","00.0","18861",2,"",20170101,20170331,108442.26000000001]
[null,"GUANAJUATO","11DPT0014U",100,"MOJC851117J2A","MOJC851117MGTRST08","CITLALLI TONANCI MORA JASSO",2314,"8.0",1130,1003,"03","03","CF33206","00.0","18863",2,"",20170101,20170331,110114.15000000001]
[null,"GUANAJUATO","11DPT0014U",100,"JUSD780922L87","JUSD780922MQTRRL03","DULCE MARIA JUAREZ SORIA",2314,"8.0",1130,1003,"03","03","A01801","00.0","18870",2,"",20170101,20170331,49248.770000000004]
[null,"GUANAJUATO","11DPT0014U",100,"GAAE770204JK3","GAAE770204MDFYLL06","ELIA GAYTAN ALCARAZ",548,"8.0",1130,1003,"03","03","CF02104","00.0","18883",5,"",20170101,20170331,95731.82]
[null,"GUANAJUATO","11DPT0014U",100,"RAAE850827HM7","RAAE850827MGTMNL05","ELVIA RAMIREZ ANDRADE",2314,"8.0",1130,1003,"03","03","S01201","00.0","18885",2,"",20170101,20170331,47239.880000000005]
[null,"GUANAJUATO","11DPT0014U",100,"MERG840929RZ5","MERG840929MGTNDB06","GABRIELA MENDEZ RODRIGUEZ",2314,"8.0",1130,1003,"03","03","S01201","00.0","18875",2,"",20170101,20170331,31443.560000000005]
[null,"GUANAJUATO","11DPT0014U",100,"MIHG8606185P2","MIHG860618MDFRRB06","GABRIELA MIRAMONTES HERNANDEZ",2314,"8.0",1130,1003,"03","03","A03202","00.0","18868",2,"",20170101,20170331,37988.319999999992]
[null,"GUANAJUATO","11DPT0014U",100,"SECG740707K72","SECG740707MZSGML05","GUILLERMINA SEGURA CAMPOS",2314,"8.0",1130,1003,"03","03","CF33206","00.0","18862",2,"",20170101,20170331,89708.689999999988]
[null,"GUANAJUATO","11DPT0014U",100,"SIRI830722KG2","SIRI830722HGTXCG04","IGNACIO MANUEL SIXTOS RICO",2314,"8.0",1130,1003,"03","03","CF33204","00.0","18866",2,"",20170101,20170331,72036.639999999999]
[null,"GUANAJUATO","11DPT0014U",100,"OISI790511DD8","OISI790511HHGLNS14","ISMAEL OLIVO SANCHEZ",2314,"8.0",1130,1003,"03","03","CF33204","00.0","18865",2,"",20170101,20170331,60920.040000000008]
[null,"GUANAJUATO","11DPT0014U",100,"NAQI780206S92","NAQI780206HDFVXV07","IVAN AGUSTIN NAVARRETE QUIÑONES",2314,"8.0",1130,1003,"03","03","CF21202","00.0","18874",2,"",20170101,20170331,45459.62000000001]
[null,"GUANAJUATO","11DPT0014U",100,"MEME901101QT3","MEME901101MGTNRL08","MARIA ELENA MENDOZA MARTINEZ",2314,"8.0",1130,1003,"03","03","A01801","00.0","18872",2,"",20170101,20170331,44966.270000000004]
[null,"GUANAJUATO","11DPT0014U",100,"GABI850102NDA","GABI850102MGTRRS03","MARIA ISABEL GARCIA BARRIENTOS",2314,"8.0",1130,1003,"03","03","CF33206","00.0","18864",2,"",20170101,20170331,105416.58000000002]
[null,"GUANAJUATO","11DPT0014U",100,"RAAI811229BW5","RAAI811229MMCMNS05","MARIA ISABEL RAMIREZ ANDRADE",2314,"8.0",1130,1003,"03","03","CF33203","00.0","18876",2,"",20170101,20170331,55345.279999999999]
[null,"GUANAJUATO","11DPT0014U",100,"TORM8008155Q9","TORM800815HGTRVR02","MARIO TORRES RIVERA",2314,"8.0",1130,1003,"03","03","A03202","00.0","18869",2,"",20170101,20170331,38538.99]
[null,"GUANAJUATO","11DPT0014U",100,"RESO730809AI4","RESO730809MGTYNF03","OFELIA REYES SANDOVAL",2314,"8.0",1130,1003,"03","03","CF18203","00.0","18873",2,"",20170101,20170331,44767.47]
[null,"GUANAJUATO","11DPT0014U",100,"RIHR880331D30","RIHR880331HGTSRC09","RICARDO RIOS HERNANDEZ",2314,"8.0",1130,1003,"03","03","CF33204","00.0","18867",2,"",20170101,20170331,75429.87999999999]
[null,"GUANAJUATO","11DPT0014U",100,"HEPU760412GG8","HEPU760412HPLRRZ03","UZIEL HERNANDEZ PEREZ",2314,"8.0",1130,1003,"03","03","CF18203","00.0","18871",2,"",20170101,20170331,49432.259999999995]
[null,"GUANAJUATO","11DPT0012W",100,"EUVA760924363","EUVA760924HGTSLN02","ANTONIO ESQUEDA VILLALON",2314,"8.0",1130,1003,"04","02","CF33204","00.0","1800",2,"",20170101,20170331,82479.920000000013]
[null,"GUANAJUATO","11DPT0012W",100,"SAHA7408317B1","SAHA740831MDFNRR01","AURELIA SANDOVAL HERNANDEZ",2314,"8.0",1130,1003,"04","02","S01201","00.0","11167",2,"",20170101,20170331,36267.910000000003]
[null,"GUANAJUATO","11DPT0012W",100,"BAHC790225T34","BAHC790225HGTSRS06","CESAR ISRAEL BASALDUA HERNANDEZ",2314,"8.0",1130,1003,"04","02","CF18201","00.0","9301",2,"",20170101,20170331,30566.580000000005]
[null,"GUANAJUATO","11DPT0012W",100,"PECE671111QE4","PECE671111HDFRSL09","ELOY MARTIN PEREZ CASTILLO",2314,"8.0",1130,1003,"04","02","CF33206","00.0","14253",2,"",20170101,20170331,132843.75999999998]
[null,"GUANAJUATO","11DPT0012W",100,"VAMF590309CY5","VAMF590309HGTLNR07","FERNANDO VALDES MONTES",2314,"8.0",1130,1003,"04","02","CF33206","00.0","13687",2,"",20170101,20170331,125676.28000000001]
[null,"GUANAJUATO","11DPT0012W",100,"LOSG55020446A","LOSG550204HGTPTL09","GUILLERMO LOPEZ SOTO",2314,"8.0",1130,1003,"04","02","CF04201","00.0","1440",2,"",20170101,20170331,49088.58]
[null,"GUANAJUATO","11DPT0012W",100,"FOGH740517223","FOGH740517HGTLTC07","HECTOR FLORES GUTIERREZ",2314,"8.0",1130,1003,"04","02","CF33202","00.0","3394",2,"",20170101,20170331,50022.500000000007]
[null,"GUANAJUATO","11DPT0012W",100,"GOGI750427GM1","GOGI750427HMCMYS02","ISRAEL GOMEZ GAYTAN",2314,"8.0",1130,1003,"04","02","CF33206","00.0","14068",2,"",20170101,20170331,128381.28]
[null,"GUANAJUATO","11DPT0012W",100,"VEMJ831202MR4","VEMJ831202HGTRNS09","JESUS VERA MENDIETA",2314,"8.0",1130,1003,"04","02","S01201","00.0","2662",2,"",20170101,20170331,21959.4]
[null,"GUANAJUATO","11DPT0012W",100,"MUHA861028V94","MUHA861028HGTXRD02","JOSE ADAN MUÑOZ HERNANDEZ",2314,"8.0",1130,1003,"04","02","S01201","00.0","2516",2,"",20170101,20170331,35738.000000000007]
[null,"GUANAJUATO","11DPT0012W",100,"RAGT730306AI0","RAGT730306HGTNRR07","JOSE TRINIDAD RANGEL GUERRERO",2314,"8.0",1130,1003,"04","02","A01801","00.0","18845",2,"",20170101,20170331,52628.89]
[null,"GUANAJUATO","11DPT0012W",100,"SOPL831024T56","SOPL831024MGTTRR09","LAURA ANGELICA SOTO PEREZ",2314,"8.0",1130,1003,"04","02","CF33204","00.0","363",2,"",20170101,20170331,85639.040000000008]
[null,"GUANAJUATO","11DPT0012W",100,"COMI671203D76","COMI671203MGTNLR18","MA. IRAIS CONTRERAS MALDONADO",548,"8.0",1130,1003,"04","02","CF02105","00.0","12780",5,"",20170101,20170331,83101.77]
[null,"GUANAJUATO","11DPT0012W",100,"ROVR751027UW3","ROVR751027MGTBRS09","MARIA DEL ROSARIO ROBLES VARGAS",2314,"8.0",1130,1003,"04","02","A03202","00.0","10293",2,"",20170101,20170331,41184.100000000006]
[null,"GUANAJUATO","11DPT0012W",100,"OERM770419UD7","OERM770419HGTLSG03","MIGUEL ANGEL OLVERA RESENDIZ",2314,"8.0",1130,1003,"04","02","ED01201","00.0","11525",2,"",20170101,20170331,52103.73]
[null,"GUANAJUATO","11DPT0012W",100,"SUFR660516C81","SUFR660516MDFRLQ08","RAQUEL SUAREZ FALCON",2314,"8.0",1130,1003,"04","02","CF33204","00.0","10959",2,"",20170101,20170331,85624.12000000001]
[null,"GUANAJUATO","11DPT0012W",100,"VIRS630902SUA","VIRS630902HMNLYL09","SALVADOR VILLANUEVA REYNOSO",2314,"8.0",1130,1003,"04","02","CF33206","00.0","14252",2,"",20170101,20170331,121944.49]
[null,"GUANAJUATO","11DPT0012W",100,"VASS860602N16","VASS860602MQTLNN00","SANDRA YANET VALTIERRA SANCHEZ",2314,"8.0",1130,1003,"04","02","CF33206","00.0","14067",2,"",20170101,20170331,91688.560000000012]
[null,"GUANAJUATO","11DPT0012W",100,"ZABS850402N68","ZABS850402HGTMLR06","SERGIO LUIS ZAMUDIO BELTRAN",2314,"8.0",1130,1003,"04","02","CF04201","00.0","11168",2,"",20170101,20170331,48038.389999999992]
[null,"GUANAJUATO","11DPT0012W",100,"ZABS740117LZ8","ZABS740117MGRMLS00","SUSY ROCIO ZAMUDIO BALVUENA",2314,"8.0",1130,1003,"04","02","CF33204","00.0","2531",2,"",20170101,20170331,84832.46]
[null,"GUANAJUATO","11DPT0012W",100,"OELW670610C88","OELW670610HGTLDN06","WENCESLAO OLVERA LEDESMA",2314,"8.0",1130,1003,"04","02","CF18203","00.0","11932",2,"",20170101,20170331,50463.5]
[null,"GUANAJUATO","11DPT0012W",100,"GAGY700725MG2","GAGY700725MGTRNS04","YESENIA GRANADOS GONZALEZ",548,"8.0",1130,1003,"04","02","CF02102","00.0","12518",5,"",20170101,20170331,97882.310000000012]
[null,"GUANAJUATO","11DPT0010Y",100,"HEHA830216PP3","HEHA830216MGTRRL04","ALMA DELIA HERNANDEZ HERNANDEZ",2314,"8.0",1130,1003,"02","04","S01201","00.0","9224",2,"",20170101,20170331,39982.310000000005]
[null,"GUANAJUATO","11DPT0010Y",100,"GAGA8610104P3","GAGA861010HGTSRM03","AMOS EDUARDO GASCA GARCIA",2314,"8.0",1130,1003,"02","04","CF18201","00.0","9223",2,"",20170101,20170331,26973.630000000005]
[null,"GUANAJUATO","11DPT0010Y",100,"HELB7109192T6","HELB710919MGTRNT04","BEATRIZ HERNANDEZ LONA",2314,"8.0",1130,1003,"02","04","A03202","00.0","9213",2,"",20170101,20170331,47076.680000000008]
[null,"GUANAJUATO","11DPT0010Y",100,"EISB881118DD0","EISB881118MGTSPT05","BETSAIDA MAGDALENA ESPINOZA SEPULVEDA",2314,"8.0",1130,1003,"02","04","S01201","00.0","2513",2,"",20170101,20170331,35304.350000000006]
[null,"GUANAJUATO","11DPT0010Y",100,"GUMB860612B77","GUMB860612MGTTRL01","BLANCA EDITH GUTIERREZ MORENO",2314,"8.0",1130,1003,"02","04","CF19201","00.0","9226",2,"",20170101,20170331,48356.179999999993]
[null,"GUANAJUATO","11DPT0010Y",100,"SAOC521104BAA","SAOC521104HGTNLR02","CARLOS SANCHEZ OLIVA",2314,"8.0",1130,1003,"02","04","S01202","00.0","9227",2,"",20170101,20170331,59034.030000000006]
[null,"GUANAJUATO","11DPT0010Y",100,"TOOC610522FW3","TOOC610522MGTRRL02","CELIA TORRES ORIGEL",2314,"8.0",1130,1003,"02","04","CF33206","00.0","13683",2,"",20170101,20170331,89708.689999999988]
[null,"GUANAJUATO","11DPT0010Y",100,"GUPD810705I4A","GUPD810705HQTRDM04","DOMINGO DANIEL GUERRERO PADILLA",548,"8.0",1130,1003,"02","04","CF02104","00.0","12744",5,"",20170101,20170331,95731.82]
[null,"GUANAJUATO","11DPT0010Y",100,"ROTF640526L74","ROTF640526HGTDVL07","FELIPE RODRIGUEZ TOVAR",2314,"8.0",1130,1003,"02","04","CF19201","00.0","9217",2,"",20170101,20170331,44761.930000000008]
[null,"GUANAJUATO","11DPT0010Y",100,"HEVJ6006012YA","HEVL600601HGTRLZ00","J LUZ HERNANDEZ VELAZQUEZ",2314,"8.0",1130,1003,"02","04","CF21202","00.0","9232",2,"",20170101,20170331,44076.65]
[null,"GUANAJUATO","11DPT0010Y",100,"CORJ8905256I9","CORJ890525HGTRMR07","JORGE ARMANDO CORONA RAMIREZ",2314,"8.0",1130,1003,"02","04","CF19201","00.0","8513",2,"",20170101,20170331,43599.210000000006]
[null,"GUANAJUATO","11DPT0010Y",100,"FOCJ7406233X9","FOCJ740623MGTLLS01","JOSEFINA FLORES CALVA",2314,"8.0",1130,1003,"02","04","T08201","00.0","658",2,"",20170101,20170331,49077.51]
[null,"GUANAJUATO","11DPT0010Y",100,"RAGJ8207054L2","RAGJ820705HGTNMN05","JUAN ANTONIO RANGEL GOMEZ",2314,"8.0",1130,1003,"02","04","CF33203","00.0","9216",2,"",20170101,20170331,64003.25]
[null,"GUANAJUATO","11DPT0010Y",100,"HIMK800908LB0","HIMK800908HGTNNR04","KRISTIAN LUIS MANUEL HINOJOSA MONROY",2314,"8.0",1130,1003,"02","04","S01202","00.0","10600",2,"",20170101,20170331,47701.39]
[null,"GUANAJUATO","11DPT0010Y",100,"CUVL741004T6A","CUVL741004MGTRRR08","LAURA CRUZ VARGAS",2314,"8.0",1130,1003,"02","04","CF33206","00.0","13545",2,"",20170101,20170331,115696.86]
[null,"GUANAJUATO","11DPT0010Y",100,"PELL790204HW5","PELL790204MNTRRC05","LUCIA PEREZ LARA",2314,"8.0",1130,1003,"02","04","S01202","00.0","9228",2,"",20170101,20170331,37359.5]
[null,"GUANAJUATO","11DPT0010Y",100,"HETL941116C88","HETL941116HGTRRS09","LUIS RAUL HERNANDEZ TREJO",2314,"8.0",1130,1003,"02","04","CF18201","00.0","9229",2,"",20170101,20170331,25150.05]
[null,"GUANAJUATO","11DPT0010Y",100,"ROVL470314635","ROVL470314HGTXGS09","LUIS RUBEN ROA VEGA",2314,"8.0",1130,1003,"02","04","CF34202","00.0","2655",2,"",20170101,20170331,41442.94]
[null,"GUANAJUATO","11DPT0010Y",100,"LOZE620109973","LOZE620109MGTPMV07","MA. EVERILDA LOPEZ ZAMORA",2314,"8.0",1130,1003,"02","04","CF04201","00.0","9214",2,"",20170101,20170331,43814.65]
[null,"GUANAJUATO","11DPT0010Y",100,"MAHM7308144U2","MAHM730814MGTRRR07","MARCELA DEL PILAR MARTINEZ HERNANDEZ",2314,"8.0",1130,1003,"02","04","CF33206","00.0","14315",2,"",20170101,20170331,102396.77999999998]
[null,"GUANAJUATO","11DPT0010Y",100,"MADB860405V48","MADB860405MGTLZL02","MARIA BLANCA MALAGON DIAZ",2314,"8.0",1130,1003,"02","04","CF34202","00.0","12050",2,"",20170101,20170331,40332.200000000004]
[null,"GUANAJUATO","11DPT0010Y",100,"DUFC8505038R7","DUFC850503MGTRLR04","MARIA CRUZ DURAN FLORES",2314,"8.0",1130,1003,"02","04","CF21202","00.0","9210",2,"",20170101,20170331,44891.72]
[null,"GUANAJUATO","11DPT0010Y",100,"BAUM780104T8A","BAUM780104MGTRRC01","MICAELA BARCENAS URBINA",2314,"8.0",1130,1003,"02","04","S01201","00.0","2514",2,"",20170101,20170331,47737.180000000008]
[null,"GUANAJUATO","11DPT0010Y",100,"RARR710422AB6","RARR710422HGTMDM09","RAMON RAMIREZ RODRIGUEZ",2314,"8.0",1130,1003,"02","04","CF33204","00.0","10192",2,"",20170101,20170331,82479.920000000013]
[null,"GUANAJUATO","11DPT0010Y",100,"RABR820601BH9","RABR820601HGTMND08","RODOLFO OSVALDO RAMIREZ BUENO",2314,"8.0",1130,1003,"02","04","CF33206","00.0","13543",2,"",20170101,20170331,104756.78000000001]
[null,"GUANAJUATO","11DPT0010Y",100,"CUTR610723JC8","CUTR610723MGTLTS06","ROSA MARIA CUELLAR TETUAN",2314,"8.0",1130,1003,"02","04","CF33206","00.0","13542",2,"",20170101,20170331,154194.47999999998]
[null,"GUANAJUATO","11DPT0010Y",100,"MAVR700118TS6","MAVR700118HGTRRB08","RUBEN MARTINEZ VARELA",2314,"8.0",1130,1003,"02","04","CF33206","00.0","13251",2,"",20170101,20170331,135848.57999999999]
[null,"GUANAJUATO","11DPT0010Y",100,"OAGS860412RP6","OAGS860412MGTRTR05","SARA DEL ROSARIO ORRANTI GUTIERREZ",2314,"8.0",1130,1003,"02","04","S01202","00.0","9221",2,"",20170101,20170331,36539.290000000008]
[null,"GUANAJUATO","11DPT0005M",100,"RORA760321A25","RORA760321HGTDDL07","ALEXANDER DANIEL RODRIGUEZ RODRIGUEZ",548,"8.0",1130,1003,"00","72","CF02103","00.0","12617",5,"",20170101,20170331,35943.949999999997]
[null,"GUANAJUATO","11DPT0005M",100,"NIMA711025LJ1","NIMA711025MGTTRL07","ALICIA NIETO MARTINEZ",2314,"8.0",1130,1003,"00","72","A03202","00.0","4384",2,"",20170101,20170331,46829.270000000004]
[null,"GUANAJUATO","11DPT0005M",100,"GOAA770911HT1","GOAA770911MGTMLN09","ANA ROSA GOMEZ ALBA",2314,"8.0",1130,1003,"00","72","CF33204","00.0","4409",2,"",20170101,20170331,70141.33]
[null,"GUANAJUATO","11DPT0005M",100,"SIFB790507EM8","SIFB790507HGTRRR00","BRAULIO ISAAC SIERRA FERREYRA",2314,"8.0",1130,1003,"00","72","CF33206","00.0","13771",2,"",20170101,20170331,105419.51999999999]
[null,"GUANAJUATO","11DPT0005M",100,"VAGC6606185V3","VAGC660618MGTRRN09","CANDELARIA VARGAS GARCIA",2314,"8.0",1130,1003,"00","72","S01201","00.0","4413",2,"",20170101,20170331,33069.880000000005]
[null,"GUANAJUATO","11DPT0005M",100,"RORA760321A25","RORA760321HGTDDL07","DANIEL ALEXANDER RODRITUEZ RODRIGUEZ",548,"8.0",1130,1003,"00","72","CF02103","00.0","12617",5,"",20170101,20170331,61779.64]
[null,"GUANAJUATO","11DPT0005M",100,"COAD7908184B7","COAD790818MGTVRN00","DENY COVARRUBIAS ARREGUIN",2314,"8.0",1130,1003,"00","72","S01201","00.0","4398",2,"",20170101,20170331,33069.880000000005]
[null,"GUANAJUATO","11DPT0005M",100,"LELE610112FLA","LELE610112MGTMRL09","ELSA GUADALUPE LEMUS LIRA",2314,"8.0",1130,1003,"00","72","CF33206","00.0","14321",2,"",20170101,20170331,119518.83]
[null,"GUANAJUATO","11DPT0005M",100,"RORF650224FV1","RORF650224HDFDDR03","FERNANDO RODRIGUEZ RODRIGUEZ",2314,"8.0",1130,1003,"00","72","S01202","00.0","4395",2,"",20170101,20170331,38920.280000000006]
[null,"GUANAJUATO","11DPT0005M",100,"FIRG871015PB5","FIRG871015MGTGMB07","GABRIELA FIGUEROA RAMIREZ",2314,"8.0",1130,1003,"00","72","S01201","00.0","4419",2,"",20170101,20170331,35538.650000000009]
[null,"GUANAJUATO","11DPT0005M",100,"MEGG6410124T0","MEGG641012MGTDRL06","GLORIA MEDINA GARCIA",2314,"8.0",1130,1003,"00","72","A03202","00.0","4388",2,"",20170101,20170331,46665.41]
[null,"GUANAJUATO","11DPT0005M",100,"GULH680121BP6","GULH680121HDFTPR01","HORACIO GUTIERREZ LOPEZ",2314,"8.0",1130,1003,"00","72","CF34202","00.0","9195",2,"",20170101,20170331,36611.640000000007]
[null,"GUANAJUATO","11DPT0005M",100,"RAFA620326696","RAFA620326HGTMNN00","JOSE ANTONIO RAMIREZ FUENTES",2314,"8.0",1130,1003,"00","72","CF33206","00.0","13772",2,"",20170101,20170331,137393.51999999999]
[null,"GUANAJUATO","11DPT0005M",100,"JUMH681213NW0","JUMH681213HGTRGL00","JOSE HILARIO JUAREZ MAGAÑA",2314,"8.0",1130,1003,"00","72","CF33206","00.0","13770",2,"",20170101,20170331,132758.64000000001]
[null,"GUANAJUATO","11DPT0005M",100,"CAML640420FH8","CAML640420HDFSRS06","JOSE LUIS CASILLAS MIRANDA",2314,"8.0",1130,1003,"00","72","CF34201","00.0","4394",2,"",20170101,20170331,47584.32]
[null,"GUANAJUATO","11DPT0005M",100,"BAQL620315PN5","BAQL620315HGTRRS00","LUIS MANUEL BRAVO QUIROZ",2314,"8.0",1130,1003,"00","72","CF33206","00.0","13773",2,"",20170101,20170331,142112.20000000001]
[null,"GUANAJUATO","11DPT0005M",100,"MORM8011214B7","MORM801121HDFRMN03","MANUEL EFRAIN MORENO ROMERO",2314,"8.0",1130,1003,"00","72","S01201","00.0","4389",2,"",20170101,20170331,34936.000000000007]
[null,"GUANAJUATO","11DPT0005M",100,"PIAR680730PSA","PIAR680730MGTRGG01","MARIA REGINA PRIETO AGUILAR",2314,"8.0",1130,1003,"00","72","CF33204","00.0","2202",2,"",20170101,20170331,105727.4]
[null,"GUANAJUATO","11DPT0005M",100,"BASS600608U7A","BASS600608MGTRRL08","MARIA SOLEDAD ROSA LETICIA BRAVO SERRANO",2314,"8.0",1130,1003,"00","72","CF21202","00.0","4412",2,"",20170101,20170331,51868.05]
[null,"GUANAJUATO","11DPT0005M",100,"MEMM670521N64","MEMM670521MDFDJR03","MARTHA PATRICIA MEDEL MEJIA",2314,"8.0",1130,1003,"00","72","CF33202","00.0","4420",2,"",20170101,20170331,67893.2]
[null,"GUANAJUATO","11DPT0005M",100,"SABM631225F45","SABM631225HGTVRR06","MARTIN SALVADOR SAAVEDRA BRAVO",2314,"8.0",1130,1003,"00","72","S01202","00.0","4404",2,"",20170101,20170331,36764.839999999997]
[null,"GUANAJUATO","11DPT0005M",100,"PAGM5802105H5","PAGM580210HNTLRT06","MATIAS PALOMARES GARCIA",2314,"8.0",1130,1003,"00","72","S01202","00.0","4408",2,"",20170101,20170331,38509.170000000006]
[null,"GUANAJUATO","11DPT0005M",100,"PACM840215MT1","PACM840215MGTLRR00","MAURA ANGELICA PALOMINO CARREÑO",2314,"8.0",1130,1003,"00","72","S01201","00.0","4417",2,"",20170101,20170331,30243.170000000006]
[null,"GUANAJUATO","11DPT0005M",100,"MORM6501066X7","MORM650106HGTRSL00","MELCHOR BENITO MORENO ROSALES",2314,"8.0",1130,1003,"00","72","CF33206","00.0","14320",2,"",20170101,20170331,128741.03]
[null,"GUANAJUATO","11DPT0005M",100,"OUGM7012272G3","OUGM701227MGTRRN03","MONICA ORDUÑA GARCIA",2314,"8.0",1130,1003,"00","72","S01202","00.0","4418",2,"",20170101,20170331,38787]
[null,"GUANAJUATO","11DPT0005M",100,"VALN7508285U9","VALN750828MGTZMR00","NORMA ADRIANA VAZQUEZ LOMELI",2314,"8.0",1130,1003,"00","72","ED01201","00.0","4403",2,"",20170101,20170331,52025.01]
[null,"GUANAJUATO","11DPT0005M",100,"FIGP640907QP7","FIGP640907HGTGRD01","PEDRO FIGUEROA GARCIA",2314,"8.0",1130,1003,"00","72","CF19201","00.0","4426",2,"",20170101,20170331,51575.020000000004]
[null,"GUANAJUATO","11DPT0005M",100,"CARR771026IP3","CARR771026MDFRMS09","ROSANA CARRILLO RAMIREZ",548,"8.0",1130,1003,"00","72","CF02105","00.0","14597",5,"",20170101,20170331,83101.77]
[null,"GUANAJUATO","11DPT0005M",100,"SATR640529JN3","SATR640529HGTLRB08","RUBEN SALAZAR TORRES",2314,"8.0",1130,1003,"00","72","CF18203","00.0","4411",2,"",20170101,20170331,54294.680000000008]
[null,"GUANAJUATO","11DPT0005M",100,"CAGR660928KD7","CAGR660928MGTSNB07","RUBICELIA CASTRO GONZALEZ",2314,"8.0",1130,1003,"00","72","CF33204","00.0","7424",2,"",20170101,20170331,92916.169999999984]
[null,"GUANAJUATO","11DPT0005M",100,"CANS730714K3A","CANS730714MGTSTR04","SARA CASTILLO NIETO",2314,"8.0",1130,1003,"00","72","CF04201","00.0","4386",2,"",20170101,20170331,47964.36]
[null,"GUANAJUATO","11DPT0005M",100,"HECS621213HZ5","HECS621213HGTRLR02","SERGIO HERNANDEZ CALDERON",2314,"8.0",1130,1003,"00","72","CF18203","00.0","4411",2,"",20170101,20170331,30101.030000000002]
[null,"GUANAJUATO","11DPT0005M",100,"NIMT691014GT1","NIMT691014MGTTRR05","TERESITA NIETO MARTINEZ",2314,"8.0",1130,1003,"00","72","S01202","00.0","4415",2,"",20170101,20170331,41686.199999999997]
[null,"GUANAJUATO","11DPT0005M",100,"VACY6607278R7","VACY660727MGTRSL08","YOLANDA VARGAS CASTILLO",2314,"8.0",1130,1003,"00","72","CF33204","00.0","4428",2,"",20170101,20170331,146846.39000000001]
[null,"GUANAJUATO","11APT0001T",100,"DIAL510311BH6","DIXA510311HGTSXL09","ALBERTO DE LA LUZ SOCORRO DIOSDADO .",548,"8.0",1130,1003,"00","00","CF11100","00.0","10304",5,"",20170101,20170331,254636.3]
[null,"GUANAJUATO","11APT0001T",100,"CALA7006204L0","CALA700620MGTMPL09","ALEJANDRA CAMACHO LOPEZ",2314,"8.0",1130,1003,"00","00","CF33204","00.0","11710",2,"",20170101,20170331,77286]
[null,"GUANAJUATO","11APT0001T",100,"RESA730203TA5","RESA730203MGTYNN04","ANA CELIA REYNOSO SANCHEZ",548,"8.0",1130,1003,"00","00","CF02100","00.0","12458",5,"",20170101,20170331,120061.07]
[null,"GUANAJUATO","11APT0001T",100,"CESA870418K76","CESA870418MGTRMN08","ANA GABRIELA CERVERA SAMANO",2314,"8.0",1130,1003,"00","00","CF34201","00.0","8065",2,"",20170101,20170331,49263.259999999995]
[null,"GUANAJUATO","11APT0001T",100,"HEGG810820ID3","HEGG810820HGTRMR07","GERARDO HERNANDEZ GOMEZ",2314,"8.0",1130,1003,"00","00","CF33204","00.0","3181",2,"",20170101,20170331,23431.65]
[null,"GUANAJUATO","11APT0001T",100,"OING5906128T6","OING590612HGTRCS02","GUSTAVO ORTIZ NICASIO",2314,"8.0",1130,1003,"00","00","CF18203","00.0","7719",2,"",20170101,20170331,51427.89]
[null,"GUANAJUATO","11APT0001T",100,"LUCH751109S53","LUCH751109HGTVNG03","HUGO ENRIQUE LUEVANO CONTRERAS",548,"8.0",1130,1003,"00","00","CF02105","00.0","14596",5,"",20170101,20170331,83101.77]
[null,"GUANAJUATO","11APT0001T",100,"AOGI790809G38","AOGI790809MGTLRM04","IMELDA SUSANA ALONSO GARCIA",2314,"8.0",1130,1003,"00","00","CF33204","00.0","4416",2,"",20170101,20170331,81695.72]
[null,"GUANAJUATO","11APT0001T",100,"PELI680925LM6","PELI680925MGTDPV03","IVONNE YOLANDA PEDROZA LOPEZ",2314,"8.0",1130,1003,"00","00","CF33206","00.0","10303",2,"",20170101,20170331,132758.64000000001]
[null,"GUANAJUATO","11APT0001T",100,"BACJ850923PQ8","BACJ850923HGTRRS05","JESUS OMAR BARCENAS CORNEJO",548,"8.0",1130,1003,"00","00","CF02105","00.0","14598",5,"",20170101,20170331,26272.400000000001]
[null,"GUANAJUATO","11APT0001T",100,"LERD770827E23","LERD770827HGTNDM00","JOSE DOMINGO DE LEON RODRIGUEZ",548,"8.0",1130,1003,"00","00","CF01601","00.0","11084",5,"",20170101,20170331,95806.31]
[null,"GUANAJUATO","11APT0001T",100,"AECL710621SE4","AECL710621HGTRRS02","JOSE LUIS ARELLANO CRUZ",2314,"8.0",1130,1003,"00","00","A03202","00.0","10301",2,"",20170101,20170331,40340.559999999998]
[null,"GUANAJUATO","11APT0001T",100,"CAJU780116N75","CAXJ780116HGTMXN05","JUAN JOSE CAMACHO",2314,"8.0",1130,1003,"00","00","CF33206","00.0","14140",2,"",20170101,20170331,102396.77999999998]
[null,"GUANAJUATO","11APT0001T",100,"QUZJ6303282J5","QUZJ630328HSRLNN05","JUAN QUILES ZUNO",2314,"8.0",1130,1003,"00","00","A01801","00.0","18844",2,"",20170101,20170331,53636.31]
[null,"GUANAJUATO","11APT0001T",100,"MAOJ7405168FA","MAOJ740516MGTRCN05","JUANA MARTINEZ OCHOA",2314,"8.0",1130,1003,"00","00","CF33206","00.0","14141",2,"",20170101,20170331,114487.80000000002]
[null,"GUANAJUATO","11APT0001T",100,"PUAJ821120LU8","PUAJ821120MJCGLN05","JUANA PUGA ALDANA",2314,"8.0",1130,1003,"00","00","S01202","00.0","2636",2,"",20170101,20170331,38558.239999999998]
[null,"GUANAJUATO","11APT0001T",100,"SAAK880407FL7","SAAK880407MJCNNR03","KARLA ANGELINA SANDOVAL DE ANDA",548,"8.0",1130,1003,"00","00","CF02105","00.0","12830",5,"",20170101,20170331,83101.77]
[null,"GUANAJUATO","11APT0001T",100,"AIMK880805R10","AIMK880805MGTRXR05","KARLA GABRIELA ARIAS MUÑOZ",2314,"8.0",1130,1003,"00","00","CF33206","00.0","14142",2,"",20170101,20170331,99038.17]
[null,"GUANAJUATO","11APT0001T",100,"RAEL8409015U2","RAEL840901MGTMSR07","LAURA PATRICIA RAMOS ESTRADA",2314,"8.0",1130,1003,"00","00","CF33206","00.0","10307",2,"",20170101,20170331,110662.90000000001]
[null,"GUANAJUATO","11APT0001T",100,"MESL860213877","MESL860213MGTNNR09","LOURDES PAULINA MENDOZA SANCHEZ",2314,"8.0",1130,1003,"00","00","CF33204","00.0","2660",2,"",20170101,20170331,69959.000000000015]
[null,"GUANAJUATO","11APT0001T",100,"GOML710913T66","GOML710913MGTNXC08","LUCIA GONZALEZ MUÑOZ",548,"8.0",1130,1003,"00","00","CF02100","00.0","12460",5,"",20170101,20170331,120061.07]
[null,"GUANAJUATO","11APT0001T",100,"PEGL590326TB4","PEGL590326MGTRMZ05","LUZ ELENA PERALES GOMEZ",2314,"8.0",1130,1003,"00","00","CF33203","00.0","2575",2,"",20170101,20170331,46475.360000000008]
[null,"GUANAJUATO","11APT0001T",100,"SAHE741012DCA","SAHE741012MGTNRS04","MA ESTHER SANCHEZ HERNANDEZ",548,"8.0",1130,1003,"00","00","CF01601","00.0","11097",5,"",20170101,20170331,95806.31]
[null,"GUANAJUATO","11APT0001T",100,"SAMN650727TS7","SAMN650727MGTNJT03","MA NATALIA SANCHEZ MOJICA",2314,"8.0",1130,1003,"00","00","S01201","00.0","9230",2,"",20170101,20170331,36818.69]
[null,"GUANAJUATO","11APT0001T",100,"VACR780505180","VACR780505MGTRHS07","MARIA DEL ROSARIO VARGAS CHAVEZ",548,"8.0",1130,1003,"00","00","CF01601","00.0","11095",5,"",20170101,20170331,95806.31]
[null,"GUANAJUATO","11APT0001T",100,"MOGM581228P96","MOGM581228MGTRNR09","MARTHA DEL CARMEN MORENO GONZALEZ",2314,"8.0",1130,1003,"00","00","A01801","00.0","18843",2,"",20170101,20170331,52628.89]
[null,"GUANAJUATO","11APT0001T",100,"PATR7101059J2","PATR710105MGTCRS08","ROSA ADRIANA MARCELA PACHECO TORRES",548,"8.0",1130,1003,"00","00","CF02105","00.0","14598",5,"",20170101,20170331,52544.800000000003]
[null,"GUANAJUATO","11APT0001T",100,"VAGS770812TH3","VAGS770812HGTLRM07","SAMUEL VALLEJO GUERRERO",2314,"8.0",1130,1003,"00","00","CF33204","00.0","4390",2,"",20170101,20170331,69149.000000000015]
[null,"GUANAJUATO","11APT0001T",100,"GAPS690711PT2","GAPS690711MGTRRR00","SARA GISELA GARCIA PEREZ",548,"8.0",1130,1003,"00","00","CF02105","00.0","14599",5,"",20170101,20170331,83101.77]
[null,"GUANAJUATO","11APT0001T",100,"HEOS630818TG4","HEOS630818MDFRRN00","SONIA GUADALUPE HERNANDEZ OROZCO",2314,"8.0",1130,1003,"00","00","CF33206","00.0","13318",2,"",20170101,20170331,123354.5]
[null,"GUANAJUATO","11APT0001T",100,"GAGV930611G79","GAGV930611HGTRMC04","VICTOR HUGO GARCIA GOMEZ",2314,"8.0",1130,1003,"00","00","S01201","00.0","2502",2,"",20170101,20170331,31033.110000000004]
[null,"GUANAJUATO","11APT0001T",100,"GOAV860422EK6","GOAV860422HGTNLC02","VICTOR ISRAEL GONZALEZ ALCANTAR",2314,"8.0",1130,1003,"00","00","CF33206","00.0","14322",2,"",20170101,20170331,89708.689999999988]
[null,"GUANAJUATO","11DPT0001Q",100,"AOOS720925113","AOOS720925MGTBRN08","SANDRA ABOYTES OROZCO",111,30,"1130","1003","00",28,"0000001",30,"280001",3,"",20170101,20170331,30903.88]
[null,"GUANAJUATO","11DPT0001Q",100,"AAVB660401UL2","AAVB660401MDFLNL01","BLANCA IVETTE ALVAREZ DEL CASTILLO VENTRE",111,20,"1130","1003","00",28,"0000001",20,"280002",3,"",20170101,20170331,27664.75]
[null,"GUANAJUATO","11DPT0001Q",100,"AOOC650822A32","AOOC650822MGTRJR02","MA CRISTINA ARROYO OJEDA",111,20,"1130","1003","00",28,"0000001",20,"280005",3,"",20170101,20170331,22246.98]
[null,"GUANAJUATO","11DPT0001Q",100,"BESJ810412R10","BESJ810412HGTLNS06","JESUS EDUARDO BELMAN SANTILLAN",111,23,"1130","1003","00",28,"0000001",23,"280007",3,"",20170101,20170331,24845.05]
[null,"GUANAJUATO","11DPT0001Q",100,"BOSC820326RI2","BOSC820326HGTLRR09","CARLOS MARTIN BOLAÑOS SERVIN",111,25,"1130","1003","00",28,"0000001",25,"280008",3,"",20170101,20170331,21685.96]
[null,"GUANAJUATO","11DPT0001Q",100,"CAAL690628UQA","CAAL690628MGTRLT08","MARIA LETICIA CARDENAS ALMANZA",111,20,"1130","1003","00",28,"0000001",20,"280009",3,"",20170101,20170331,22546.77]
[null,"GUANAJUATO","11DPT0001Q",100,"CARL560630I41","CARL560630HGTSVS09","JOSE LUIS CASTRO RIVAS",111,26,"1130","1003","00",28,"0000001",26,"280010",3,"",20170101,20170331,22015.21]
[null,"GUANAJUATO","11DPT0001Q",100,"CAPJ680119DJ7","CAPA680119HGTZTN01","J. ANDRES CAZARES PATIÑO",111,15,"1130","1003","00",28,"0000001",15,"280011",3,"",20170101,20170331,5661.52]
[null,"GUANAJUATO","11DPT0001Q",100,"CEGE7106304G8","CEGE710630MGTBML09","MA. ELIZABETH CEBALLOS GOMEZ",111,25,"1130","1003","00",28,"0000001",25,"280012",3,"",20170101,20170331,12812.92]
[null,"GUANAJUATO","11DPT0001Q",100,"CAVA820322S74","CAVA820322HDFHRB06","ABRAHAM CHAVEZ VARELA",111,25,"1130","1003","00",28,"0000001",25,"280013",3,"",20170101,20170331,23871.1]
[null,"GUANAJUATO","11DPT0001Q",100,"CIGM510313HX4","CIGM510313HVZSRG08","MIGUEL ANGEL CISNEROS GARCIA",111,25,"1130","1003","00",28,"0000001",25,"280014",3,"",20170101,20170331,24513.98]
[null,"GUANAJUATO","11DPT0001Q",100,"COMM610831NKA","COMM610831HDFRRG06","MIGUEL CORTES MORALES",111,29,"1130","1003","00",28,"0000001",29,"280016",3,"",20170101,20170331,21119.46]
[null,"GUANAJUATO","11DPT0001Q",100,"DEPT800907TBA","DEPT800907MGTRDR04","MARIA TERESA DERRAMADERO PADILLA",111,30,"1130","1003","00",28,"0000001",30,"280017",3,"",20170101,20170331,25224.879999999997]
[null,"GUANAJUATO","11DPT0001Q",100,"EICS7010205K2","EICS701020MMNNRR06","SERAFINA ENRIQUEZ CORDOVA",111,20,"1130","1003","00",28,"0000001",20,"280019",3,"",20170101,20170331,31105.27]
[null,"GUANAJUATO","11DPT0001Q",100,"EASG800616J20","EASG800616HGTSSR09","GERARDO ESTRADA SESENTO",111,25,"1130","1003","00",28,"0000001",25,"280021",3,"",20170101,20170331,31448.890000000003]
[null,"GUANAJUATO","11DPT0001Q",100,"GAFF820410AV4","GAFF820410HGTRRR01","FERNANDO GARCIA FRIAS",111,25,"1130","1003","00",28,"0000001",25,"280024",3,"",20170101,20170331,18941.71]
[null,"GUANAJUATO","11DPT0001Q",100,"GAMC720506I97","GAMC720506MGTRRN08","CONSTANZA GARCIA MARTINEZ",111,20,"1130","1003","00",28,"0000001",20,"280025",3,"",20170101,20170331,28226.69]
[null,"GUANAJUATO","11DPT0001Q",100,"GACS730701E50","GACS730701MGTYDN08","SANDRA KARINA GAYTAN CADENA",111,25,"1130","1003","00",28,"0000001",25,"280026",3,"",20170101,20170331,34340.699999999997]
[null,"GUANAJUATO","11DPT0001Q",100,"GODA691116ALA","GODA691116HDFMZL07","ALEJANDRO GOMEZ DIAZ",111,25,"1130","1003","00",28,"0000001",25,"280029",3,"",20170101,20170331,18146.330000000002]
[null,"GUANAJUATO","11DPT0001Q",100,"GOLG8308137R7","GOLG830813HSPNPB08","GABRIEL HUMBERTO GONZALEZ LOPEZ",111,30,"1130","1003","00",28,"0000001",30,"280031",3,"",20170101,20170331,18929.38]
[null,"GUANAJUATO","11DPT0001Q",100,"GOPE721215MA1","GOPE721215HGTNSD18","EDISON OSWALDO GONZALEZ PESCADOR",111,20,"1130","1003","00",28,"0000001",20,"280032",3,"",20170101,20170331,19664.52]
[null,"GUANAJUATO","11DPT0001Q",100,"GAUR8010189E2","GAUR801018MGTRRS03","MARIA DEL ROSARIO GRANADOS URIBE",111,24,"1130","1003","00",28,"0000001",24,"280034",3,"",20170101,20170331,29232.559999999998]
[null,"GUANAJUATO","11DPT0001Q",100,"GULA760327G74","GULA760327MCSLPN05","ANA CELIA GUILLEN LOPEZ",111,21,"1130","1003","00",28,"0000001",21,"280035",3,"",20170101,20170331,24479.040000000001]
[null,"GUANAJUATO","11DPT0001Q",100,"GUCM630109EJ1","GUCM630109MGTTSR00","MARIA MARTINA MARGARITA GUTIERREZ CASTRO",111,25,"1130","1003","00",28,"0000001",25,"280036",3,"",20170101,20170331,32175.230000000003]
[null,"GUANAJUATO","11DPT0001Q",100,"GUCA621009A88","GUCA621009MGTTHR00","ARACELI GUTIERREZ CHACON",111,20,"1130","1003","00",28,"0000001",20,"280037",3,"",20170101,20170331,19117.32]
[null,"GUANAJUATO","11DPT0001Q",100,"GUJE600723CI3","GUJE600723HGTZMR03","ERNESTO GUZMAN JIMENEZ",111,28,"1130","1003","00",28,"0000001",28,"280038",3,"",20170101,20170331,36480.6]
[null,"GUANAJUATO","11DPT0001Q",100,"HEPM8111294E4","HEPM811129HGTRRG03","MIGUEL ANGEL HERNANDEZ PEREZ",111,26,"1130","1003","00",28,"0000001",26,"280040",3,"",20170101,20170331,29612.660000000003]
[null,"GUANAJUATO","11DPT0001Q",100,"JISS660630UT8","JISS660630HGTMNR01","SERGIO JIMENEZ SANCHEZ",111,21,"1130","1003","00",28,"0000001",21,"280042",3,"",20170101,20170331,20591.37]
[null,"GUANAJUATO","11DPT0001Q",100,"LAML7310086Z6","LAML731008MGTRNR00","LAURA LARA MANCERA",111,20,"1130","1003","00",28,"0000001",20,"280044",3,"",20170101,20170331,31105.27]
[null,"GUANAJUATO","11DPT0001Q",100,"MAMA770820UT0","MAMA770820MGTRRN06","ANA LILIA MARTINEZ MARTINEZ",111,28,"1130","1003","00",28,"0000001",28,"280050",3,"",20170101,20170331,26455.980000000003]
[null,"GUANAJUATO","11DPT0001Q",100,"MARR660925MG9","MARR660925MGTRDC04","ROCIO MARTINEZ RODRIGUEZ",111,28,"1130","1003","00",28,"0000001",28,"280052",3,"",20170101,20170331,22576.22]
[null,"GUANAJUATO","11DPT0001Q",100,"MASJ651012DZ4","MASJ651012HVZRNN09","JUAN CARLOS MARTINEZ SANTOS",111,20,"1130","1003","00",28,"0000001",20,"280053",3,"",20170101,20170331,19633.239999999998]
[null,"GUANAJUATO","11DPT0001Q",100,"MOHD5903208E0","MOHD590320HMCCRL05","JOSE DOLORES GUADALUPE MOCTEZUMA HERNANDEZ",111,25,"1130","1003","00",28,"0000001",25,"280054",3,"",20170101,20170331,22083.26]
[null,"GUANAJUATO","11DPT0001Q",100,"MOPL8106219G5","MOPL810621MGTRLD07","LIDIA MORENO PALOALTO",111,24,"1130","1003","00",28,"0000001",24,"280055",3,"",20170101,20170331,21898.410000000003]
[null,"GUANAJUATO","11DPT0001Q",100,"OIBM740215HY9","OIBM740215MGTRRR07","MIRIAM ORTIZ BARROSO",111,28,"1130","1003","00",28,"0000001",28,"280059",3,"",20170101,20170331,35537.93]
[null,"GUANAJUATO","11DPT0001Q",100,"PAGJ820614HB3","PAGJ820614MGTLRN07","JUANA ADRIANA PALOALTO GARCIA",111,24,"1130","1003","00",28,"0000001",24,"280061",3,"",20170101,20170331,17183.21]
[null,"GUANAJUATO","11DPT0001Q",100,"PEGR811217KS9","PEGR811217HGTRRC00","RICARDO PEREZ GARCIA",111,16,"1130","1003","00",28,"0000001",16,"280062",3,"",20170101,20170331,15554]
[null,"GUANAJUATO","11DPT0001Q",100,"RAGM860115N6A","RAGM860115HGTMRR00","MAURO RAMIREZ GARCIA",111,30,"1130","1003","00",28,"0000001",30,"280063",3,"",20170101,20170331,19619.25]
[null,"GUANAJUATO","11DPT0001Q",100,"RAGL820420UF7","RAGL820420MGTMMR03","LOURDES MIRELLA RAMOS GOMEZ",111,25,"1130","1003","00",28,"0000001",25,"280067",3,"",20170101,20170331,28354.550000000003]
[null,"GUANAJUATO","11DPT0001Q",100,"RALG600418P69","RALG600418MGTMPD09","MARIA GUADALUPE RAMOS LOPEZ",111,20,"1130","1003","00",28,"0000001",20,"280068",3,"",20170101,20170331,31105.27]
[null,"GUANAJUATO","11DPT0001Q",100,"RECT770406EE9","RECT770406MMNNHR04","TERESITA DEL NIÑO JESUS RENTERIA CHAVEZ",111,25,"1130","1003","00",28,"0000001",25,"280069",3,"",20170101,20170331,20827.04]
[null,"GUANAJUATO","11DPT0001Q",100,"RICM6610087I3","RICM661008MGTSSR09","MARIBEL RIOS CASTRO",111,25,"1130","1003","00",28,"0000001",25,"280070",3,"",20170101,20170331,19945.030000000002]
[null,"GUANAJUATO","11DPT0001Q",100,"ROSC730321AY9","ROSC730321HGTSLR07","JOSE CRUZ ROSALES SOLORZANO",111,19,"1130","1003","00",28,"0000001",19,"280076",3,"",20170101,20170331,12667.1]
[null,"GUANAJUATO","11DPT0001Q",100,"SACJ630711ERA","SACJ630711MGTNRN08","JUANA PATRICIA SANCHEZ CORNEJO",111,20,"1130","1003","00",28,"0000001",20,"280077",3,"",20170101,20170331,22762.3]
[null,"GUANAJUATO","11DPT0001Q",100,"SAGB671230SK2","SAGB671230MDFNRL01","BLANCA ELBA SANCHEZ GARCIA",111,21,"1130","1003","00",28,"0000001",21,"280078",3,"",20170101,20170331,17998.09]
[null,"GUANAJUATO","11DPT0001Q",100,"TOOL570825A45","TOOL570825HOCRRS04","LUIS FIDEL TORRES ORDAZ",111,4,"1130","1003","00",28,"0000001",4,"280084",3,"",20170101,20170331,7591.9400000000005]
[null,"GUANAJUATO","11DPT0001Q",100,"VEGC620316675","VEGC620316MJCLTR03","CRISTINA VELASCO GUTIERREZ",111,18,"1130","1003","00",28,"0000001",18,"280086",3,"",20170101,20170331,15068.66]
[null,"GUANAJUATO","11DPT0001Q",100,"VIRE830228NR9","VIRE830228HGTLDD01","EDUARDO VILLAFAÑA RODRIGUEZ",111,20,"1130","1003","00",28,"0000001",20,"280088",3,"",20170101,20170331,11400.380000000001]
[null,"GUANAJUATO","11DPT0001Q",100,"CAEL691012SG8","CAEL691012MDFRST01","LETICIA CARMONA ESPINOSA",111,30,"1130","1003","00",28,"0000001",30,"280096",3,"",20170101,20170331,15707.160000000002]
[null,"GUANAJUATO","11DPT0001Q",100,"LOGJ711211E25","LOGJ711211HGTMVN07","JUAN LOMAS GUEVARA",111,22,"1130","1003","00",28,"0000001",22,"280098",3,"",20170101,20170331,25010.6]
[null,"GUANAJUATO","11DPT0001Q",100,"ROVD750821HSA","ROVD750821MMNCLM06","DAMARY BERENICE ROCHA VILLAGOMEZ",111,18,"1130","1003","00",28,"0000001",18,"280111",3,"",20170101,20170331,13221.529999999999]
[null,"GUANAJUATO","11DPT0001Q",100,"MACM811125B26","MACM811125MGTSRR00","MARLENE SELENE MASCOTTE CRUZ",111,17,"1130","1003","00",28,"0000001",17,"280115",3,"",20170101,20170331,17775.510000000002]
[null,"GUANAJUATO","11DPT0001Q",100,"COVE740314GR2","COVE740314HGTRZN07","ENRIQUE CORTEZ VAZQUEZ",111,16,"1130","1003","00",28,"0000001",16,"280132",3,"",20170101,20170331,10872.470000000001]
[null,"GUANAJUATO","11DPT0001Q",100,"TUMJ870625262","TUMJ870625HGTLLF00","JAFET GASSEN TULA MALDONADO",111,17,"1130","1003","00",28,"0000001",17,"280136",3,"",20170101,20170331,13433.02]
[null,"GUANAJUATO","11DPT0001Q",100,"RORM810208UU3","RORM810208HGTCCR04","MARTIN RAFAEL ROCHA RICO",111,20,"1130","1003","00",28,"0000001",20,"280145",3,"",20170101,20170331,17539.830000000002]
[null,"GUANAJUATO","11DPT0001Q",100,"RORL820606UU0","RORL820606HGTDBS06","LUIS FERNANDO RODRIGUEZ ROBLES",111,10,"1130","1003","00",28,"0000001",10,"280149",3,"",20170101,20170331,9489.64]
[null,"GUANAJUATO","11DPT0001Q",100,"JIEC831030A73","JIEC831030MGTMSR07","MARIA CRISTHIAN JIMENEZ ESQUEDA",111,26,"1130","1003","00",28,"0000001",26,"280156",3,"",20170101,20170331,25304.719999999998]
[null,"GUANAJUATO","11DPT0001Q",100,"CABD840721MI3","CABD840721HGTSNN09","DANIEL CASIQUE BUENAVISTA",111,14,"1130","1003","00",28,"0000001",14,"280159",3,"",20170101,20170331,9074.83]
[null,"GUANAJUATO","11DPT0001Q",100,"CARJ7608215KA","CARJ760821HTLRDN05","JOSE JUAN CARRILLO RODRIGUEZ",111,18,"1130","1003","00",28,"0000001",18,"280160",3,"",20170101,20170331,12426.7]
[null,"GUANAJUATO","11DPT0001Q",100,"CAOL581027513","CAOL581027HGTMLS01","JOSE LUIS CAMPOS OLALDE",111,29,"1130","1003","00",28,"0000001",29,"280179",3,"",20170101,20170331,23095.350000000002]
[null,"GUANAJUATO","11DPT0001Q",100,"FEHE800724TQ5","FEHE800724HGTRRD06","EDUARDO FERNANDEZ HERNANDEZ",111,12,"1130","1003","00",28,"0000001",12,"280180",3,"",20170101,20170331,12784.920000000002]
[null,"GUANAJUATO","11DPT0001Q",100,"HEAM501110PP1","HEAM501110MDFRRN05","MINERVA HERNANDEZ ARMENDARIZ",111,15,"1130","1003","00",28,"0000001",15,"280181",3,"",20170101,20170331,19000.650000000001]
[null,"GUANAJUATO","11DPT0001Q",100,"LOJR731229QW3","LOJR731229HGTPRC05","RICARDO LOPEZ JUAREZ",111,25,"1130","1003","00",28,"0000001",25,"280182",3,"",20170101,20170331,25216.35]
[null,"GUANAJUATO","11DPT0001Q",100,"MEHE811224IH7","MEHE811224HGTNRM08","EMMANUEL MENDOZA HERNANDEZ",111,20,"1130","1003","00",28,"0000001",20,"280184",3,"",20170101,20170331,19471.97]
[null,"GUANAJUATO","11DPT0001Q",100,"NUHG820619NB2","NUHG820619MGTXRR08","GRACIELA GUADALUPE NUÑEZ HERNANDEZ",111,15,"1130","1003","00",28,"0000001",15,"280185",3,"",20170101,20170331,15936.970000000001]
[null,"GUANAJUATO","11DPT0001Q",100,"PIZM740723DV9","PIZM740723MGTZMR06","MIRYAM PIZANO ZAMORA",111,15,"1130","1003","00",28,"0000001",15,"280186",3,"",20170101,20170331,18352.559999999998]
[null,"GUANAJUATO","11DPT0001Q",100,"ROCJ841011870","ROCJ841011MDFDSS04","MARIA DE JESUS RODRIGUEZ CASTRO",111,12,"1130","1003","00",28,"0000001",12,"280187",3,"",20170101,20170331,6451.37]
[null,"GUANAJUATO","11DPT0001Q",100,"ZAVJ481005MS5","ZAVJ481005HGTVLS09","J. JESUS ZAVALA VILLAGOMEZ",111,17,"1130","1003","00",28,"0000001",17,"280188",3,"",20170101,20170331,11135.26]
[null,"GUANAJUATO","11DPT0001Q",100,"SAAF940310IF2","SAAF940310HGTNCR07","FRANCISCO JAVIER SANCHEZ ACOSTA",111,13,"1130","1003","00",28,"0000001",13,"280192",3,"",20170101,20170331,7046.43]
[null,"GUANAJUATO","11DPT0002P",100,"AOVI670402NJA","AOVI670402HGTCZS07","ISMAEL ACOSTA VAZQUEZ",111,25,"1130","1003","00","29","0000001",25,"290001",3,"",20170101,20170331,24601.940000000002]
[null,"GUANAJUATO","11DPT0002P",100,"AUGJ550312251","AUGJ550312HGTGTR04","JORGE AGUILERA GUTIERREZ",111,32,"1130","1003","00","29","0000001",32,"290002",3,"",20170101,20170331,32261.320000000003]
[null,"GUANAJUATO","11DPT0002P",100,"AAGC731126M29","AAGC731126HDFLNN07","CONRRADO ARTURO ALVAREZ GONZALEZ",111,12,"1130","1003","00","29","0000001",12,"290005",3,"",20170101,20170331,4646.1200000000008]
[null,"GUANAJUATO","11DPT0002P",100,"CARS710511U36","CARS710511HGTMNR10","SERGIO ARTURO CAMPOS RANGEL",111,15,"1130","1003","00","29","0000001",15,"290006",3,"",20170101,20170331,14316.25]
[null,"GUANAJUATO","11DPT0002P",100,"CAEL721019IZ9","CAEL721019MGTSLL08","LILIA ISELA CASTILLO ELIZARRARAZ",111,22,"1130","1003","00","29","0000001",22,"290009",3,"",20170101,20170331,25540.33]
[null,"GUANAJUATO","11DPT0002P",100,"CAMH790325MK2","CAMH790325HGTSSC09","HECTOR CASTRO MOSQUEDA",111,21,"1130","1003","00","29","0000001",21,"290010",3,"",20170101,20170331,23548.420000000002]
[null,"GUANAJUATO","11DPT0002P",100,"CECE690308KZ9","CECE690308HGTRRL05","ELIAS CERVANTES CRUZ",111,15,"1130","1003","00","29","0000001",15,"290011",3,"",20170101,20170331,15368.73]
[null,"GUANAJUATO","11DPT0002P",100,"CAHJ750812FB7","CAHJ750812HGTHRR09","JORGE ALEJANDRO CHAGOYA HERNANDEZ",111,12,"1130","1003","00","29","0000001",12,"290012",3,"",20170101,20170331,14637.3]
[null,"GUANAJUATO","11DPT0002P",100,"CILB730402N95","CILB730402MGTSPL08","BLANCA ESTELA GUILLERMINA CISNEROS LOPEZ",111,30,"1130","1003","00","29","0000001",30,"290014",3,"",20170101,20170331,31121.460000000003]
[null,"GUANAJUATO","11DPT0002P",100,"CILG720124JZ9","CILG720124MGTSPD05","MA GUADALUPE CISNEROS LOPEZ",111,29,"1130","1003","00","29","0000001",29,"290015",3,"",20170101,20170331,31846.559999999998]
[null,"GUANAJUATO","11DPT0002P",100,"COAA820127CJ8","COAA820127MGTRYN00","ANA ERICKA CORRALES AYALA",111,22,"1130","1003","00","29","0000001",22,"290016",3,"",20170101,20170331,15592.199999999999]
[null,"GUANAJUATO","11DPT0002P",100,"COCJ790301RG5","COCJ790301HGTRRN06","JOSE JUAN CORRALES CORONA",111,20,"1130","1003","00","29","0000001",20,"290017",3,"",20170101,20170331,14466.52]
[null,"GUANAJUATO","11DPT0002P",100,"COMI550105UFA","COMI550105MVZRRS01","MARIA ISABEL CORTES MARTINEZ",111,20,"1130","1003","00","29","0000001",20,"290018",3,"",20170101,20170331,20960.2]
[null,"GUANAJUATO","11DPT0002P",100,"CUTP651030E94","CUTP651030HGTRRB03","PABLO CRUZ TORREZ",111,15,"1130","1003","00","29","0000001",15,"290019",3,"",20170101,20170331,18234.73]
[null,"GUANAJUATO","11DPT0002P",100,"DICI670401TA1","DICI670401MGTZMR00","IRENE DIAZ CAMPOS",111,15,"1130","1003","00","29","0000001",15,"290021",3,"",20170101,20170331,3439.13]
[null,"GUANAJUATO","11DPT0002P",100,"DIJT521003PE9","DIJT521003MVZZCR03","MARIA TERESITA DIAZ JACOME",111,28,"1130","1003","00","29","0000001",28,"290023",3,"",20170101,20170331,34773.67]
[null,"GUANAJUATO","11DPT0002P",100,"DOMN670802UR9","DOMN670802MGTMNT03","NATALIA DE LOS ANGELES DOMINGUEZ MANZANO",111,4,"1130","1003","00","29","0000001",4,"290024",3,"",20170101,20170331,1324.33]
[null,"GUANAJUATO","11DPT0002P",100,"EIVJ610404DLA","EIVJ610404HDFLLR08","JORGE ALBERTO ELIZARRARAS VILLALPANDO",111,20,"1130","1003","00","29","0000001",20,"290025",3,"",20170101,20170331,32073.510000000002]
[null,"GUANAJUATO","11DPT0002P",100,"EIVJ6412112B7","EIVJ641211HGTLLN00","JUAN CARLOS ELIZARRARAZ VILLALPANDO",111,18,"1130","1003","00","29","0000001",18,"290026",3,"",20170101,20170331,20966.32]
[null,"GUANAJUATO","11DPT0002P",100,"EUGC8109022K7","EUGC810902HGTSZS09","CESAR JAVIER ESQUIVEL GUZMAN",111,15,"1130","1003","00","29","0000001",15,"290027",3,"",20170101,20170331,13842.75]
[null,"GUANAJUATO","11DPT0002P",100,"EUQJ600614JNA","EUQJ600614HDFSRN05","JUAN MIGUEL ESQUIVEL QUIROZ",111,20,"1130","1003","00","29","0000001",20,"290028",3,"",20170101,20170331,21419.269999999997]
[null,"GUANAJUATO","11DPT0002P",100,"EAGA611030B76","EAGA611030HGTSTN01","ANTONIO MARTIN ESTRADA GUTIERREZ",111,16,"1130","1003","00","29","0000001",16,"290029",3,"",20170101,20170331,18626.53]
[null,"GUANAJUATO","11DPT0002P",100,"FAAJ620222E7A","FAAJ620222HGTRRS08","JOSE FRANCO ARREDONDO",111,30,"1130","1003","00","29","0000001",30,"290031",3,"",20170101,20170331,33143.47]
[null,"GUANAJUATO","11DPT0002P",100,"GAMM750120RB8","GAMM750120MGTRSR08","MARTHA ELBA GARCIA MOSQUEDA",111,27,"1130","1003","00","29","0000001",27,"290032",3,"",20170101,20170331,31838.949999999997]
[null,"GUANAJUATO","11DPT0002P",100,"GULJ780404F75","GULJ780404HGTRGR06","JORGE GUADALUPE GUERRERO LAGUNA",111,12,"1130","1003","00","29","0000001",12,"290035",3,"",20170101,20170331,6497.5000000000009]
[null,"GUANAJUATO","11DPT0002P",100,"GUVG640807PZ4","GUVG640807MDFZRB04","GABRIELA GUIZAR VARGAS",111,12,"1130","1003","00","29","0000001",12,"290036",3,"",20170101,20170331,16087.780000000002]
[null,"GUANAJUATO","11DPT0002P",100,"HERD520203AD0","HERD520203MSLRSB04","DEBORA HERN RUSSELL",111,30,"1130","1003","00","29","0000001",30,"290038",3,"",20170101,20170331,19501.440000000002]
[null,"GUANAJUATO","11DPT0002P",100,"HEGV820527FN1","HEGV820527MGTRRR00","VERONICA HERNANDEZ GARCIA",111,15,"1130","1003","00","29","0000001",15,"290039",3,"",20170101,20170331,2979.75]
[null,"GUANAJUATO","11DPT0002P",100,"HERR700403DU0","HERR700403HGTRMC07","RICARDO MARTIN HERNANDEZ RAMIREZ",111,12,"1130","1003","00","29","0000001",12,"290040",3,"",20170101,20170331,12963.560000000001]
[null,"GUANAJUATO","11DPT0002P",100,"HERG630310IB0","HERG630310MGTRMB03","MARIA GABRIELA SUSANA HERRERA ZUBIETA ROMERO",111,25,"1130","1003","00","29","0000001",25,"290043",3,"",20170101,20170331,22889.61]
[null,"GUANAJUATO","11DPT0002P",100,"LARJ570720TF2","LARJ570720HGTGDR07","JORGE ARTURO LAGUNA RODRIGUEZ",111,15,"1130","1003","00","29","0000001",15,"290044",3,"",20170101,20170331,13718.599999999999]
[null,"GUANAJUATO","11DPT0002P",100,"LEHB680513J91","LEHB680515MDFDRR01","BRENDA LEDESMA HERNANDEZ",111,18,"1130","1003","00","29","0000001",18,"290046",3,"",20170101,20170331,18669.440000000002]
[null,"GUANAJUATO","11DPT0002P",100,"MAST621028SCA","MAST621028MGTRTR12","MA. TERESA MARTINEZ SOTO",111,16,"1130","1003","00","29","0000001",16,"290051",3,"",20170101,20170331,12892.95]
[null,"GUANAJUATO","11DPT0002P",100,"MASS590809UI8","MASS590809HGTRTL08","SALVADOR MARTINEZ SOTO",111,31,"1130","1003","00","29","0000001",31,"290052",3,"",20170101,20170331,23881.85]
[null,"GUANAJUATO","11DPT0002P",100,"MATM690314JA0","MATM690314MGTRRT12","MA. MATILDE MARTINEZ TORRES",111,16,"1130","1003","00","29","0000001",16,"290053",3,"",20170101,20170331,22583.9]
[null,"GUANAJUATO","11DPT0002P",100,"MEMJ801218ND2","MEMJ801218HGTNRS09","JOSE DE JESUS MENDIOLA MARTINEZ",111,20,"1130","1003","00","29","0000001",20,"290054",3,"",20170101,20170331,17933.41]
[null,"GUANAJUATO","11DPT0002P",100,"MOHT651003EA6","MOHT651003MGTRRR13","MA. TERESA MORENO HERNANDEZ",111,17,"1130","1003","00","29","0000001",17,"290055",3,"",20170101,20170331,12441.600000000002]
[null,"GUANAJUATO","11DPT0002P",100,"NAVG770820NG1","NAVG770820MGTVGB02","GABRIELA NAVA VIGIL",111,15,"1130","1003","00","29","0000001",15,"290056",3,"",20170101,20170331,21915.390000000003]
[null,"GUANAJUATO","11DPT0002P",100,"OASF640805DW4","OASF640805HGTCTR00","FRANCISCO JAVIER OCAMPO SOTO",111,10,"1130","1003","00","29","0000001",10,"290057",3,"",20170101,20170331,14673.900000000001]
[null,"GUANAJUATO","11DPT0002P",100,"PEMA591231QP8","PEMA591231HGTRLN01","ANDREZ PEREZ MELENDEZ",111,15,"1130","1003","00","29","0000001",15,"290058",3,"",20170101,20170331,13718.599999999999]
[null,"GUANAJUATO","11DPT0002P",100,"RISM640319LE9","RISM640319HGTCRR02","JOSE MARTIN RICO SERRITEÑO",111,12,"1130","1003","00","29","0000001",12,"290061",3,"",20170101,20170331,8837.5]
[null,"GUANAJUATO","11DPT0002P",100,"RIMA811003E55","RIMA811003MGTVRN05","ANA PAOLA RIVADENEYRA MARTINEZ",111,15,"1130","1003","00","29","0000001",15,"290062",3,"",20170101,20170331,17969.599999999999]
[null,"GUANAJUATO","11DPT0002P",100,"SAVR640908IQA","SAVR640908HGTNGB09","ROBERTO SANTILLAN VEGA",111,15,"1130","1003","00","29","0000001",15,"290066",3,"",20170101,20170331,16186.32]
[null,"GUANAJUATO","11DPT0002P",100,"SOAO850607U46","SOAO850607HGTTGM04","OMAR DAVID SOTO AGUIRRE",111,19,"1130","1003","00","29","0000001",19,"290067",3,"",20170101,20170331,12328.789999999999]
[null,"GUANAJUATO","11DPT0002P",100,"VILL6707201Q6","VILL670720HGTTNS08","JOSE LUIS VITAL LEON",111,28,"1130","1003","00","29","0000001",28,"290070",3,"",20170101,20170331,24329.030000000002]
[null,"GUANAJUATO","11DPT0002P",100,"ZAMD580804HX2","ZAMD580804HGTRRV01","DAVID ZARAGOZA MARTINEZ",111,20,"1130","1003","00","29","0000001",20,"290071",3,"",20170101,20170331,16554.169999999998]
[null,"GUANAJUATO","11DPT0002P",100,"COCF7905248G5","COCF790524HGTNRR07","FRANCISCO JAVIER CONTRERAS CERVANTES",111,17,"1130","1003","00","29","0000001",17,"290073",3,"",20170101,20170331,20953.690000000002]
[null,"GUANAJUATO","11DPT0002P",100,"COMS721010P5A","COMS721010MGTRSL09","SILVIA CORDOBA MOSQUEDA",111,30,"1130","1003","00","29","0000001",30,"290074",3,"",20170101,20170331,22756.05]
[null,"GUANAJUATO","11DPT0002P",100,"HERA5904202S0","HERA590420HGTRSN04","JOSE ANTONIO HERRERA ROSALES",111,10,"1130","1003","00","29","0000001",10,"290076",3,"",20170101,20170331,3973]
[null,"GUANAJUATO","11DPT0002P",100,"OIGE810723JD5","OIGE810723MVZRRD02","EDITH ORTIZ GARCIA",111,25,"1130","1003","00","29","0000001",25,"290089",3,"",20170101,20170331,29397.29]
[null,"GUANAJUATO","11DPT0002P",100,"OIZG530609RR8","OIZG530609HGTRFL01","GUILLERMO ORTIZ ZAFRA",111,27,"1130","1003","00","29","0000001",27,"290093",3,"",20170101,20170331,27131.200000000004]
[null,"GUANAJUATO","11DPT0002P",100,"GORM820608RC9","GORC820608MGTNMN03","MA. CONCEPCION GONZALEZ RAMIREZ",111,12,"1130","1003","00","29","0000001",12,"290097",3,"",20170101,20170331,15967.92]
[null,"GUANAJUATO","11DPT0002P",100,"GUVJ730410LD4","GUVJ730410MGTZRD08","JUDITH GUIZAR VARGAS",111,16,"1130","1003","00","29","0000001",16,"290110",3,"",20170101,20170331,17321.52]
[null,"GUANAJUATO","11DPT0002P",100,"JAOP740625985","JAOP740625MGTMLT05","PATRICIA JAIME OLVERA",111,25,"1130","1003","00","29","0000001",25,"290111",3,"",20170101,20170331,20764.32]
[null,"GUANAJUATO","11DPT0002P",100,"ROVC800502SP1","ROVC800502MGTDGL04","CLAUDIA ANGELICA RODRIGUEZ VEGA",111,3,"1130","1003","00","29","0000001",3,"290114",3,"",20170101,20170331,5120.79]
[null,"GUANAJUATO","11DPT0002P",100,"DARE870421E95","DARE870421MGTMDD03","EDUARDINA ESAIG DAMIAN RODRIGUEZ",111,24,"1130","1003","00","29","0000001",24,"290119",3,"",20170101,20170331,29326.810000000005]
[null,"GUANAJUATO","11DPT0002P",100,"SAGM820626E90","SAGR820626MGTNNS28","MA. DEL ROSARIO SANCHEZ GONZALEZ",111,29,"1130","1003","00","29","0000001",29,"290125",3,"",20170101,20170331,31793.58]
[null,"GUANAJUATO","11DPT0002P",100,"LOCJ790515Q78","LOCJ790515HGTPHN00","JUAN ANDRES LOPEZ CHAVEZ",111,29,"1130","1003","00","29","0000001",29,"290127",3,"",20170101,20170331,26296.29]
[null,"GUANAJUATO","11DPT0002P",100,"DEBJ851217D4A","DEBJ851217MGTLLS09","JUSELY GUADALUPE DELGADO BELTRAN",111,30,"1130","1003","00","29","0000001",30,"290139",3,"",20170101,20170331,33660.550000000003]
[null,"GUANAJUATO","11DPT0002P",100,"JOSJ820529NC7","JOSJ820529HNTYNN07","JONATHAN JOYA DE LA SANCHA",111,24,"1130","1003","00","29","0000001",24,"290140",3,"",20170101,20170331,30940.950000000004]
[null,"GUANAJUATO","11DPT0002P",100,"SALP780917IZ3","SALP780917HGTNRD04","PEDRO JESUS SANTIAGO LARA",111,31,"1130","1003","00","29","0000001",31,"290156",3,"",20170101,20170331,25982.270000000004]
[null,"GUANAJUATO","11DPT0002P",100,"GAVJ660521UR1","GAVJ660521HGTRGN08","JUAN CARLOS GARCIA VEGA",111,21,"1130","1003","00","29","0000001",21,"290158",3,"",20170101,20170331,17815.580000000002]
[null,"GUANAJUATO","11DPT0002P",100,"COMJ7702043T7","COMJ770204HGTRRL02","JOEL DE JESUS CORONA MORENO",111,28,"1130","1003","00","29","0000001",28,"290159",3,"",20170101,20170331,22547.420000000002]
[null,"GUANAJUATO","11DPT0002P",100,"LURA851031520","LURA851031HGTNML05","JOSE ALFONSO LUNA RAMIREZ",111,10,"1130","1003","00","29","0000001",10,"290174",3,"",20170101,20170331,4115.08]
[null,"GUANAJUATO","11DPT0002P",100,"GAEA800524RQA","GAEA800524HGTRLL00","JOSE ALFREDO GRANADOS ELIZARRARAZ",111,9,"1130","1003","00","29","0000001",9,"290177",3,"",20170101,20170331,11026.35]
[null,"GUANAJUATO","11DPT0002P",100,"EURT6610036LA","EURT661003MMNSYR05","TERESA ESQUIVEL REYES",111,20,"1130","1003","00","29","0000001",20,"290178",3,"",20170101,20170331,12440.11]
[null,"GUANAJUATO","11DPT0003O",100,"AAPA590710LA8","AAPA590710HGTNNL02","JOSE ALEJANDRO ANDRADE PONCE",111,20,"1130","1003","00","30","0000001",20,"300002",3,"",20170101,20170331,23653.850000000002]
[null,"GUANAJUATO","11DPT0003O",100,"AAVC870605JF8","AAVC870605HGTNLR03","CARLOS ALBERTO ANDRADE VALDIVIA",111,10,"1130","1003","00","30","0000001",10,"300004",3,"",20170101,20170331,8157.6399999999994]
[null,"GUANAJUATO","11DPT0003O",100,"AAPJ8809041C9","AAPJ880904HGTRTN01","JUAN MIGUEL ARANDA PATLAN",111,30,"1130","1003","00","30","0000001",30,"300007",3,"",20170101,20170331,18145.27]
[null,"GUANAJUATO","11DPT0003O",100,"AORS650107A96","AORS650107MGTRML00","MARIA SOLEDAD ARROYO RAMIREZ",111,18,"1130","1003","00","30","0000001",18,"300009",3,"",20170101,20170331,19163.68]
[null,"GUANAJUATO","11DPT0003O",100,"AABR750608IB4","AABR750608MGTYRS01","ROSA MARGARITA AYALA BARRERA",111,22,"1130","1003","00","30","0000001",22,"300010",3,"",20170101,20170331,24325.81]
[null,"GUANAJUATO","11DPT0003O",100,"BAFL730321MR1","BAFL730321HGTRLS09","LUIS EDUARDO BARRERA FLORES",111,16,"1130","1003","00","30","0000001",16,"300011",3,"",20170101,20170331,19009.150000000001]
[null,"GUANAJUATO","11DPT0003O",100,"BEMG7505027F8","BEMG750502HGTTNR02","GERMAN BETANCOURT MENDEZ",111,17,"1130","1003","00","30","0000001",17,"300012",3,"",20170101,20170331,17889.650000000001]
[null,"GUANAJUATO","11DPT0003O",100,"BORA580910H59","BORA580910MGTNVN06","MARIA DE LOS ANGELES BONILLA RIVERA",111,22,"1130","1003","00","30","0000001",22,"300013",3,"",20170101,20170331,23500.71]
[null,"GUANAJUATO","11DPT0003O",100,"CAVM6302079D4","CAVM630207MDFLLR04","MARIANA FEDERICA CALDERON VILLALOBOS",111,26,"1130","1003","00","30","0000001",26,"300014",3,"",20170101,20170331,16818.86]
[null,"GUANAJUATO","11DPT0003O",100,"CAMA720409D58","CAMA720409HGTMRN04","JOSE ANTONIO CAMPOS MORENO",111,20,"1130","1003","00","30","0000001",20,"300015",3,"",20170101,20170331,16430.39]
[null,"GUANAJUATO","11DPT0003O",100,"COHV730429DPA","COHV730429MGTRDR01","VIRGINIA FABIOLA CORNEJO HIDALGO",111,28,"1130","1003","00","30","0000001",28,"300018",3,"",20170101,20170331,21960.02]
[null,"GUANAJUATO","11DPT0003O",100,"COFT581003P73","COFT581003MDFRLR01","MA TERESA CORTES FLORES",111,18,"1130","1003","00","30","0000001",18,"300019",3,"",20170101,20170331,13203.25]
[null,"GUANAJUATO","11DPT0003O",100,"CURP6903018I5","CURP690301MGTRYT08","PATRICIA DE LA CRUZ REYES",111,16,"1130","1003","00","30","0000001",16,"300020",3,"",20170101,20170331,16821.46]
[null,"GUANAJUATO","11DPT0003O",100,"DUCC5804306T4","DUCC580430HGTXSR01","CARLOS VICTOR DUEÑAS CASTILLO",111,10,"1130","1003","00","30","0000001",10,"300021",3,"",20170101,20170331,7850.94]
[null,"GUANAJUATO","11DPT0003O",100,"EURA860418KB7","EURA860418HGTSDL09","ALBERTO ESQUIVEL RODRIGUEZ",111,15,"1130","1003","00","30","0000001",15,"300022",3,"",20170101,20170331,8472.2200000000012]
[null,"GUANAJUATO","11DPT0003O",100,"FAAJ5909146M0","FAAJ590914HGTLML09","JOEL FALCON AMADOR",111,16,"1130","1003","00","30","0000001",16,"300023",3,"",20170101,20170331,18288.910000000003]
[null,"GUANAJUATO","11DPT0003O",100,"FUBM760807455","FUBM760807MGTNRN06","MONICA GUADALUPE FUENTES BARRON",111,25,"1130","1003","00","30","0000001",25,"300024",3,"",20170101,20170331,25456.989999999998]
[null,"GUANAJUATO","11DPT0003O",100,"GALR880422QE7","GALR880422HGTRPG08","ROGELIO GARCIA LOPEZ",111,26,"1130","1003","00","30","0000001",26,"300025",3,"",20170101,20170331,19287.669999999998]
[null,"GUANAJUATO","11DPT0003O",100,"GAGE660725EF1","GAGE660725MGTYNG09","MA EUGENIA GAYTAN GONZALEZ",111,25,"1130","1003","00","30","0000001",25,"300026",3,"",20170101,20170331,26141.18]
[null,"GUANAJUATO","11DPT0003O",100,"GOBE5103218X0","GOBE510321HGTNRR07","ERNESTO GONZALEZ BERISTAIN",111,20,"1130","1003","00","30","0000001",20,"300027",3,"",20170101,20170331,30592.89]
[null,"GUANAJUATO","11DPT0003O",100,"GONS7404246U0","GONS740424MGTNXS08","SUSANA MAGNOLIA GONZALEZ NUÑEZ",111,30,"1130","1003","00","30","0000001",30,"300028",3,"",20170101,20170331,27261.41]
[null,"GUANAJUATO","11DPT0003O",100,"HEAA581022HVA","HEAA581022HMCRTL07","JOSE ALBERTO HERRERA ATILANO",111,25,"1130","1003","00","30","0000001",25,"300030",3,"",20170101,20170331,9073.56]
[null,"GUANAJUATO","11DPT0003O",100,"JUGL660124951","JUGL660124MGTRNT19","LETICIA JUAREZ GONZALEZ",111,16,"1130","1003","00","30","0000001",16,"300033",3,"",20170101,20170331,15534.260000000002]
[null,"GUANAJUATO","11DPT0003O",100,"LAGG811206L76","LAGG811206MGTRND04","MARIA GUADALUPE LARA GONZALEZ",111,15,"1130","1003","00","30","0000001",15,"300034",3,"",20170101,20170331,14213.240000000002]
[null,"GUANAJUATO","11DPT0003O",100,"LOGG700109MF1","LOGG700109MGTPRD02","MA. GUADALUPE LOPEZ GARCIA",111,15,"1130","1003","00","30","0000001",15,"300035",3,"",20170101,20170331,15280.07]
[null,"GUANAJUATO","11DPT0003O",100,"MAAJ840617R99","MAAJ840617HGTRLN05","JUAN GUILLERMO MARTIN DEL CAMPO ALMENDARIZ",111,20,"1130","1003","00","30","0000001",20,"300037",3,"",20170101,20170331,15428.81]
[null,"GUANAJUATO","11DPT0003O",100,"MAGC731126BM0","MAGC731126HVZRTR04","CARLOS ROBERTO MARTINEZ GUTIERREZ",111,10,"1130","1003","00","30","0000001",10,"300038",3,"",20170101,20170331,8540.75]
[null,"GUANAJUATO","11DPT0003O",100,"MESF820630A32","MESF820630HGTNLR02","FRANCISCO JAVIER MENDOZA SOLORZANO",111,21,"1130","1003","00","30","0000001",21,"300040",3,"",20170101,20170331,14770.980000000001]
[null,"GUANAJUATO","11DPT0003O",100,"MOSG830803MK4","MOSG830803MGTJND05","MARIA GUADALUPE JANET MOJICA SANDOVAL",111,20,"1130","1003","00","30","0000001",20,"300042",3,"",20170101,20170331,16584.23]
[null,"GUANAJUATO","11DPT0003O",100,"MOQR840307NN2","MOQR840307HGTRRC01","RICARDO MORALES QUIROZ",111,20,"1130","1003","00","30","0000001",20,"300043",3,"",20170101,20170331,21167.309999999998]
[null,"GUANAJUATO","11DPT0003O",100,"MUCE6604088C8","MUCE660408HGTXRL04","ELIAS MUÑOZ CORTES",111,16,"1130","1003","00","30","0000001",16,"300045",3,"",20170101,20170331,12347.75]
[null,"GUANAJUATO","11DPT0003O",100,"MUCM5801195T2","MUCM580119HGTXMR09","JOSE MARIO MUÑOZ CAMPUSANO",111,10,"1130","1003","00","30","0000001",10,"300046",3,"",20170101,20170331,7926.1399999999994]
[null,"GUANAJUATO","11DPT0003O",100,"MUMJ581102QD4","MUMJ581102HGTXRM09","JAIME MUÑOZ MARTINEZ",111,21,"1130","1003","00","30","0000001",21,"300047",3,"",20170101,20170331,17903.860000000004]
[null,"GUANAJUATO","11DPT0003O",100,"NAJE70071623A","NAJE700716HGTVMN08","ENRIQUE NAVARRETE JIMENEZ",111,20,"1130","1003","00","30","0000001",20,"300048",3,"",20170101,20170331,12148.650000000001]
[null,"GUANAJUATO","11DPT0003O",100,"PARH580204E82","PARH580204HDFDYC09","HECTOR PADILLA REYES",111,10,"1130","1003","00","30","0000001",10,"300050",3,"",20170101,20170331,12349.41]
[null,"GUANAJUATO","11DPT0003O",100,"PASE730810KL7","PAXS730810HGTLXR05","SERGIO PLASCENCIA",111,20,"1130","1003","00","30","0000001",20,"300053",3,"",20170101,20170331,20127.910000000003]
[null,"GUANAJUATO","11DPT0003O",100,"PUGH6104307WA","PUGH610430HMNRMC01","HECTOR GERARDO PURECO GOMEZ",111,20,"1130","1003","00","30","0000001",20,"300055",3,"",20170101,20170331,13823.369999999999]
[null,"GUANAJUATO","11DPT0003O",100,"RAPA580921FZ2","RAPA580921HGTMDR04","AURELIO RAMIREZ PADRON",111,20,"1130","1003","00","30","0000001",20,"300056",3,"",20170101,20170331,20955.75]
[null,"GUANAJUATO","11DPT0003O",100,"RAGB840311G83","RAGB840311MGTMTR07","MARIA BERENICE RAMIREZ GUTIERREZ",111,20,"1130","1003","00","30","0000001",20,"300057",3,"",20170101,20170331,9218.6999999999989]
[null,"GUANAJUATO","11DPT0003O",100,"ROMB710830FA6","ROMB710830HGTDXN07","JOSE BENITO RODRIGUEZ MUÑOZ",111,15,"1130","1003","00","30","0000001",15,"300060",3,"",20170101,20170331,12309.330000000002]
[null,"GUANAJUATO","11DPT0003O",100,"RORM440729KM0","RORM440729HGTDYR00","MARGARITO RODRIGUEZ REYES",111,20,"1130","1003","00","30","0000001",20,"300061",3,"",20170101,20170331,21613.69]
[null,"GUANAJUATO","11DPT0003O",100,"ROCU811126UY1","ROCU811126HGTMNR08","URIEL ROMO CONTRERAS",111,23,"1130","1003","00","30","0000001",23,"300063",3,"",20170101,20170331,29769.749999999996]
[null,"GUANAJUATO","11DPT0003O",100,"SAGJ781103MJ3","SAGJ781103HGTLRR06","JORGE ARMANDO SALAS GUARDADO",111,20,"1130","1003","00","30","0000001",20,"300065",3,"",20170101,20170331,15174.65]
[null,"GUANAJUATO","11DPT0003O",100,"SAHL880928KE7","SAHL880928HGTNRS02","LUIS DAVID SANCHEZ HERNANDEZ",111,20,"1130","1003","00","30","0000001",20,"300068",3,"",20170101,20170331,20937.849999999999]
[null,"GUANAJUATO","11DPT0003O",100,"VASO7410292N4","VASO741029HDFLNM02","OMAR VALLARTA SANDOVAL",111,5,"1130","1003","00","30","0000001",5,"300070",3,"",20170101,20170331,2710.17]
[null,"GUANAJUATO","11DPT0003O",100,"VAWS480907UT5","VAWS480907MDFRSY01","SYLVIA AGATHE VARGAS WASHINGTON",111,18,"1130","1003","00","30","0000001",18,"300071",3,"",20170101,20170331,8091.34]
[null,"GUANAJUATO","11DPT0003O",100,"VAPS6101037B8","VAPS610103HGTZRL05","SALVADOR EUGENIO VAZQUEZ PRECIADO",111,11,"1130","1003","00","30","0000001",11,"300072",3,"",20170101,20170331,11665.52]
[null,"GUANAJUATO","11DPT0003O",100,"VESE620331G87","VESE620331HGTRLF03","EFREN VERA SALGADO",111,12,"1130","1003","00","30","0000001",12,"300080",3,"",20170101,20170331,11420.720000000001]
[null,"GUANAJUATO","11DPT0003O",100,"GIPE8705187T7","GIPE870518MGTRDR06","ERIKA ELIZABETH GRIMALDO PADILLA",111,25,"1130","1003","00","30","0000001",25,"300081",3,"",20170101,20170331,22040.3]
[null,"GUANAJUATO","11DPT0003O",100,"GOJJ751220NG4","GOJJ751220HGTMCL02","JULIO GOMEZ JACOBO",111,12,"1130","1003","00","30","0000001",12,"300084",3,"",20170101,20170331,4994.5599999999995]
[null,"GUANAJUATO","11DPT0003O",100,"LOJA720726KJ9","LOJA720726MGTPMN03","ANA CRISTINA LOPEZ JIMENEZ",111,18,"1130","1003","00","30","0000001",18,"300088",3,"",20170101,20170331,16192.91]
[null,"GUANAJUATO","11DPT0003O",100,"LOSM721211630","LOSM721211MGTPRR02","MARCELA LOPEZ SORIA",111,10,"1130","1003","00","30","0000001",10,"300089",3,"",20170101,20170331,6915.4999999999991]
[null,"GUANAJUATO","11DPT0003O",100,"CARI751102B38","CARI751102HGTSDV01","IVAN ALEJANDRO CASTAÑEDA RODRIGUEZ",111,30,"1130","1003","00","30","0000001",30,"300096",3,"",20170101,20170331,19428.599999999999]
[null,"GUANAJUATO","11DPT0003O",100,"VEMJ731231RC5","VEMJ731231HGTLXN19","JUAN MANUEL VELAZQUEZ MUÑOZ",111,20,"1130","1003","00","30","0000001",20,"300098",3,"",20170101,20170331,18066.29]
[null,"GUANAJUATO","11DPT0003O",100,"AABJ690919DQ5","AABJ690919MQTYRN07","JUANA ALMA DELIA AYALA BARRERA",111,25,"1130","1003","00","30","0000001",25,"300101",3,"",20170101,20170331,24095.899999999998]
[null,"GUANAJUATO","11DPT0003O",100,"CEGC8106038S6","CEGC810603MGTRML03","CLAUDIA PATRICIA CERVANTES GOMEZ",111,15,"1130","1003","00","30","0000001",15,"300102",3,"",20170101,20170331,14162.44]
[null,"GUANAJUATO","11DPT0003O",100,"DAZM801018FR0","DAZM801018MGTVMR04","MIRIAM TERESA DAVALOS ZAMORA",111,18,"1130","1003","00","30","0000001",18,"300103",3,"",20170101,20170331,14831.02]
[null,"GUANAJUATO","11DPT0003O",100,"FABV830514ES9","FABV830514HGTRLC04","VICTOR ESTEBAN FRAUSTO BOLIO",111,18,"1130","1003","00","30","0000001",18,"300104",3,"",20170101,20170331,18863.739999999998]
[null,"GUANAJUATO","11DPT0003O",100,"IUMM800617VC2","IUMM800617MGTSRY06","MYRNA DENISSE ISUSQUIZA MARTINEZ",111,25,"1130","1003","00","30","0000001",25,"300106",3,"",20170101,20170331,10732.070000000002]
[null,"GUANAJUATO","11DPT0003O",100,"PAHF740428HK9","PAHF740428HGTDRR00","FRANCISCO JAVIER PADILLA HERNANDEZ",111,17,"1130","1003","00","30","0000001",17,"300108",3,"",20170101,20170331,14266.340000000004]
[null,"GUANAJUATO","11DPT0003O",100,"DOBA621219C61","DOBA621219HGTMNL07","ALVARO DOMINGUEZ BONILLA",111,10,"1130","1003","00","30","0000001",10,"300109",3,"",20170101,20170331,7350.05]
[null,"GUANAJUATO","11DPT0003O",100,"VEHR8310237SA","VEHR831023HGTGRB01","ROBERTO VEGA HERNANDEZ",111,12,"1130","1003","00","30","0000001",12,"300110",3,"",20170101,20170331,8604.81]
[null,"GUANAJUATO","11DPT0003O",100,"GUHM780709MJ2","GUHM780709HGTVRN04","JOSE MANUEL GUEVARA HERNANDEZ",111,20,"1130","1003","00","30","0000001",20,"300112",3,"",20170101,20170331,8240.1]
[null,"GUANAJUATO","11DPT0003O",100,"VASR930322QX5","VASR930322HGTLGL04","RAUL VALDIVIA SEGOVIANO",111,10,"1130","1003","00","30","0000001",10,"300127",3,"",20170101,20170331,5612.7500000000009]
[null,"GUANAJUATO","11DPT0003O",100,"GOEA700316QV6","GOEA700316HGTNSR05","ARMANDO HERIBERTO GONZALEZ ESPINOSA",111,29,"1130","1003","00","30","0000001",29,"300130",3,"",20170101,20170331,12577.810000000001]
[null,"GUANAJUATO","11DPT0003O",100,"RIMM880823M49","RIMM880823HGTVDR03","MARCO ANTONIO RIVERA MEDINA",111,15,"1130","1003","00","30","0000001",15,"300133",3,"",20170101,20170331,13655.319999999998]
[null,"GUANAJUATO","11DPT0003O",100,"BEGM830427SW5","BEGM830427MGTCMR00","MARCELINA BECERRA GOMEZ",111,5,"1130","1003","00","30","0000001",5,"300139",3,"",20170101,20170331,3045.9700000000003]
[null,"GUANAJUATO","11DPT0003O",100,"FOHG891130G48","FOHG891130HGTLRR02","GERARDO DE JESUS FLORES HERNANDEZ",111,10,"1130","1003","00","30","0000001",10,"300151",3,"",20170101,20170331,3985.13]
[null,"GUANAJUATO","11DPT0003O",100,"RAGM6609221S7","RAGM660922HGTMNR07","MAURICIO ANTONIO RAMOS GONZALEZ",111,5,"1130","1003","00","30","0000001",5,"300156",3,"",20170101,20170331,2710.17]
[null,"GUANAJUATO","11DPT0003O",100,"RIOM930603P62","RIOM930603MGTVRC06","MICHELLE ELIZABETH RIVERA ORTEGA",111,4,"1130","1003","00","30","0000001",4,"300160",3,"",20170101,20170331,519.80000000000007]
[null,"GUANAJUATO","11DPT0003O",100,"DUHJ591027L95","DUHJ591027HGTRRN01","JUAN ANTONIO DURAN HERNANDEZ",111,20,"1130","1003","00","30","0000001",20,"300170",3,"",20170101,20170331,3711.75]
[null,"GUANAJUATO","11DPT0003O",100,"MOAA670312HJ8","MOAA670312HGTRFL02","ALBERTO MORALES AFANADOR",111,3,"1130","1003","00","30","0000001",3,"300172",3,"",20170101,20170331,1060.5]
[null,"GUANAJUATO","11DPT0003O",100,"DOVA60112825A","DOVA601128HGTMZD09","ADAN JOEL DOMINGUEZ VAZQUEZ",111,4,"1130","1003","00","30","0000001",4,"300175",3,"",20170101,20170331,554.45000000000005]
[null,"GUANAJUATO","11DPT0003O",100,"SACM561126DUA","SACM561126HTSLRG14","MIGUEL SALVADOR SALDAÑA CORTEZ",111,8,"1130","1003","00","30","0000001",8,"300179",3,"",20170101,20170331,1414]
[null,"GUANAJUATO","11DPT0003O",100,"AAGL820530842","AAGL820530MGTLNR07","LAURA ALDACO GONZALEZ",111,4,"1130","1003","00","30","0000001",4,"300180",3,"",20170101,20170331,1414]
[null,"GUANAJUATO","11DPT0005M",100,"AOMR770309JR5","AOMR770309MGTCRS03","ROSAURA ACOSTA MORENO",111,28,"1130","1003","00","72","0000001",28,"720001",3,"",20170101,20170331,25425.38]
[null,"GUANAJUATO","11DPT0005M",100,"AULG650807MX2","AULG650807MCLGPD08","MARIA GUADALUPE AGUILAR LOPEZ",111,20,"1130","1003","00","72","0000001",20,"720002",3,"",20170101,20170331,21761.01]
[null,"GUANAJUATO","11DPT0005M",100,"AUPL770322NG0","AUPL770322MJCGNR05","LAURA ITZAMARAY AGUIRRE PUENTE",111,20,"1130","1003","00","72","0000001",20,"720004",3,"",20170101,20170331,27156.760000000002]
[null,"GUANAJUATO","11DPT0005M",100,"AICF790308Q83","AICF790308HGTMLR01","FERNANDO AMBRIZ COLIN",111,15,"1130","1003","00","72","0000001",15,"720005",3,"",20170101,20170331,16054.57]
[null,"GUANAJUATO","11DPT0005M",100,"BASM671211R18","BASM671211MGTCNR06","MARTHA PATRICIA BACA SANCHEZ",111,12,"1130","1003","00","72","0000001",12,"720006",3,"",20170101,20170331,14271.340000000002]
[null,"GUANAJUATO","11DPT0005M",100,"BAGG740408RC0","BAGG740408MGTZRB07","GABRIELA BAEZA GARCIA",111,24,"1130","1003","00","72","0000001",24,"720007",3,"",20170101,20170331,28255.22]
[null,"GUANAJUATO","11DPT0005M",100,"BAPA800509JH2","BAPA800509HDFRRL06","ALAN BAROJAS PEREZ",111,15,"1130","1003","00","72","0000001",15,"720008",3,"",20170101,20170331,13632.36]
[null,"GUANAJUATO","11DPT0005M",100,"BACL660127PY3","BACL660127HGTRNS02","JOSE LUIS BRAVO CANO",111,25,"1130","1003","00","72","0000001",25,"720009",3,"",20170101,20170331,28486.98]
[null,"GUANAJUATO","11DPT0005M",100,"CABA581007JI3","CABA581007MMNRZN08","MARIA DE LOS ANGELES CARDENAS BAEZA",111,28,"1130","1003","00","72","0000001",28,"720012",3,"",20170101,20170331,35537.93]
[null,"GUANAJUATO","11DPT0005M",100,"CABD570205P26","CABD570205MMNRZL00","MARIA DE LOS DOLORES CARDENAS BAEZA",111,21,"1130","1003","00","72","0000001",21,"720013",3,"",20170101,20170331,25425.38]
[null,"GUANAJUATO","11DPT0005M",100,"CAGG711124NT7","CAGG711124MGTRTD19","MARIA GUADALUPE CARDENAS GUTIERREZ",111,21,"1130","1003","00","72","0000001",21,"720014",3,"",20170101,20170331,15368.2]
[null,"GUANAJUATO","11DPT0005M",100,"CACR540413CR4","CACR540413HBCSSL00","RAUL CASTAÑEDA CASTRO",111,29,"1130","1003","00","72","0000001",29,"720015",3,"",20170101,20170331,32047.040000000001]
[null,"GUANAJUATO","11DPT0005M",100,"CUGV730427G51","CUGV730427HGTLMC00","VICTOR MANUEL CUELLAR GOMEZ",111,29,"1130","1003","00","72","0000001",29,"720016",3,"",20170101,20170331,28471.34]
[null,"GUANAJUATO","11DPT0005M",100,"DABG810704HX9","DABG810704HGTMRR08","GERSON FALCAO DAMIAN BRAVO",111,23,"1130","1003","00","72","0000001",23,"720017",3,"",20170101,20170331,21379.52]
[null,"GUANAJUATO","11DPT0005M",100,"DIGJ5805018S3","DIGJ580501HGTZTR09","JORGE DIAZ GUTIERREZ",111,15,"1130","1003","00","72","0000001",15,"720018",3,"",20170101,20170331,16719.71]
[null,"GUANAJUATO","11DPT0005M",100,"EIDR500307HY1","EIDR500307HGTNLN02","JOSE RENE ENRIQUEZ DELGADO",111,20,"1130","1003","00","72","0000001",20,"720019",3,"",20170101,20170331,22869.420000000002]
[null,"GUANAJUATO","11DPT0005M",100,"EANE770730ID6","EANE770730HMNSXD06","EDGAR CUAUHTEMOC ESTRADA NUÑEZ",111,20,"1130","1003","00","72","0000001",20,"720020",3,"",20170101,20170331,24291.239999999998]
[null,"GUANAJUATO","11DPT0005M",100,"FAPR6706038JA","FAPR670603HGTRRB03","ROBERTO FRANCIA PEREZ",111,14,"1130","1003","00","72","0000001",14,"720021",3,"",20170101,20170331,9535.93]
[null,"GUANAJUATO","11DPT0005M",100,"GABM720316FV9","GABM720316MGTRLR09","MARTHA PATRICIA GARCIA BELTRAN",111,28,"1130","1003","00","72","0000001",28,"720022",3,"",20170101,20170331,29536.489999999998]
[null,"GUANAJUATO","11DPT0005M",100,"GABM731224PP4","GABM731224HGTRLG09","MIGUEL ANGEL GARCIA BELTRAN",111,16,"1130","1003","00","72","0000001",16,"720023",3,"",20170101,20170331,21179.280000000002]
[null,"GUANAJUATO","11DPT0005M",100,"GACF650909JFA","GACF650909HGTRND07","FIDEL GARCIA CONEJO",111,20,"1130","1003","00","72","0000001",20,"720024",3,"",20170101,20170331,22163.25]
[null,"GUANAJUATO","11DPT0005M",100,"GASR730617EQ9","GASR730617MGTRLS03","ROSA MARIA GARCIA SILVA",111,24,"1130","1003","00","72","0000001",24,"720026",3,"",20170101,20170331,25303.040000000001]
[null,"GUANAJUATO","11DPT0005M",100,"GOAG850312TM1","GOAG850312HGTMLN08","GENARO ALEJANDRO GOMEZ ALBA",111,16,"1130","1003","00","72","0000001",16,"720029",3,"",20170101,20170331,12604.34]
[null,"GUANAJUATO","11DPT0005M",100,"GONJ690921H46","GONJ690921HGTMTS00","JOSE JESUS GOMEZ NIETO",111,20,"1130","1003","00","72","0000001",20,"720030",3,"",20170101,20170331,20654.620000000003]
[null,"GUANAJUATO","11DPT0005M",100,"LEGR710831DD0","LEGR710831HGTSNL02","RAUL LESSO GONZALEZ",111,14,"1130","1003","00","72","0000001",14,"720032",3,"",20170101,20170331,15814.240000000002]
[null,"GUANAJUATO","11DPT0005M",100,"MABG7804019Z5","MABG780401MGTCRL00","GLORIA ELENA MACIEL BARAJAS",111,15,"1130","1003","00","72","0000001",15,"720033",3,"",20170101,20170331,19861.52]
[null,"GUANAJUATO","11DPT0005M",100,"MARJ690613N97","MARJ690613HGTGYN00","JUAN MIGUEL MAGAÑA RAYA",111,30,"1130","1003","00","72","0000001",30,"720034",3,"",20170101,20170331,23625.599999999999]
[null,"GUANAJUATO","11DPT0005M",100,"PEGS720511HW3","PEGS720511MGTXRN06","SANJUANA PATRICIA PEÑA GARCIA",111,16,"1130","1003","00","72","0000001",16,"720039",3,"",20170101,20170331,13224.04]
[null,"GUANAJUATO","11DPT0005M",100,"RAAL791208PR9","RAAL791208MGTZNL07","LILIA CONCEPCION RAZO ANGELES",111,20,"1130","1003","00","72","0000001",20,"720043",3,"",20170101,20170331,23233.489999999998]
[null,"GUANAJUATO","11DPT0005M",100,"ROLM821117536","ROLM821117HGTDPN05","MANUEL CHRISTIAN JARED RODRIGUEZ LOPEZ",111,12,"1130","1003","00","72","0000001",12,"720044",3,"",20170101,20170331,16135.160000000002]
[null,"GUANAJUATO","11DPT0005M",100,"RURL700528JKA","RURL700528MGTZDZ03","LUZ MARIA RUIZ RODRIGUEZ",111,30,"1130","1003","00","72","0000001",30,"720045",3,"",20170101,20170331,28734.370000000003]
[null,"GUANAJUATO","11DPT0005M",100,"SAMR641029MF0","SAMR641029HGTNNB09","ROBERTO SANTOYO MENDOZA",111,20,"1130","1003","00","72","0000001",20,"720047",3,"",20170101,20170331,20469.12]
[null,"GUANAJUATO","11DPT0005M",100,"TOVJ770823IY6","TOVJ770823HGTRRN05","JUAN MANUEL TORRES VERA",111,29,"1130","1003","00","72","0000001",29,"720049",3,"",20170101,20170331,18352.54]
[null,"GUANAJUATO","11DPT0005M",100,"VASY830412S80","VASY830412MMNLNN08","YUNNUEN VALENZUELA SANCHEZ",111,9,"1130","1003","00","72","0000001",9,"720050",3,"",20170101,20170331,7891.3600000000006]
[null,"GUANAJUATO","11DPT0005M",100,"VAFI6312015P7","VAFI631201MGTRLR02","IRMA VARGAS FLORES",111,20,"1130","1003","00","72","0000001",20,"720051",3,"",20170101,20170331,23416.190000000002]
[null,"GUANAJUATO","11DPT0005M",100,"VIZM6610296H8","VIZM661029MMNLRN03","MONICA VILLAGOMEZ ZARATE",111,25,"1130","1003","00","72","0000001",25,"720053",3,"",20170101,20170331,25308.58]
[null,"GUANAJUATO","11DPT0005M",100,"ZAJG780731MY6","ZAJG780731HGTVMR00","GERARDO ZAVALA JIMENEZ",111,15,"1130","1003","00","72","0000001",15,"720054",3,"",20170101,20170331,10722.85]
[null,"GUANAJUATO","11DPT0005M",100,"ZARM650407FP5","ZARM650407MGTVCT02","MARIA MATILDE ZAVALA RICO",111,9,"1130","1003","00","72","0000001",9,"720055",3,"",20170101,20170331,7011.1]
[null,"GUANAJUATO","11DPT0005M",100,"MASJ860305HY5","MASJ860305HGTRRN08","JUAN CARLOS MARTINEZ SARDINA",111,15,"1130","1003","00","72","0000001",15,"720056",3,"",20170101,20170331,12799.67]
[null,"GUANAJUATO","11DPT0005M",100,"AUPA750921LS8","AUPA750921HJCGNL00","JOSE ALFREDO AGUIRRE PUENTE",111,11,"1130","1003","00","72","0000001",11,"720057",3,"",20170101,20170331,12393.810000000001]
[null,"GUANAJUATO","11DPT0005M",100,"MAGD5812285Y1","MAGD581228MGTRRL00","MARIA DOLORES MARTINEZ GARCIA",111,12,"1130","1003","00","72","0000001",12,"720058",3,"",20170101,20170331,9132.1]
[null,"GUANAJUATO","11DPT0005M",100,"GOMM77020921A","GOMM770209MGTNRR04","MARTHA GONZALEZ MARTINEZ",111,9,"1130","1003","00","72","0000001",9,"720062",3,"",20170101,20170331,5441.35]
[null,"GUANAJUATO","11DPT0005M",100,"PAAM820226JB0","PAAM820226HGTRGR02","MARTIN PRADO AGUILAR",111,30,"1130","1003","00","72","0000001",30,"720064",3,"",20170101,20170331,28751.35]
[null,"GUANAJUATO","11DPT0005M",100,"GOHM880217IT0","GOHM880217HGTNRR05","MARCOS ELIAS GONZALEZ HERNANDEZ",111,15,"1130","1003","00","72","0000001",15,"720072",3,"",20170101,20170331,11696.589999999998]
[null,"GUANAJUATO","11DPT0005M",100,"RAPW7805122P3","RAPW780512MGTMRN01","WENDY RAMIREZ PARRA",111,15,"1130","1003","00","72","0000001",15,"720075",3,"",20170101,20170331,12519.82]
[null,"GUANAJUATO","11DPT0005M",100,"RIAM860508FPA","RIAM860508MGTVRR09","MARISA RIVERA ARREDONDO",111,10,"1130","1003","00","72","0000001",10,"720079",3,"",20170101,20170331,4254.42]
[null,"GUANAJUATO","11DPT0004N",100,"AOML850714CK0","AOML850714MMNLGR07","LAURA VENTURA ALBOR MAGAÑA",111,15,"1130","1003","01","28","0000001",15,"280002",3,"",20170101,20170331,12215.150000000001]
[null,"GUANAJUATO","11DPT0004N",100,"AAGM6807041Y7","AAGR680704MDFNRF04","MA. DEL REFUGIO ANALLA GRANADOS",111,16,"1130","1003","01","28","0000001",16,"280003",3,"",20170101,20170331,12667.1]
[null,"GUANAJUATO","11DPT0004N",100,"CIOR7805171L4","CIOR780517HGTNRB00","ROBERTO CINTORA JR.",111,13,"1130","1003","01","28","0000001",13,"280007",3,"",20170101,20170331,15189.78]
[null,"GUANAJUATO","11DPT0004N",100,"COJR790910633","COJR790910MGTRMS08","ROSALVA CORNEJO JIMENEZ",111,7,"1130","1003","01","28","0000001",7,"280008",3,"",20170101,20170331,8721.2999999999993]
[null,"GUANAJUATO","11DPT0004N",100,"CUSJ550902DF1","CUSJ550902MGTRTN09","MARIA JANET CRUZ SOTO",111,12,"1130","1003","01","28","0000001",12,"280009",3,"",20170101,20170331,11463.750000000002]
[null,"GUANAJUATO","11DPT0004N",100,"DIEM790506MK2","DIEM790506MGTZSR04","MARTHA SOFIA DIAZ ESCUTIA",111,13,"1130","1003","01","28","0000001",13,"280010",3,"",20170101,20170331,12197.67]
[null,"GUANAJUATO","11DPT0004N",100,"EAMM710507IBA","EAMM710507MASSGR04","MARTHA PATRICIA ESTRADA MAGALLON",111,11,"1130","1003","01","28","0000001",11,"280012",3,"",20170101,20170331,12608.17]
[null,"GUANAJUATO","11DPT0004N",100,"FOBD780903IT3","FOBD780903HGTNDV05","DAVID FONSECA BEDOLLA",111,11,"1130","1003","01","28","0000001",11,"280014",3,"",20170101,20170331,13138.43]
[null,"GUANAJUATO","11DPT0004N",100,"GAVJ851126FM4","GAVJ851126HGTRYV07","JAVIER GARCIA VIEYRA",111,15,"1130","1003","01","28","0000001",15,"280015",3,"",20170101,20170331,16088.83]
[null,"GUANAJUATO","11DPT0004N",100,"GUGG730101IA2","GUGG730101HGTTZN01","GONZALO GUTIERREZ GUZMAN",111,15,"1130","1003","01","28","0000001",15,"280016",3,"",20170101,20170331,18234.73]
[null,"GUANAJUATO","11DPT0004N",100,"HEDA800812J62","HEDA800812HGTRZD09","ADRIAN HERNANDEZ DIAZ",111,16,"1130","1003","01","28","0000001",16,"280017",3,"",20170101,20170331,15276.75]
[null,"GUANAJUATO","11DPT0004N",100,"LOBL610801UA2","LOBL610801HGTPDS05","LUIS LOPEZ BEDOLLA",111,16,"1130","1003","01","28","0000001",16,"280019",3,"",20170101,20170331,16519.23]
[null,"GUANAJUATO","11DPT0004N",100,"LOLB790114RE0","LOLB790114MGTPPR08","BERENICE LOPEZ LOPEZ",111,13,"1130","1003","01","28","0000001",13,"280020",3,"",20170101,20170331,16997.48]
[null,"GUANAJUATO","11DPT0004N",100,"LOOE660716UY7","LOOE660716HGTPJD01","EDUARDO LOPEZ OJEDA",111,8,"1130","1003","01","28","0000001",8,"280021",3,"",20170101,20170331,9449.69]
[null,"GUANAJUATO","11DPT0004N",100,"MOZR701212DS9","MOZR701212HGTRVG09","RIGOBERTO MORENO ZAVALA",111,18,"1130","1003","01","28","0000001",18,"280023",3,"",20170101,20170331,17498.239999999998]
[null,"GUANAJUATO","11DPT0004N",100,"OOOC810927BA9","OOOC810927MGTRRL05","CLAUDIA KARINA OROZCO OROZCO",111,25,"1130","1003","01","28","0000001",25,"280024",3,"",20170101,20170331,22544.95]
[null,"GUANAJUATO","11DPT0004N",100,"PEAA590708RJ5","PEAA590708HDFRLD08","JOSE ADRIAN ARTURO PEREZ ALVAREZ",111,9,"1130","1003","01","28","0000001",9,"280026",3,"",20170101,20170331,10294.870000000001]
[null,"GUANAJUATO","11DPT0004N",100,"PEEJ780324IC1","PEEJ780324HMNRSN01","JUAN FERNANDO PEREZ ESPINO",111,25,"1130","1003","01","28","0000001",25,"280027",3,"",20170101,20170331,30736.100000000002]
[null,"GUANAJUATO","11DPT0004N",100,"RUDJ780213NV6","RUDJ780213HGTZZN04","JUAN CARLOS RUIZ DIAZ",111,17,"1130","1003","01","28","0000001",17,"280029",3,"",20170101,20170331,21485.47]
[null,"GUANAJUATO","11DPT0004N",100,"SAVE4511296P5","SAVE451129HGTLRL03","ELIGIO SALGADO VARGAZ",111,9,"1130","1003","01","28","0000001",9,"280030",3,"",20170101,20170331,12513.130000000001]
[null,"GUANAJUATO","11DPT0004N",100,"SADF620323P95","SADF620323HDGNVD00","FIDEL SANCHEZ DAVILA",111,9,"1130","1003","01","28","0000001",9,"280031",3,"",20170101,20170331,13025.390000000001]
[null,"GUANAJUATO","11DPT0004N",100,"VIRD850905EA2","VIRD850905MGTLDY04","DEYSI VILLANUEVA RODRIGUEZ",111,11,"1130","1003","01","28","0000001",11,"280035",3,"",20170101,20170331,8475.73]
[null,"GUANAJUATO","11DPT0004N",100,"ZAPJ830703848","ZAPJ830703HGTMRN07","JUAN MARCIAL ZAMUDIO PEREZ",111,10,"1130","1003","01","28","0000001",10,"280037",3,"",20170101,20170331,15078.1]
[null,"GUANAJUATO","11DPT0004N",100,"ZAVN811206A67","ZAVN811206MGTMLR06","NORMA ANGELICA ZAMUDIO VILLALOBOS",111,10,"1130","1003","01","28","0000001",10,"280038",3,"",20170101,20170331,7276.2]
[null,"GUANAJUATO","11DPT0004N",100,"ZAHR840210PN9","ZAHR840210HGTVRD05","RODOLFO ANTONIO ZAVALA HERNANDEZ",111,12,"1130","1003","01","28","0000001",12,"280039",3,"",20170101,20170331,13407.050000000001]
[null,"GUANAJUATO","11DPT0004N",100,"CECL851027UY4","CECL851027MGTRSL00","LILIANA CERRATO CUSTODIO",111,12,"1130","1003","01","28","0000001",12,"280041",3,"",20170101,20170331,12166.31]
[null,"GUANAJUATO","11DPT0004N",100,"HERN811104FB8","HERN811104MMNRJB02","NUBIA VANESSA HERNANDEZ ROJAS",111,30,"1130","1003","01","28","0000001",30,"280042",3,"",20170101,20170331,19911.920000000002]
[null,"GUANAJUATO","11DPT0004N",100,"MELM880414RR6","MELM880414MGTNPR03","MARISOL MENDEZ LOPEZ",111,30,"1130","1003","01","28","0000001",30,"280044",3,"",20170101,20170331,26070.639999999999]
[null,"GUANAJUATO","11DPT0004N",100,"SOGY851206464","SOGY851206MMNSZN01","YANETH SOSA GUZMAN",111,15,"1130","1003","01","28","0000001",15,"280046",3,"",20170101,20170331,13870.56]
[null,"GUANAJUATO","11DPT0004N",100,"MAHS851214LA4","MAHS851214MGTRRN01","SANDRA MARTINEZ HERNANDEZ",111,20,"1130","1003","01","28","0000001",20,"280050",3,"",20170101,20170331,11965.92]
[null,"GUANAJUATO","11DPT0004N",100,"SOGE770916E73","SOGE770916MDFLNL08","MARIA ELENA SOLIS GONZALEZ",111,16,"1130","1003","01","28","0000001",16,"280054",3,"",20170101,20170331,18979.27]
[null,"GUANAJUATO","11DPT0004N",100,"TITC671201BBA","TITC671201HMNNNR07","CRESCENCIANO TINOCO TINOCO",111,12,"1130","1003","01","28","0000001",12,"280058",3,"",20170101,20170331,16240.62]
[null,"GUANAJUATO","11DPT0004N",100,"CUGE880521IJ6","CUGE880521HGTSRR02","ERIK ALBERTO CUSTODIO GARCIA",111,20,"1130","1003","01","28","0000001",20,"280061",3,"",20170101,20170331,22123.23]
[null,"GUANAJUATO","11DPT0004N",100,"COOA720302IP3","COOA720302MGTRRL01","ALMA ROSA CORTEZ ORTIZ",111,10,"1130","1003","01","28","0000001",10,"280066",3,"",20170101,20170331,9249.93]
[null,"GUANAJUATO","11DPT0004N",100,"VIMC900724PHA","VIMC900724MGTLNR08","MARIA CRISTINA VILLAGOMEZ MONTES",111,4,"1130","1003","01","28","0000001",4,"280068",3,"",20170101,20170331,2116.58]
[null,"GUANAJUATO","11DPT0006L",100,"AERJ730331GZ5","AERJ730331HGTRMN05","JUAN CARLOS ARREOLA ROMERO",111,15,"1130","1003","01","63","0000001",15,"630004",3,"",20170101,20170331,16202.09]
[null,"GUANAJUATO","11DPT0006L",100,"BEMG751210DE6","BEMG751210MDFLRD02","GUADALUPE KARINA BELTRAN MARTINEZ",111,6,"1130","1003","01","63","0000001",6,"630005",3,"",20170101,20170331,7566.09]
[null,"GUANAJUATO","11DPT0006L",100,"BEGR700112IU3","BEGR700112MGTRRB16","MA REBECA BERNAL GORDILLO",111,21,"1130","1003","01","63","0000001",21,"630006",3,"",20170101,20170331,22005.4]
[null,"GUANAJUATO","11DPT0006L",100,"BACG700412ET2","BACG700412MGTRSD07","MA GUADALUPE BRAVO CASTRO",111,9,"1130","1003","01","63","0000001",9,"630007",3,"",20170101,20170331,8513.48]
[null,"GUANAJUATO","11DPT0006L",100,"CASC710716KT2","CASC710716MGTBRR09","MA CARMEN CABALLERO SIERRA",111,12,"1130","1003","01","63","0000001",12,"630008",3,"",20170101,20170331,11223.61]
[null,"GUANAJUATO","11DPT0006L",100,"CAGG841115NK6","CAGG841115MGTLNL08","GIULIANA CALDERON GONZALEZ",111,12,"1130","1003","01","63","0000001",12,"630009",3,"",20170101,20170331,10376.720000000001]
[null,"GUANAJUATO","11DPT0006L",100,"CADJ720202F14","CADJ720202HMNHRN03","JUAN CHAVEZ DURAN",111,10,"1130","1003","01","63","0000001",10,"630010",3,"",20170101,20170331,9375.02]
[null,"GUANAJUATO","11DPT0006L",100,"COPG691022N6A","COPG691022MGTNRD16","MA GUADALUPE CONTRERAS PEREZ",111,16,"1130","1003","01","63","0000001",16,"630011",3,"",20170101,20170331,24532.710000000003]
[null,"GUANAJUATO","11DPT0006L",100,"COTR740102LT0","COTR740102MMCRRC00","ROCIO CORONA TIRADO",111,23,"1130","1003","01","63","0000001",23,"630012",3,"",20170101,20170331,25746.6]
[null,"GUANAJUATO","11DPT0006L",100,"EIME671030L39","EIME671030HGTSRD09","EDUARDO ESPINO MIRANDA",111,15,"1130","1003","01","63","0000001",15,"630014",3,"",20170101,20170331,17157.73]
[null,"GUANAJUATO","11DPT0006L",100,"EILO590921526","EILO590921MGTSNF06","OFELIA ESPINOSA LUNA",111,20,"1130","1003","01","63","0000001",20,"630015",3,"",20170101,20170331,24978.63]
[null,"GUANAJUATO","11DPT0006L",100,"GASM760821854","GASS760821MGTRTC14","MA. DEL SOCORRO GARCIA SOTELO",111,15,"1130","1003","01","63","0000001",15,"630017",3,"",20170101,20170331,15144.32]
[null,"GUANAJUATO","11DPT0006L",100,"JAMJ8502091S3","JAMJ850209HDFSRL04","JULIO CESAR JASSO MARTINEZ",111,22,"1130","1003","01","63","0000001",22,"630021",3,"",20170101,20170331,25010.6]
[null,"GUANAJUATO","11DPT0006L",100,"JAPM610407F53","JAPM610407HGTSRR09","MARCELINO JASSO PEREZ",111,20,"1130","1003","01","63","0000001",20,"630022",3,"",20170101,20170331,20149.52]
[null,"GUANAJUATO","11DPT0006L",100,"LOMA671109LL9","LOMA671109MGTPLL01","ALEJANDRA LOPEZ MELGAREJO",111,17,"1130","1003","01","63","0000001",17,"630023",3,"",20170101,20170331,24481.870000000003]
[null,"GUANAJUATO","11DPT0006L",100,"LUWR540208FX7","LUWR540208MDFNRB04","REBECA LUNA WIARCO",111,20,"1130","1003","01","63","0000001",20,"630024",3,"",20170101,20170331,24500.17]
[null,"GUANAJUATO","11DPT0006L",100,"MAJT7906215T2","MAJT790621MGTNRR01","TERESA MANDUJANO JURADO",111,19,"1130","1003","01","63","0000001",19,"630026",3,"",20170101,20170331,18768.760000000002]
[null,"GUANAJUATO","11DPT0006L",100,"MAGM780331EF7","MAGM780331MGTRZR08","MARIANA MARIN GUZMAN",111,23,"1130","1003","01","63","0000001",23,"630027",3,"",20170101,20170331,22682.93]
[null,"GUANAJUATO","11DPT0006L",100,"MAMA660610965","MAMA660610HGTRLR08","ARMANDO MARTINEZ MALDONADO",111,14,"1130","1003","01","63","0000001",14,"630028",3,"",20170101,20170331,19080.97]
[null,"GUANAJUATO","11DPT0006L",100,"MOSR800811KH0","MOSR800811HGTLNC05","RICARDO MOLINA SANCHEZ",111,15,"1130","1003","01","63","0000001",15,"630030",3,"",20170101,20170331,14398.470000000001]
[null,"GUANAJUATO","11DPT0006L",100,"OISA541015SQ0","OISA541015HGTRLL06","ALEJANDRO ORTIZ SILVA",111,17,"1130","1003","01","63","0000001",17,"630031",3,"",20170101,20170331,25895.760000000002]
[null,"GUANAJUATO","11DPT0006L",100,"PASM631104DP4","PASM631104MDFDNR08","MARTHA ROCIO PADILLA SANDOVAL",111,16,"1130","1003","01","63","0000001",16,"630032",3,"",20170101,20170331,5656]
[null,"GUANAJUATO","11DPT0006L",100,"PAMA720203B69","PAMA720203MGTLLL23","MA ALEXANDRA PALOMINO MALDONADO",111,20,"1130","1003","01","63","0000001",20,"630033",3,"",20170101,20170331,28518.25]
[null,"GUANAJUATO","11DPT0006L",100,"PEBJ680711PC1","PEBJ680711MGTRRN00","JUANA PEREZ BERNAL",111,18,"1130","1003","01","63","0000001",18,"630034",3,"",20170101,20170331,26901.91]
[null,"GUANAJUATO","11DPT0006L",100,"RAAG811213NX5","RAAG811213MGTMGD09","MARIA GUADALUPE RAMIREZ AGUIRRE",111,23,"1130","1003","01","63","0000001",23,"630036",3,"",20170101,20170331,29760.729999999996]
[null,"GUANAJUATO","11DPT0006L",100,"RABS681021GFA","RABS681021MGTMRL03","MA SOLEDAD RAMIREZ BERMUDEZ",111,21,"1130","1003","01","63","0000001",21,"630037",3,"",20170101,20170331,30965.360000000004]
[null,"GUANAJUATO","11DPT0006L",100,"RORM6503108B9","RORM650310MGTSDL03","MILAGROS ROSAS RODRIGUEZ",111,20,"1130","1003","01","63","0000001",20,"630040",3,"",20170101,20170331,21887.570000000003]
[null,"GUANAJUATO","11DPT0006L",100,"SAMM791219U15","SAMM791219MGTVDG08","MARIA MAGDALENA SAAVEDRA MEDRANO",111,15,"1130","1003","01","63","0000001",15,"630041",3,"",20170101,20170331,18175.810000000001]
[null,"GUANAJUATO","11DPT0006L",100,"SAGI850902B58","SAGI850902MJCNNS03","ISAURA SANCHEZ GONZALEZ",111,24,"1130","1003","01","63","0000001",24,"630044",3,"",20170101,20170331,21445.690000000002]
[null,"GUANAJUATO","11DPT0006L",100,"SAMC7308072M6","SAMC730807MGTNRR25","MA. DEL CARMEN SANCHEZ MORENO",111,24,"1130","1003","01","63","0000001",24,"630045",3,"",20170101,20170331,21501.120000000003]
[null,"GUANAJUATO","11DPT0006L",100,"SARP720603511","SARP720603HGTNMD03","PEDRO SANCHEZ RAMIREZ",111,20,"1130","1003","01","63","0000001",20,"630046",3,"",20170101,20170331,7250.7199999999993]
[null,"GUANAJUATO","11DPT0006L",100,"VAMM770825UBA","VAMM770825HGTLLG05","JOSE MIGUEL VALDEZ MALDONADO",111,21,"1130","1003","01","63","0000001",21,"630050",3,"",20170101,20170331,24715.570000000003]
[null,"GUANAJUATO","11DPT0006L",100,"VAOJ7001319KA","VAOJ700131HGTZRN02","JOSE JUAN VAZQUEZ ORTEGA",111,27,"1130","1003","01","63","0000001",27,"630053",3,"",20170101,20170331,20755.27]
[null,"GUANAJUATO","11DPT0006L",100,"VESJ58011884A","VESJ580118HGTGNN01","JUAN CARLOS VEGA SANCHEZ",111,20,"1130","1003","01","63","0000001",20,"630055",3,"",20170101,20170331,20591.400000000001]
[null,"GUANAJUATO","11DPT0006L",100,"ZAGG741211FF0","ZAGG741211MMNCND04","MARIA GUADALUPE ZACARIAS GONZALEZ",111,19,"1130","1003","01","63","0000001",19,"630056",3,"",20170101,20170331,23437.040000000005]
[null,"GUANAJUATO","11DPT0006L",100,"LOHE8811064TA","LOHE881106MJCPRD00","EDITH LOPEZ HERNANDEZ",111,12,"1130","1003","01","63","0000001",12,"630067",3,"",20170101,20170331,2728.9500000000003]
[null,"GUANAJUATO","11DPT0006L",100,"MASE831216GZ4","MASE831216MGTNTL05","ELIA MANDUJANO SOTO",111,10,"1130","1003","01","63","0000001",10,"630068",3,"",20170101,20170331,7276.2]
[null,"GUANAJUATO","11DPT0006L",100,"GUSS851005CT6","GUSS851005MGTLNN08","SANDRA GUILLEN SANCHEZ",111,21,"1130","1003","01","63","0000001",21,"630080",3,"",20170101,20170331,20756.37]
[null,"GUANAJUATO","11DPT0006L",100,"GUSG880306VD5","GUSG880306HGTLNR09","GERARDO GUILLEN SANCHEZ",111,12,"1130","1003","01","63","0000001",12,"630093",3,"",20170101,20170331,4418.29]
[null,"GUANAJUATO","11DPT0006L",100,"RAMO6702175A0","RAMO670217MMNNJL07","OLGA OFELIA RANGEL MEJIA",111,21,"1130","1003","01","63","0000001",21,"630098",3,"",20170101,20170331,23920.19]
[null,"GUANAJUATO","11DPT0006L",100,"QUCF750215ST6","QUCF750215HPLRRR00","FERNANDO QUIROZ CORONA",111,9,"1130","1003","01","63","0000001",9,"630115",3,"",20170101,20170331,4878.3]
[null,"GUANAJUATO","11DPT0006L",100,"HESS8606251E6","HESS860625MGTRNM00","SAMANTHA MONSERRAT HERNANDEZ SANCHEZ",111,20,"1130","1003","01","63","0000001",20,"630122",3,"",20170101,20170331,3269.87]
[null,"GUANAJUATO","11DPT0009I",100,"AAGG8604281N4","AAGG860428MGTLRD04","MARIA GUADALUPE ALAMILLA GARCIA",111,24,"1130","1003","01","74","0000001",24,"740002",3,"",20170101,20170331,22599.829999999998]
[null,"GUANAJUATO","11DPT0009I",100,"AACN800319VC6","AACN800319MGTYRY15","NAYELI DE JESUS AYALA CARRERA",111,25,"1130","1003","01","74","0000001",25,"740004",3,"",20170101,20170331,24019.75]
[null,"GUANAJUATO","11DPT0009I",100,"CASM6003305D3","CASM600330HGTMTL02","MELCHOR CAMPOS SOTO",111,25,"1130","1003","01","74","0000001",25,"740007",3,"",20170101,20170331,21975.940000000002]
[null,"GUANAJUATO","11DPT0009I",100,"CACC741121MK3","CACC741121HGTSRR01","CARLOS ALBERTO CASTILLO CRUZ",111,15,"1130","1003","01","74","0000001",15,"740008",3,"",20170101,20170331,16377.349999999999]
[null,"GUANAJUATO","11DPT0009I",100,"COGB581101LL6","COGB581101HGTRMN07","BENJAMIN CORONA GOMEZ",111,15,"1130","1003","01","74","0000001",15,"740009",3,"",20170101,20170331,1234.5299999999993]
[null,"GUANAJUATO","11DPT0009I",100,"LEHM650906984","LEHM650906HGTNRG07","MIGUEL ANGEL DE LEON HURTADO",111,16,"1130","1003","01","74","0000001",16,"740010",3,"",20170101,20170331,8422.2199999999993]
[null,"GUANAJUATO","11DPT0009I",100,"FEPD7803235M7","FEPD780323MGTLRL01","DELIA FELIPE PEREZ",111,20,"1130","1003","01","74","0000001",20,"740011",3,"",20170101,20170331,24234.54]
[null,"GUANAJUATO","11DPT0009I",100,"GAPA750814NW2","GAPA750814MDFMRN01","ANGIE GAMBOA PEREZ",111,15,"1130","1003","01","74","0000001",15,"740012",3,"",20170101,20170331,11882.830000000002]
[null,"GUANAJUATO","11DPT0009I",100,"GOAJ7711065Z5","GOAJ771106HGTNLN00","JUAN PABLO GONZALEZ ALVARADO",111,20,"1130","1003","01","74","0000001",20,"740014",3,"",20170101,20170331,16072.2]
[null,"GUANAJUATO","11DPT0009I",100,"GOMO860112AC6","GOMO860112HDFNRM01","OMAR FRANCISCO GONZALEZ MARTINEZ",111,15,"1130","1003","01","74","0000001",15,"740015",3,"",20170101,20170331,19611.240000000002]
[null,"GUANAJUATO","11DPT0009I",100,"IACC631023AI2","IACC631023HGTBNH06","CUAUHTEMOC IBARRA CANO",111,20,"1130","1003","01","74","0000001",20,"740016",3,"",20170101,20170331,21187.500000000004]
[null,"GUANAJUATO","11DPT0009I",100,"MATG681016SW7","MATG681016HGTGFR08","GERARDO MAGAÑA TAFOYA",111,29,"1130","1003","01","74","0000001",29,"740019",3,"",20170101,20170331,25239.910000000003]
[null,"GUANAJUATO","11DPT0009I",100,"MALS720215M37","MALS720215MGTRPR06","SARA MARTINEZ LOPEZ",111,20,"1130","1003","01","74","0000001",20,"740020",3,"",20170101,20170331,23181.370000000003]
[null,"GUANAJUATO","11DPT0009I",100,"MEAA781114FWA","MEAA781114MGTDRD01","ADRIANA MEDEL ARROYO",111,20,"1130","1003","01","74","0000001",20,"740021",3,"",20170101,20170331,24364.480000000003]
[null,"GUANAJUATO","11DPT0009I",100,"MEGM731204L93","MEGM731204MGTNZR02","MARISA MENDEZ GUZMAN",111,15,"1130","1003","01","74","0000001",15,"740022",3,"",20170101,20170331,18490.28]
[null,"GUANAJUATO","11DPT0009I",100,"AAVL730510P19","AAVL730510MGTYLR00","LAURA ELENA AYALA VALTIERRA",111,20,"1130","1003","01","74","0000001",20,"740024",3,"",20170101,20170331,26286.190000000002]
[null,"GUANAJUATO","11DPT0009I",100,"MOCM7012151Q9","MOCM701215MGTRNN01","MANUELA MORALES CENDEJAS",111,10,"1130","1003","01","74","0000001",10,"740025",3,"",20170101,20170331,14424.71]
[null,"GUANAJUATO","11DPT0009I",100,"PABG6901266Q2","PABG690126HGTZNR06","GERARDO PAZ BONILLA",111,15,"1130","1003","01","74","0000001",15,"740026",3,"",20170101,20170331,13868.900000000001]
[null,"GUANAJUATO","11DPT0009I",100,"PEFD7301136V8","PEFD730113HGTRLV06","DAVID PEREZ FELIPE",111,24,"1130","1003","01","74","0000001",24,"740027",3,"",20170101,20170331,12540.17]
[null,"GUANAJUATO","11DPT0009I",100,"PESA790927U25","PESA790927MGTRTN06","ANDREA MAGDALENA PEREZ SOTO",111,30,"1130","1003","01","74","0000001",30,"740028",3,"",20170101,20170331,33515.949999999997]
[null,"GUANAJUATO","11DPT0009I",100,"RARM770914S13","RARM770914HGTNYR07","MAURICIO RANGEL REYES",111,20,"1130","1003","01","74","0000001",20,"740029",3,"",20170101,20170331,20363.560000000001]
[null,"GUANAJUATO","11DPT0009I",100,"RIRG760502K16","RIRG760502MGTVDW04","GWENDOLYNE ERENDIRA RIVAS RODRIGUEZ",111,10,"1130","1003","01","74","0000001",10,"740030",3,"",20170101,20170331,12333.110000000002]
[null,"GUANAJUATO","11DPT0009I",100,"RONS740802CB3","RONS740802HGTCXL05","SALVADOR ROCHA NUÑEZ",111,21,"1130","1003","01","74","0000001",21,"740031",3,"",20170101,20170331,16145.900000000003]
[null,"GUANAJUATO","11DPT0009I",100,"ROCC7912019U3","ROCC791201HGTDHS03","CESAR ADRIAN RODRIGUEZ CHAVEZ",111,18,"1130","1003","01","74","0000001",18,"740032",3,"",20170101,20170331,18369.099999999999]
[null,"GUANAJUATO","11DPT0009I",100,"ROVA6201238U9","ROVA620123HGTDGL01","ALFONSO RODRIGUEZ VEGA",111,21,"1130","1003","01","74","0000001",21,"740033",3,"",20170101,20170331,22055.41]
[null,"GUANAJUATO","11DPT0009I",100,"SATJ701026RC3","SATJ701026HGTNFS09","JOSE SANCHEZ TAFOYA",111,10,"1130","1003","01","74","0000001",10,"740034",3,"",20170101,20170331,12495.87]
[null,"GUANAJUATO","11DPT0009I",100,"SAPR691204HS9","SAPR691204MGTNRS09","ROSA ELIA SANDOVAL PRADO",111,26,"1130","1003","01","74","0000001",26,"740035",3,"",20170101,20170331,29694.52]
[null,"GUANAJUATO","11DPT0009I",100,"SOSP630208MC6","SOSP630208HGTTCD07","PEDRO SOTO SAUCEDO",111,8,"1130","1003","01","74","0000001",8,"740036",3,"",20170101,20170331,8241.5399999999991]
[null,"GUANAJUATO","11DPT0009I",100,"TEAC711130CQ2","TEAC711130MGTJDL00","CLAUDIA ELENA TEJEDA ADAME",111,11,"1130","1003","01","74","0000001",11,"740037",3,"",20170101,20170331,15796.18]
[null,"GUANAJUATO","11DPT0009I",100,"TEAR801024C6A","TEAR801024MGTJDS18","ROSA BEATRIZ TEJEDA ADAME",111,15,"1130","1003","01","74","0000001",15,"740038",3,"",20170101,20170331,19124.169999999998]
[null,"GUANAJUATO","11DPT0009I",100,"TOAA8408254S3","TOAA840825MGRRYD03","ADRIANA TORRES AYALA",111,16,"1130","1003","01","74","0000001",16,"740039",3,"",20170101,20170331,18357.580000000002]
[null,"GUANAJUATO","11DPT0009I",100,"TOAB770225NZ9","TOAB770225MGTRRR00","BERENICE TORRES ARROYO",111,25,"1130","1003","01","74","0000001",25,"740040",3,"",20170101,20170331,26410.9]
[null,"GUANAJUATO","11DPT0009I",100,"VASD820426CR9","VASD820426HGTRTV05","DAVID VARGAS SOTO",111,12,"1130","1003","01","74","0000001",12,"740041",3,"",20170101,20170331,10360.170000000002]
[null,"GUANAJUATO","11DPT0009I",100,"ZARG620614QCA","ZARG620614MGTRMR02","GRACIELA ZARAGOZA ROMERO",111,15,"1130","1003","01","74","0000001",15,"740042",3,"",20170101,20170331,9562.2999999999993]
[null,"GUANAJUATO","11DPT0009I",100,"VAEM800823M12","VAEM800823MGTZLR07","MARIA MARISELA VAZQUEZ ELIZARRARAS",111,12,"1130","1003","01","74","0000001",12,"740043",3,"",20170101,20170331,7766.12]
[null,"GUANAJUATO","11DPT0009I",100,"AOZL870509IYA","AOZL870509MGTLRC04","LUCIA ALONSO ZARAGOZA",111,18,"1130","1003","01","74","0000001",18,"740047",3,"",20170101,20170331,17168.61]
[null,"GUANAJUATO","11DPT0009I",100,"VAMB781025HC6","VAMB781025MGTZRT08","BEATRIZ VAZQUEZ MARTINEZ",111,10,"1130","1003","01","74","0000001",10,"740048",3,"",20170101,20170331,5937.2000000000007]
[null,"GUANAJUATO","11DPT0009I",100,"AIGJ671012FB4","AIGJ671012HGTRZS09","JOSE JESUS ARIAS GUZMAN",111,6,"1130","1003","01","74","0000001",6,"740060",3,"",20170101,20170331,2963.26]
[null,"GUANAJUATO","11DPT0007K",100,"AEIS580223D43","AEXI580223HGTDXS09","ISMAEL AEDO",111,18,"1130","1003","02","03","0000001",18,"030001",3,"",20170101,20170331,16011.329999999998]
[null,"GUANAJUATO","11DPT0007K",100,"AEME830910KL9","AEME830910MGTDRS08","ESPERANZA AEDO DE MARIA Y CAMPOS",111,15,"1130","1003","02","03","0000001",15,"030002",3,"",20170101,20170331,12456.86]
[null,"GUANAJUATO","11DPT0007K",100,"AULY531226UY7","AULY531226MDFGDL03","YOLANDA ERENDIRA AGUILAR LEDESMA",111,18,"1130","1003","02","03","0000001",18,"030003",3,"",20170101,20170331,11815.77]
[null,"GUANAJUATO","11DPT0007K",100,"AAGE740808PN4","AAGE740808HGTLRM03","EMMANUEL FRANCISCO ALCARAZ GARCIA",111,16,"1130","1003","02","03","0000001",16,"030004",3,"",20170101,20170331,13693.01]
[null,"GUANAJUATO","11DPT0007K",100,"AONL720204923","AONL720204MGTLXT01","MA LETICIA ALONSO NUÑEZ",111,15,"1130","1003","02","03","0000001",15,"030005",3,"",20170101,20170331,12932.23]
[null,"GUANAJUATO","11DPT0007K",100,"AEBM7404088T6","AEBM740408HGTRCG06","MIGUEL ANGEL ARELLANO BECERRA",111,24,"1130","1003","02","03","0000001",24,"030007",3,"",20170101,20170331,14958.36]
[null,"GUANAJUATO","11DPT0007K",100,"CARS840701PT4","CARS840701MGTHMR06","SARAH GABRIELA CHAVEZ RAMIREZ",111,18,"1130","1003","02","03","0000001",18,"030018",3,"",20170101,20170331,15896.689999999999]
[null,"GUANAJUATO","11DPT0007K",100,"CIOV5211227Z3","CIOV521122HDFSRC01","VICTOR SAMUEL CISNEROS ORTEGA",111,21,"1130","1003","02","03","0000001",21,"030019",3,"",20170101,20170331,22125.040000000001]
[null,"GUANAJUATO","11DPT0007K",100,"COGA610228CT2","COGA610228HDFRRL00","ALFONSO CORONA GARCIA",111,22,"1130","1003","02","03","0000001",22,"030020",3,"",20170101,20170331,25194.980000000003]
[null,"GUANAJUATO","11DPT0007K",100,"COBT640419U79","COBT640419HGTRZD01","TEODORO CORTES BUZO",111,28,"1130","1003","02","03","0000001",28,"030022",3,"",20170101,20170331,28290.200000000004]
[null,"GUANAJUATO","11DPT0007K",100,"EOTJ551129MU2","EOTS551129HGTSPT10","J. SATURNINO ESCOTO TAPIA",111,15,"1130","1003","02","03","0000001",15,"030026",3,"",20170101,20170331,14558.97]
[null,"GUANAJUATO","11DPT0007K",100,"GACM6402137QA","GACM640213MGTRHR05","MARICELA GARCIA CHAVEZ",111,21,"1130","1003","02","03","0000001",21,"030031",3,"",20170101,20170331,29767.829999999998]
[null,"GUANAJUATO","11DPT0007K",100,"GAGA6703123EA","GAGA670312HGTSNL02","JOSE ALFREDO GASCA GONZALEZ",111,29,"1130","1003","02","03","0000001",29,"030032",3,"",20170101,20170331,34862.75]
[null,"GUANAJUATO","11DPT0007K",100,"GOPS6802087F1","GOPS680208HGTNDN00","SANTIAGO GONZALEZ PADILLA",111,18,"1130","1003","02","03","0000001",18,"030034",3,"",20170101,20170331,26264.940000000002]
[null,"GUANAJUATO","11DPT0007K",100,"GULM751128PE3","GULM751128HGTRNR07","MARIO DE JESUS GUERRERO LUNA",111,26,"1130","1003","02","03","0000001",26,"030035",3,"",20170101,20170331,31818.670000000002]
[null,"GUANAJUATO","11DPT0007K",100,"GUHG690324J87","GUHG690324HGTTRB00","GABRIEL GUTIERREZ HERNANDEZ",111,15,"1130","1003","02","03","0000001",15,"030036",3,"",20170101,20170331,19654.190000000002]
[null,"GUANAJUATO","11DPT0007K",100,"GUHM640516HF8","GUHM640516MGTTRR04","MARTHA GUTIERREZ HERNANDEZ",111,28,"1130","1003","02","03","0000001",28,"030037",3,"",20170101,20170331,28315.760000000002]
[null,"GUANAJUATO","11DPT0007K",100,"GUHR661007QW0","GUHR661007MGTTRC18","ROCIO DEL ROSARIO GUTIERREZ HERNANDEZ",111,30,"1130","1003","02","03","0000001",30,"030038",3,"",20170101,20170331,29500.350000000002]
[null,"GUANAJUATO","11DPT0007K",100,"GOOC700123LY6","GOOC700123MGTMRR07","MA DEL CARMEN GOMEZ OROPEZA",111,30,"1130","1003","02","03","0000001",30,"030040",3,"",20170101,20170331,36327.74]
[null,"GUANAJUATO","11DPT0007K",100,"LELJ740926PK3","LELJ740926HJCNPN01","JUAN ANTONIO LEON LOPEZ",111,15,"1130","1003","02","03","0000001",15,"030046",3,"",20170101,20170331,16851.740000000002]
[null,"GUANAJUATO","11DPT0007K",100,"LORF540804250","LORF540804HJCPLR09","FRANCISCO JAVIER LOPEZ RUELAS",111,29,"1130","1003","02","03","0000001",29,"030047",3,"",20170101,20170331,25534.699999999997]
[null,"GUANAJUATO","11DPT0007K",100,"MAHE740312EP4","MAHE740312MJCLRR09","ERIKA GUADALUPE MALDONADO HERNANDEZ",111,21,"1130","1003","02","03","0000001",21,"030051",3,"",20170101,20170331,24838.42]
[null,"GUANAJUATO","11DPT0007K",100,"MAMD780104I25","MAMD780104MGTTRL05","MARIA DOLORES MATA MARTINEZ",111,29,"1130","1003","02","03","0000001",29,"030054",3,"",20170101,20170331,34684.620000000003]
[null,"GUANAJUATO","11DPT0007K",100,"MEGL640103827","MEGL640103MGTLTT08","MA. LETICIA MELENDEZ GUTIERREZ",111,29,"1130","1003","02","03","0000001",29,"030056",3,"",20170101,20170331,31879.67]
[null,"GUANAJUATO","11DPT0007K",100,"MESM670501FH5","MESM670501HDFNGR03","MARCO ALFREDO MENDOZA SEGURA",111,28,"1130","1003","02","03","0000001",28,"030057",3,"",20170101,20170331,26571.43]
[null,"GUANAJUATO","11DPT0007K",100,"MOVJ75111289A","MOVJ751112HJCRRR01","JORGE ARMANDO MORALES VARGAS",111,20,"1130","1003","02","03","0000001",20,"030060",3,"",20170101,20170331,20787.62]
[null,"GUANAJUATO","11DPT0007K",100,"NAGM7308014C0","NAGM730801MGTJZR05","MARCELA NAJERA GUZMAN",111,30,"1130","1003","02","03","0000001",30,"030064",3,"",20170101,20170331,31517.309999999998]
[null,"GUANAJUATO","11DPT0007K",100,"OIMD8504181Z5","OIMD850418MGTLRN00","DIANA OLIVA MORENO",111,12,"1130","1003","02","03","0000001",12,"030065",3,"",20170101,20170331,2383.8000000000002]
[null,"GUANAJUATO","11DPT0007K",100,"RICE740107C14","RICE740107MGTVSR06","ERICA ADRIANA RIVERA CISNEROS",111,30,"1130","1003","02","03","0000001",30,"030072",3,"",20170101,20170331,29793.840000000004]
[null,"GUANAJUATO","11DPT0007K",100,"ROOO570222BT6","ROOO570222HDFJRM05","OMAR ROJAS OROZCO",111,20,"1130","1003","02","03","0000001",20,"030075",3,"",20170101,20170331,11463.76]
[null,"GUANAJUATO","11DPT0007K",100,"SOMJ5508087H2","SOMJ550808MGTTRN02","JUANA SOTO MORAN",111,21,"1130","1003","02","03","0000001",21,"030081",3,"",20170101,20170331,24381.55]
[null,"GUANAJUATO","11DPT0007K",100,"TAGL820524R17","TAGL820524MGTPMZ06","MARIA DE LA LUZ TAPIA GOMEZ",111,15,"1130","1003","02","03","0000001",15,"030084",3,"",20170101,20170331,22978.68]
[null,"GUANAJUATO","11DPT0007K",100,"TIEA7005021TA","TIEA700502MDFHSN02","ANGELICA THIRION ESCUDER",111,28,"1130","1003","02","03","0000001",28,"030085",3,"",20170101,20170331,30035.320000000003]
[null,"GUANAJUATO","11DPT0007K",100,"UIRA650703JZ5","UIRA650703MDFRML07","MARIA ALEJANDRA URIBE RAMIREZ",111,20,"1130","1003","02","03","0000001",20,"030086",3,"",20170101,20170331,30162.6]
[null,"GUANAJUATO","11DPT0007K",100,"VIBM7702283A2","VIBM770228HDFLRR01","MAURICIO VILCHIS BARCENAS",111,21,"1130","1003","02","03","0000001",21,"030093",3,"",20170101,20170331,25793.45]
[null,"GUANAJUATO","11DPT0007K",100,"ZARG760122LM0","ZARG760122MGTRDR05","GRACIELA ZARAGOZA RODRIGUEZ",111,32,"1130","1003","02","03","0000001",32,"030096",3,"",20170101,20170331,40225.42]
[null,"GUANAJUATO","11DPT0007K",100,"BEJE700403E37","BEXJ700403HGTLXS00","JESUS GERARDO  BELMONTE",111,15,"1130","1003","02","03","0000001",15,"030100",3,"",20170101,20170331,10890.58]
[null,"GUANAJUATO","11DPT0007K",100,"ROHO780227K98","ROXH780227MGTCXN02","PAOLA ROCHA HONORINA",111,22,"1130","1003","02","03","0000001",22,"030126",3,"",20170101,20170331,27717.020000000004]
[null,"GUANAJUATO","11DPT0007K",100,"AUVG860513KD9","AUVG860513MGTNZD03","MARIA GUADALUPE ANGUIANO VAZQUEZ",111,17,"1130","1003","02","03","0000001",17,"030127",3,"",20170101,20170331,15361.740000000002]
[null,"GUANAJUATO","11DPT0007K",100,"ROML710901QS2","ROML710901MGTDRT00","LETICIA RODRIGUEZ MORALES",111,20,"1130","1003","02","03","0000001",20,"030128",3,"",20170101,20170331,5562.2]
[null,"GUANAJUATO","11DPT0007K",100,"DIVA711128CB2","DIVA711128MMCZGL03","ALEJANDRA DIAZ VEGA",111,12,"1130","1003","02","03","0000001",12,"030132",3,"",20170101,20170331,14016.240000000002]
[null,"GUANAJUATO","11DPT0007K",100,"LAMV790816VD9","LAMV790816MGTRNN04","VANESSA GEOVANNA LARIOS MINJARES",111,12,"1130","1003","02","03","0000001",12,"030137",3,"",20170101,20170331,11919.000000000002]
[null,"GUANAJUATO","11DPT0007K",100,"MOVM841118GC2","MOVM841118MGTNRR09","MARIELA JOCELYN MONTIEL VERA",111,11,"1130","1003","02","03","0000001",11,"030143",3,"",20170101,20170331,3668.4]
[null,"GUANAJUATO","11DPT0007K",100,"MEZJ750302AC9","MEZJ750302HGTNPR00","JORGE MENDOZA ZAPATA",111,19,"1130","1003","02","03","0000001",19,"030152",3,"",20170101,20170331,19220.920000000002]
[null,"GUANAJUATO","11DPT0007K",100,"GUMR8110123U3","GUMR811012HCHZNM08","RAMIRO GUZMAN MONTES",111,10,"1130","1003","02","03","0000001",10,"030153",3,"",20170101,20170331,12051.43]
[null,"GUANAJUATO","11DPT0007K",100,"OIAE780131HL9","OIAE780131HGTNLD06","EDGAR JIONEL ONTIVEROS ALCALA",111,16,"1130","1003","02","03","0000001",16,"030156",3,"",20170101,20170331,18593.2]
[null,"GUANAJUATO","11DPT0007K",100,"OEGR7911068I7","OEGR791106MGTRMS01","ROSA MARIA ORNELAS GOMEZ",111,13,"1130","1003","02","03","0000001",13,"030157",3,"",20170101,20170331,15514.29]
[null,"GUANAJUATO","11DPT0007K",100,"CEDC850505LX0","CEDC850505HGTRRR07","CARLOS ADRIAN CERVANTES DURAN",111,16,"1130","1003","02","03","0000001",16,"030159",3,"",20170101,20170331,11783.33]
[null,"GUANAJUATO","11DPT0007K",100,"GOOE760928BN1","GOOE760928HGTMRN01","ENRIQUE ALEJANDRO GOMEZ OROPEZA",111,14,"1130","1003","02","03","0000001",14,"030160",3,"",20170101,20170331,18663.030000000002]
[null,"GUANAJUATO","11DPT0007K",100,"HEAM5406144E9","HEAM540614MDFRRR09","MARISELA HERRERA ARVIZU",111,19,"1130","1003","02","03","0000001",19,"030172",3,"",20170101,20170331,18660.660000000003]
[null,"GUANAJUATO","11DPT0007K",100,"RALS8203241F7","RALS820324MGTMZL03","SILVIA AYDEE RAMIREZ LOZANO",111,20,"1130","1003","02","03","0000001",20,"030176",3,"",20170101,20170331,10852.370000000003]
[null,"GUANAJUATO","11DPT0007K",100,"FERA670304TV9","FERA670304HGTRCL01","ALBERTO FERNANDEZ RICO",111,20,"1130","1003","02","03","0000001",20,"030178",3,"",20170101,20170331,3575.7000000000003]
[null,"GUANAJUATO","11DPT0007K",100,"CAGS660709C18","CAGS660709MGTHRS01","SUSANA CHAVEZ GUERRA",111,21,"1130","1003","02","03","0000001",21,"030180",3,"",20170101,20170331,13971.77]
[null,"GUANAJUATO","11DPT0007K",100,"MORB790906FV5","MORB790906MGTNSR05","BERTHA ALICIA MONJARAZ RIOS",111,17,"1130","1003","02","03","0000001",17,"030182",3,"",20170101,20170331,24965.710000000003]
[null,"GUANAJUATO","11DPT0007K",100,"MAMX651202NJ5","MXME651202MGTTRV07","EVA MATA MARTINEZ",111,20,"1130","1003","02","03","0000001",20,"030188",3,"",20170101,20170331,22520.1]
[null,"GUANAJUATO","11DPT0007K",100,"RUBS800124TR0","RUBS800124HGTZRL06","SAUL RUIZ BERBENA",111,24,"1130","1003","02","03","0000001",24,"030189",3,"",20170101,20170331,29347.199999999997]
[null,"GUANAJUATO","11DPT0007K",100,"RORL860709G29","RORL860709MGTDML06","LILIA BERENICE RODRIGUEZ RAMIREZ",111,22,"1130","1003","02","03","0000001",22,"030191",3,"",20170101,20170331,18971.18]
[null,"GUANAJUATO","11DPT0007K",100,"RAVM831112KP8","RAVM831112MGTMLN01","MONICA DE LA LUZ RAMIREZ VILLANUEVA",111,30,"1130","1003","02","03","0000001",30,"030195",3,"",20170101,20170331,28990.940000000002]
[null,"GUANAJUATO","11DPT0007K",100,"OELL840306742","OELL840306MGTRNR06","LAURA DEL ROCIO ORNELAS LUNA",111,18,"1130","1003","02","03","0000001",18,"030199",3,"",20170101,20170331,20090.599999999999]
[null,"GUANAJUATO","11DPT0007K",100,"AARJ840101C55","AARJ840101HGTLYS03","JESUS ISRAEL ALBA REYES",111,28,"1130","1003","02","03","0000001",28,"030200",3,"",20170101,20170331,18264.18]
[null,"GUANAJUATO","11DPT0007K",100,"RICM7009187Q5","RICM700918HGTVSG07","MIGUEL ANGEL RIVERA CISNEROS",111,21,"1130","1003","02","03","0000001",21,"030215",3,"",20170101,20170331,22634.74]
[null,"GUANAJUATO","11DPT0007K",100,"MARJ740212TP0","MARJ740212HGTRDS04","JOSE DE JESUS MARTINEZ RODRIGUEZ",111,20,"1130","1003","02","03","0000001",20,"030218",3,"",20170101,20170331,7018.97]
[null,"GUANAJUATO","11DPT0007K",100,"RELL7409136N7","RELL740913HGTYRS09","JOSE LUIS REYES LARA",111,20,"1130","1003","02","03","0000001",20,"030220",3,"",20170101,20170331,3178.4]
[null,"GUANAJUATO","11DPT0007K",100,"GOBA8411109SA","GOBA841110MGTNNL06","ALMA CECILIA GONZALEZ BUENDIA",111,20,"1130","1003","02","03","0000001",20,"030232",3,"",20170101,20170331,5959.5]
[null,"GUANAJUATO","11DPT0007K",100,"GAML640822UM9","GAML640822MDFRNT04","MARIA LETICIA GARCIA MENDEZ",111,20,"1130","1003","02","03","0000001",20,"030237",3,"",20170101,20170331,25709.39]
[null,"GUANAJUATO","11DPT0007K",100,"COFO8404084A4","COFO840408HGTNRS02","OSCAR  ALEJANDRO CONCHAS FRANCO",111,20,"1130","1003","02","03","0000001",20,"030242",3,"",20170101,20170331,10722.83]
[null,"GUANAJUATO","11DPT0007K",100,"GAML700607499","GAML700607HGTLXS02","LUIS ROBERTO GALLEGOS MUÑOZ",111,20,"1130","1003","02","03","0000001",20,"030243",3,"",20170101,20170331,5164.8999999999996]
[null,"GUANAJUATO","11DPT0007K",100,"HUQL680518G68","HUQL680518HGTRNS08","LUIS GERARDO HURTADO QUINTANA",111,20,"1130","1003","02","03","0000001",20,"030244",3,"",20170101,20170331,4585.5]
[null,"GUANAJUATO","11DPT0007K",100,"RAMM8704167H6","RAMM870416MCMNRR00","MARGARITA ZARAHY RANGEL MARTINEZ",111,20,"1130","1003","02","03","0000001",20,"030246",3,"",20170101,20170331,9535.2000000000007]
[null,"GUANAJUATO","11DPT0007K",100,"GUVC900306RV8","GUVC900306HGTTNH09","CHRISTIAN JUAN DE DIOS GUTIERREZ VENEGAS",111,20,"1130","1003","02","03","0000001",20,"030250",3,"",20170101,20170331,8601.83]
[null,"GUANAJUATO","11DPT0007K",100,"AAGL5509065W0","AAGL550906HGTRZS02","JOSE LUIS ARAIZA GUZMAN",111,20,"1130","1003","02","03","0000001",20,"030251",3,"",20170101,20170331,3973]
[null,"GUANAJUATO","11DPT0007K",100,"LOGM890424T1A","LOGM890424MGTPTL01","MELISSA LOPEZ GUTIERREZ",111,20,"1130","1003","02","03","0000001",20,"030252",3,"",20170101,20170331,2121]
[null,"GUANAJUATO","11DPT0007K",100,"GARG881113FU7","GARG881113HGTRDL05","GUILLERMO GARCIA RODRIGUEZ",111,20,"1130","1003","02","03","0000001",20,"030264",3,"",20170101,20170331,7070]
[null,"GUANAJUATO","11DPT0007K",100,"MORO871110AJ6","MORO871110HGTRYS05","OSCAR ANDRES MORALES REYES",111,20,"1130","1003","02","03","0000001",20,"030285",3,"",20170101,20170331,3973]
[null,"GUANAJUATO","11DPT0007K",100,"GAGF890420BW4","GAGF890420HNLRRR09","FRANCISCO GARZA GUERRA",111,20,"1130","1003","02","03","0000001",20,"030289",3,"",20170101,20170331,3973]
[null,"GUANAJUATO","11DPT0007K",100,"PIMG610824350","PIMG610824HGTXLB08","GABRIEL PIÑA MOLINA",111,20,"1130","1003","02","03","0000001",20,"030290",3,"",20170101,20170331,6754.1]
[null,"GUANAJUATO","11DPT0007K",100,"BIGG740809I66","BIGG740809MGTRMD06","MA. GUADALUPE BRIZUELA GAMIÑO",111,20,"1130","1003","02","03","0000001",20,"030291",3,"",20170101,20170331,13931.02]
[null,"GUANAJUATO","11DPT0007K",100,"CAGI700403K87","CAGI700403MGTRNR05","MA. IRENE CARRANCO GONZALEZ",111,20,"1130","1003","02","03","0000001",20,"030292",3,"",20170101,20170331,5656]
[null,"GUANAJUATO","11DPT0007K",100,"HEIL950924F53","HEIL950924HGTRRS00","LUIS RICARDO HERNANDEZ IRASTORZA",111,20,"1130","1003","02","03","0000001",20,"030294",3,"",20170101,20170331,6457.27]
[null,"GUANAJUATO","11DPT0007K",100,"SAGI670217B71","SAGI670217MGTNRM01","IMELDA SANTOYO GARCIA",111,20,"1130","1003","02","03","0000001",20,"030295",3,"",20170101,20170331,5302.5]
[null,"GUANAJUATO","11DPT0007K",100,"GARJ800225JL6","GARJ800225HGTSBR09","JOSE ANDRES GASCA RUBIO",111,20,"1130","1003","02","03","0000001",20,"030296",3,"",20170101,20170331,2292.7600000000002]
[null,"GUANAJUATO","11DPT0007K",100,"AAMA8811265W2","AAMA881126HGTMRN06","ANGEL FRANCISCO AMAYA MORALES",111,20,"1130","1003","02","03","0000001",20,"030297",3,"",20170101,20170331,3535]
[null,"GUANAJUATO","11DPT0007K",100,"FIHI930930DZ4","FIHI930930HGTGRS01","JOSE ISRAEL FIGUEROA HERNANDEZ",111,8,"1130","1003","02","03","0000001",8,"030298",3,"",20170101,20170331,4336.2700000000004]
[null,"GUANAJUATO","11DPT0007K",100,"PAGA670111I35","PAGA670111HNTLRR03","ARMANDO PALOMARES GARCIA",111,12,"1130","1003","02","03","0000001",12,"030300",3,"",20170101,20170331,8437.32]
[null,"GUANAJUATO","11DPT0010Y",100,"AUCR760401U5A","AUCR760401HGTGRC06","RICARDO AGUILAR CORONA",111,12,"1130","1003","02","04","0000001",12,"040001",3,"",20170101,20170331,10267.120000000001]
[null,"GUANAJUATO","11DPT0010Y",100,"AURJ751104NX7","AURJ751104HGTGDN09","JUAN CARLOS AGUIRRE RODRIGUEZ",111,21,"1130","1003","02","04","0000001",21,"040002",3,"",20170101,20170331,23326.87]
[null,"GUANAJUATO","11DPT0010Y",100,"AASR710311P25","AASR710311MGTLNC02","ROCIO DEL CARMEN ALMANZA SANDOVAL",111,25,"1130","1003","02","04","0000001",25,"040003",3,"",20170101,20170331,22160.46]
[null,"GUANAJUATO","11DPT0010Y",100,"AALJ72112271A","AALJ721122MGTLZN08","JUANA CECILIA ALVAREZ LOZANO",111,30,"1130","1003","02","04","0000001",30,"040004",3,"",20170101,20170331,13428.59]
[null,"GUANAJUATO","11DPT0010Y",100,"AAPM8304305FA","AAPM830430MGTLRY09","MAYRA DE GUADALUPE CELENE ALVAREZ PEREZ",111,18,"1130","1003","02","04","0000001",18,"040005",3,"",20170101,20170331,19910.080000000002]
[null,"GUANAJUATO","11DPT0010Y",100,"AEGE750228CT2","AEGE750228MGTRMR09","ERIKA AREVALO GOMEZ",111,23,"1130","1003","02","04","0000001",23,"040007",3,"",20170101,20170331,18488.260000000002]
[null,"GUANAJUATO","11DPT0010Y",100,"AOOV770724DZ8","AOOV770724MGTRRR09","VERONICA ARZOLA ORTEGA",111,28,"1130","1003","02","04","0000001",28,"040008",3,"",20170101,20170331,16020.920000000002]
[null,"GUANAJUATO","11DPT0010Y",100,"BAVB810501LRA","BAVB810501MGTRLL01","BLANCA ELIZABETH BARAJAS VALLEJO",111,20,"1130","1003","02","04","0000001",20,"040009",3,"",20170101,20170331,18234.72]
[null,"GUANAJUATO","11DPT0010Y",100,"CAGG7503244Z4","CAGG750324MGTBTB00","GABRIELA DEL CARMEN CABRERA GUTIERREZ",111,30,"1130","1003","02","04","0000001",30,"040010",3,"",20170101,20170331,20430.050000000003]
[null,"GUANAJUATO","11DPT0010Y",100,"CACX831109CP9","CXCA831109MGTMHM07","AMERICA CAMPOS CHAGOYA",111,14,"1130","1003","02","04","0000001",14,"040011",3,"",20170101,20170331,3973]
[null,"GUANAJUATO","11DPT0010Y",100,"CALA6404086Z8","CALA640408HGTDXL04","ALBERTO CAUDILLO LIÑAN",111,18,"1130","1003","02","04","0000001",18,"040014",3,"",20170101,20170331,24086.840000000004]
[null,"GUANAJUATO","11DPT0010Y",100,"CARL761027511","CARL761027MGTDZD04","LIDIA KAREM CAUDILLO RIZO",111,19,"1130","1003","02","04","0000001",19,"040015",3,"",20170101,20170331,15111.210000000001]
[null,"GUANAJUATO","11DPT0010Y",100,"EIDJ571003UH1","EIDC571003HGTSMS06","J COSME ESPINOZA DOMINGUEZ",111,10,"1130","1003","02","04","0000001",10,"040016",3,"",20170101,20170331,11999.03]
[null,"GUANAJUATO","11DPT0010Y",100,"FIOM790619I13","FIOM790619HDFLRH07","MAHY ROLANDO FILOMENO ORTIZ",111,15,"1130","1003","02","04","0000001",15,"040017",3,"",20170101,20170331,17325.419999999998]
[null,"GUANAJUATO","11DPT0010Y",100,"GAME651110B38","GAME651110HDFRRD00","EDUARDO GARCIA MORALES",111,20,"1130","1003","02","04","0000001",20,"040020",3,"",20170101,20170331,5804.75]
[null,"GUANAJUATO","11DPT0010Y",100,"GOAA670428AHA","GOAA670428MGTNLR05","ARACELI GONZALEZ ALVAREZ",111,15,"1130","1003","02","04","0000001",15,"040021",3,"",20170101,20170331,17859.14]
[null,"GUANAJUATO","11DPT0010Y",100,"GOHV780329HP0","GOHV780329MGTNRR00","VERONICA GONZALEZ HERNANDEZ",111,12,"1130","1003","02","04","0000001",12,"040022",3,"",20170101,20170331,14249.640000000001]
[null,"GUANAJUATO","11DPT0010Y",100,"HEDT700419HG2","HEDT700419HGTRRR01","JOSE TERESO HERNANDEZ DURAN",111,9,"1130","1003","02","04","0000001",9,"040024",3,"",20170101,20170331,3178.4]
[null,"GUANAJUATO","11DPT0010Y",100,"HERE800329V17","HERE800329HGTRDD03","EDGAR IVAN HERNANDEZ RODRIGUEZ",111,27,"1130","1003","02","04","0000001",27,"040025",3,"",20170101,20170331,19766.98]
[null,"GUANAJUATO","11DPT0010Y",100,"HIBA631027337","HIBA631027HGTNLN08","ANTONIO HINOJOSA BALANDRAN",111,23,"1130","1003","02","04","0000001",23,"040026",3,"",20170101,20170331,8740.6]
[null,"GUANAJUATO","11DPT0010Y",100,"JUBE7310241I6","JUBE731024MGTRLL05","ELIDUVINA JUAREZ BALANDRAN",111,15,"1130","1003","02","04","0000001",15,"040028",3,"",20170101,20170331,11534.670000000002]
[null,"GUANAJUATO","11DPT0010Y",100,"LORC760609NB1","LORC760609MDFPVL08","CLAUDETTE LOPEZ DE LA RIVA",111,20,"1130","1003","02","04","0000001",20,"040030",3,"",20170101,20170331,32990.61]
[null,"GUANAJUATO","11DPT0010Y",100,"LOVJ660127MI1","LOVJ660127HGTPLN03","JUAN LOPEZ VALENCIA",111,28,"1130","1003","02","04","0000001",28,"040032",3,"",20170101,20170331,8921.0400000000009]
[null,"GUANAJUATO","11DPT0010Y",100,"MAVR720809AXA","MAVR720809MGTNZS05","ROSA BEATRIZ MANJARREZ VAZQUEZ",111,30,"1130","1003","02","04","0000001",30,"040033",3,"",20170101,20170331,3154.4400000000005]
[null,"GUANAJUATO","11DPT0010Y",100,"MEMV791203112","MEVM791203HGTDZR15","MARIO MEDINA VAZQUEZ",111,15,"1130","1003","02","04","0000001",15,"040038",3,"",20170101,20170331,8778.67]
[null,"GUANAJUATO","11DPT0010Y",100,"MORA600920UJ0","MORA600920MGTSVN08","MA ANGELES MOSQUEDA RUVALCABA",111,26,"1130","1003","02","04","0000001",26,"040041",3,"",20170101,20170331,32120.54]
[null,"GUANAJUATO","11DPT0010Y",100,"MORR630513CT2","MORR630513HGTSVD06","RODOLFO MOSQUEDA RUVALCABA",111,20,"1130","1003","02","04","0000001",20,"040042",3,"",20170101,20170331,9738.4600000000009]
[null,"GUANAJUATO","11DPT0010Y",100,"NETN640509LW1","NETN640509MNLRRR02","NORA MERCEDES NEIRA TORRES",111,30,"1130","1003","02","04","0000001",30,"040045",3,"",20170101,20170331,2923.46]
[null,"GUANAJUATO","11DPT0010Y",100,"PATD7212262V2","PATD721226MGTCRL02","DULCE CONCEPCION PACHECO TORRES",111,25,"1130","1003","02","04","0000001",25,"040048",3,"",20170101,20170331,9021.9700000000012]
[null,"GUANAJUATO","11DPT0010Y",100,"PEGO840715TW6","PEGO840715MGTRRL04","OLGA CRISTINA PEREZ GUERRERO",111,24,"1130","1003","02","04","0000001",24,"040049",3,"",20170101,20170331,3178.4]
[null,"GUANAJUATO","11DPT0010Y",100,"PEGS750625V73","PEGS750625HGTRRR05","SERGIO JAVIER PEREZ GUERRERO",111,15,"1130","1003","02","04","0000001",15,"040050",3,"",20170101,20170331,9870.2900000000009]
[null,"GUANAJUATO","11DPT0010Y",100,"POAA7404163G8","POAA740416MDFRCN05","ANA LILIA PROA ACEVEDO",111,13,"1130","1003","02","04","0000001",13,"040053",3,"",20170101,20170331,5643.3]
[null,"GUANAJUATO","11DPT0010Y",100,"QUOG780110GB9","QUOG780110HGTNRN00","GONZALO QUINTANA ORTEGA",111,15,"1130","1003","02","04","0000001",15,"040055",3,"",20170101,20170331,15346.33]
[null,"GUANAJUATO","11DPT0010Y",100,"RACM561219L8A","RACM561219HGTMNR07","MARIO RAMIREZ CONTRERAS",111,9,"1130","1003","02","04","0000001",9,"040056",3,"",20170101,20170331,2190.1]
[null,"GUANAJUATO","11DPT0010Y",100,"RARM6206207M6","RARM620620HGTMDN03","MANUEL RAMIREZ RODRIGUEZ",111,12,"1130","1003","02","04","0000001",12,"040057",3,"",20170101,20170331,13431.55]
[null,"GUANAJUATO","11DPT0010Y",100,"RASA6006139AA","RASA600613HGTMLN04","ANTONIO RAMIREZ SOLIS",111,17,"1130","1003","02","04","0000001",17,"040058",3,"",20170101,20170331,16483.43]
[null,"GUANAJUATO","11DPT0010Y",100,"RAPB721103D6A","RAPB721103MMNMZT09","BEATRIZ EUGENIA RAMOS PAZ",111,15,"1130","1003","02","04","0000001",15,"040059",3,"",20170101,20170331,22561.71]
[null,"GUANAJUATO","11DPT0010Y",100,"RICA770621C14","RICA770621HDFCRL02","ALEJANDRO RICO CARMONA",111,20,"1130","1003","02","04","0000001",20,"040060",3,"",20170101,20170331,10317.39]
[null,"GUANAJUATO","11DPT0010Y",100,"RIRS720206SN4","RIRS720206MGTVML08","SOLEDAD SUSANA RIVERA RAMIREZ",111,20,"1130","1003","02","04","0000001",20,"040062",3,"",20170101,20170331,6754.07]
[null,"GUANAJUATO","11DPT0010Y",100,"ROGA700124964","ROGA700124MGTCZN09","ANA ELENA ROCHA GUZMAN",111,21,"1130","1003","02","04","0000001",21,"040064",3,"",20170101,20170331,9020.36]
[null,"GUANAJUATO","11DPT0010Y",100,"ROMR620310CS2","ROMR620310MDFMNC01","ROCIO ROMERO MENA",111,20,"1130","1003","02","04","0000001",20,"040065",3,"",20170101,20170331,9171]
[null,"GUANAJUATO","11DPT0010Y",100,"ROMO790623E30","ROMO790623HGTSRL08","OLIMPO ROSILLO MORENO",111,20,"1130","1003","02","04","0000001",20,"040066",3,"",20170101,20170331,5646.62]
[null,"GUANAJUATO","11DPT0010Y",100,"SOGC7802151Z2","SOGC780215MDFLRL01","CLAUDIA SOLACHE GARCIA",111,25,"1130","1003","02","04","0000001",25,"040067",3,"",20170101,20170331,5788.99]
[null,"GUANAJUATO","11DPT0010Y",100,"SUCG780821BZ7","SUCG780821HGTRSL03","GUILLERMO SUAREZ CASTRO",111,23,"1130","1003","02","04","0000001",23,"040068",3,"",20170101,20170331,10317.39]
[null,"GUANAJUATO","11DPT0010Y",100,"TEAA800207442","TEAA800207MGTRGL00","ALEJANDRA ISABEL TREJO AGUILAR",111,18,"1130","1003","02","04","0000001",18,"040069",3,"",20170101,20170331,21933.22]
[null,"GUANAJUATO","11DPT0010Y",100,"VELL651008V35","VELL651008MDFLGR02","MARIA DE LOURDES JUANA VELAZQUEZ LUGO",111,11,"1130","1003","02","04","0000001",11,"040070",3,"",20170101,20170331,3905.31]
[null,"GUANAJUATO","11DPT0010Y",100,"VESX850703GKA","VESX850703MGTLLC16","XOCHITL TOMASA VELAZQUEZ SILVA",111,24,"1130","1003","02","04","0000001",24,"040071",3,"",20170101,20170331,19147.93]
[null,"GUANAJUATO","11DPT0010Y",100,"DIRS790526AS6","DIRS790526MJCZVR00","SAIRA ESTHER DIAZ RIVERA",111,28,"1130","1003","02","04","0000001",28,"040091",3,"",20170101,20170331,25826.14]
[null,"GUANAJUATO","11DPT0010Y",100,"AAFO86011729A","AAFO860117MGTRRL08","OLGA ELIZABETH ARAUJO FERNANDEZ",111,27,"1130","1003","02","04","0000001",27,"040092",3,"",20170101,20170331,18588.23]
[null,"GUANAJUATO","11DPT0010Y",100,"SAMD841004RK2","SAMD841004MGTNLN03","DINORHA GEORGINA SANTIAGO MELCHOR",111,14,"1130","1003","02","04","0000001",14,"040096",3,"",20170101,20170331,13596.5]
[null,"GUANAJUATO","11DPT0010Y",100,"REBJ861120CG2","REBJ861120HGTYNN00","JUAN CARLOS REYNOSO BANDERAS",111,20,"1130","1003","02","04","0000001",20,"040106",3,"",20170101,20170331,3535]
[null,"GUANAJUATO","11DPT0010Y",100,"ROFA780327DH3","ROFA780327HGTDLL03","JOSE ALVARO RODRIGUEZ FLORES",111,20,"1130","1003","02","04","0000001",20,"040114",3,"",20170101,20170331,3535]
[null,"GUANAJUATO","11DPT0010Y",100,"AELE9402049E4","AELE940204HGTRPD09","EDUARDO ARREDONDO LOPEZ",111,10,"1130","1003","02","04","0000001",10,"040129",3,"",20170101,20170331,1299.5]
[null,"GUANAJUATO","11DPT0008J",100,"AEPE451004F87","AEPE451004HGTRZD06","EDMUNDO GONTRAN ARELLANO PIZANO",111,12,"1130","1003","02","33","0000001",12,"330002",3,"",20170101,20170331,4028.45]
[null,"GUANAJUATO","11DPT0008J",100,"BIEF750826Q65","BIEF750826HGTRSL05","FILIBERTO BRISEÑO ESPITIA",111,21,"1130","1003","02","33","0000001",21,"330005",3,"",20170101,20170331,22842.920000000006]
[null,"GUANAJUATO","11DPT0008J",100,"COCJ840424II1","COCJ840424HTLCNR00","JAIRO COCOLETZI CONDE",111,17,"1130","1003","02","33","0000001",17,"330007",3,"",20170101,20170331,10958.85]
[null,"GUANAJUATO","11DPT0008J",100,"CIAV791109IT0","CIAV791109MGTRRR05","VERONICA CRISANTO ARRIAGA",111,18,"1130","1003","02","33","0000001",18,"330008",3,"",20170101,20170331,14300.980000000001]
[null,"GUANAJUATO","11DPT0008J",100,"CUMJ850922E29","CUMJ850922MGTVRV00","JAVIERA MARIANA CUEVAS MIRELES",111,25,"1130","1003","02","33","0000001",25,"330009",3,"",20170101,20170331,26188.48]
[null,"GUANAJUATO","11DPT0008J",100,"DEGJ790106AH3","DEGJ790106HGTLRR08","JORGE ALBERTO DELGADO GUERRERO",111,23,"1130","1003","02","33","0000001",23,"330010",3,"",20170101,20170331,29079.72]
[null,"GUANAJUATO","11DPT0008J",100,"EIEA830501N66","EIEA830501MGTSSN05","ANDREA ESPITIA ESPITIA",111,20,"1130","1003","02","33","0000001",20,"330012",3,"",20170101,20170331,17481.2]
[null,"GUANAJUATO","11DPT0008J",100,"EIGG680608R24","EIGG680608HGTSNR01","GERARDO ESPITIA GONZALEZ",111,20,"1130","1003","02","33","0000001",20,"330013",3,"",20170101,20170331,26385.519999999997]
[null,"GUANAJUATO","11DPT0008J",100,"GAFR660603435","GAFR660603MGTRRS00","ROSAICELA CRISTINA GARCIA FRIAS",111,20,"1130","1003","02","33","0000001",20,"330015",3,"",20170101,20170331,31105.27]
[null,"GUANAJUATO","11DPT0008J",100,"GACP660324G26","GACP660324HGTLPD03","PEDRO GALVEZ CAPORAL",111,21,"1130","1003","02","33","0000001",21,"330016",3,"",20170101,20170331,24038.019999999997]
[null,"GUANAJUATO","11DPT0008J",100,"GAPG840330FB1","GAPG840330MMCRRB02","GABRIELA GARCIA PEREZ",111,21,"1130","1003","02","33","0000001",21,"330017",3,"",20170101,20170331,19383.599999999999]
[null,"GUANAJUATO","11DPT0008J",100,"GOHM731017127","GOHM731017HGTMRG05","MIGUEL ANGEL GOMEZ HERNANDEZ",111,10,"1130","1003","02","33","0000001",10,"330018",3,"",20170101,20170331,12051.43]
[null,"GUANAJUATO","11DPT0008J",100,"GOGF7511182R7","GOGF751118HGTNSR05","FRANCISCO JAVIER GONZALEZ GASCA",111,22,"1130","1003","02","33","0000001",22,"330019",3,"",20170101,20170331,24811.95]
[null,"GUANAJUATO","11DPT0008J",100,"GOPA710319IB0","GOPA710319HGTNRD02","ADAN ALEJANDRO GONZALEZ PRESA",111,15,"1130","1003","02","33","0000001",15,"330020",3,"",20170101,20170331,10890.58]
[null,"GUANAJUATO","11DPT0008J",100,"GOPR781214HT1","GOPR781214HGTNRD05","RODOLFO GONZALEZ PRESA",111,16,"1130","1003","02","33","0000001",16,"330021",3,"",20170101,20170331,14434.58]
[null,"GUANAJUATO","11DPT0008J",100,"HEAR7110051U4","HEAR711005HDFRRY04","RAYMUNDO HERNANDEZ ARRIAGA",111,18,"1130","1003","02","33","0000001",18,"330022",3,"",20170101,20170331,20856.52]
[null,"GUANAJUATO","11DPT0008J",100,"HEEF6801012R8","HEEF680101HHGRSL09","FELIPE HERNANDEZ ESTRADA",111,22,"1130","1003","02","33","0000001",22,"330023",3,"",20170101,20170331,30035.350000000002]
[null,"GUANAJUATO","11DPT0008J",100,"HEFJ700120711","HEFG700120HGTRSD12","J. GUADALUPE HERNANDEZ FISCAL",111,20,"1130","1003","02","33","0000001",20,"330024",3,"",20170101,20170331,9171]
[null,"GUANAJUATO","11DPT0008J",100,"JULA7109296W5","JULA710929HGTRNL01","ALEJANDRO JUAREZ LEON",111,21,"1130","1003","02","33","0000001",21,"330026",3,"",20170101,20170331,23065.9]
[null,"GUANAJUATO","11DPT0008J",100,"JULB700329347","JULB700329HGTRNN09","BENITO JUAREZ LEON",111,20,"1130","1003","02","33","0000001",20,"330027",3,"",20170101,20170331,20426.019999999997]
[null,"GUANAJUATO","11DPT0008J",100,"LACD700106TJ4","LACD700106HMCGRV02","DAVID LAGUNA CARRANCO",111,15,"1130","1003","02","33","0000001",15,"330028",3,"",20170101,20170331,23093.32]
[null,"GUANAJUATO","11DPT0008J",100,"LOGS791206JH1","LOGS791206HGTPPR07","SERGIO LOPEZ GUAPO",111,21,"1130","1003","02","33","0000001",21,"330031",3,"",20170101,20170331,19884.38]
[null,"GUANAJUATO","11DPT0008J",100,"LOVV821208K16","LOVV821208HGTPZC03","VICTOR HUGO LOPEZ VAZQUEZ",111,18,"1130","1003","02","33","0000001",18,"330032",3,"",20170101,20170331,14846.989999999998]
[null,"GUANAJUATO","11DPT0008J",100,"LOVT730719N69","LOVT730719MGTPLR04","MARIA TERESITA LOPEZ VILLAGOMEZ",111,25,"1130","1003","02","33","0000001",25,"330033",3,"",20170101,20170331,28586.300000000003]
[null,"GUANAJUATO","11DPT0008J",100,"MACD620420JFA","MACD620420HGTRRV07","DAVID MARTINEZ CURTIDOR",111,21,"1130","1003","02","33","0000001",21,"330034",3,"",20170101,20170331,19080.980000000003]
[null,"GUANAJUATO","11DPT0008J",100,"MAMG691216UYA","MAMG691216HGTRRD04","JOSE GUADALUPE RAUL MARTINEZ MORENO",111,20,"1130","1003","02","33","0000001",20,"330035",3,"",20170101,20170331,21357.29]
[null,"GUANAJUATO","11DPT0008J",100,"MOYS790226DL6","MOYS790226MGTNXC08","MARIA DEL SOCORRO MONTALVO YAÑEZ",111,18,"1130","1003","02","33","0000001",18,"330038",3,"",20170101,20170331,16301.280000000002]
[null,"GUANAJUATO","11DPT0008J",100,"OOSJ630117DK1","OOSJ630117HGTRNN00","JUAN MANUEL OROPEZA SANCHEZ",111,25,"1130","1003","02","33","0000001",25,"330039",3,"",20170101,20170331,32557.360000000001]
[null,"GUANAJUATO","11DPT0008J",100,"PAAJ6210093M0","PAAE621009HGTTCN04","J ENCARNACION MOISES PATIÑO ACOSTA",111,13,"1130","1003","02","33","0000001",13,"330040",3,"",20170101,20170331,8475.7300000000014]
[null,"GUANAJUATO","11DPT0008J",100,"QUMN8108073JA","QUMN810807MGTNRR05","NEIRA JENNIFER QUINTERO MORENO",111,14,"1130","1003","02","33","0000001",14,"330041",3,"",20170101,20170331,13041.02]
[null,"GUANAJUATO","11DPT0008J",100,"RAFB620409PS9","RAFB620409MNLMNL08","BLANCA ESTHELA RAMOS FUENTES",111,22,"1130","1003","02","33","0000001",22,"330042",3,"",20170101,20170331,30035.350000000002]
[null,"GUANAJUATO","11DPT0008J",100,"RIRJ8606049A1","RIRJ860604HGTSJN07","JUAN MANUEL RIOS ROJAS",111,15,"1130","1003","02","33","0000001",15,"330043",3,"",20170101,20170331,14434.6]
[null,"GUANAJUATO","11DPT0008J",100,"ROQJ571205C63","ROQJ571205HGTBNV03","JAVIER ROBLES QUINTANILLA",111,15,"1130","1003","02","33","0000001",15,"330044",3,"",20170101,20170331,10071.130000000001]
[null,"GUANAJUATO","11DPT0008J",100,"ROGD8306177Y6","ROGD830617HGTDLG05","JOSE DIEGO RODRIGUEZ GALLEGOS",111,10,"1130","1003","02","33","0000001",10,"330045",3,"",20170101,20170331,6290.58]
[null,"GUANAJUATO","11DPT0008J",100,"ROJL7510077S9","ROJL751007MGTJMR17","LAURA MARICELA ROJAS JIMENEZ",111,24,"1130","1003","02","33","0000001",24,"330047",3,"",20170101,20170331,31996.800000000003]
[null,"GUANAJUATO","11DPT0008J",100,"RONE740321QJ6","RONE740321MGTJTS01","MARIA ESTHER ROJAS NIETO",111,24,"1130","1003","02","33","0000001",24,"330048",3,"",20170101,20170331,31996.800000000003]
[null,"GUANAJUATO","11DPT0008J",100,"TOLJ711229Q89","TOLJ711229HGTRPV00","JAVIER TORRES LOPEZ",111,20,"1130","1003","02","33","0000001",20,"330050",3,"",20170101,20170331,30149.98]
[null,"GUANAJUATO","11DPT0008J",100,"VAME680312QT2","VAME680312MGTZRL00","ELISA VAZQUEZ MARTINEZ",111,31,"1130","1003","02","33","0000001",31,"330052",3,"",20170101,20170331,28468.620000000003]
[null,"GUANAJUATO","11DPT0008J",100,"VEGR7209154U4","VEGR720915MDFNLC00","MARIA DEL ROCIO VENTURA GALLEGOS",111,12,"1130","1003","02","33","0000001",12,"330053",3,"",20170101,20170331,10774.02]
[null,"GUANAJUATO","11DPT0008J",100,"VALS820325LX7","VALS820325MGTLNL09","SILVIA NANCY VALADEZ LEON",111,23,"1130","1003","02","33","0000001",23,"330055",3,"",20170101,20170331,30570.31]
[null,"GUANAJUATO","11DPT0008J",100,"HEMR760314HY6","HEMR760314HGTRRL06","RAUL HERNANDEZ MARTINEZ",111,15,"1130","1003","02","33","0000001",15,"330061",3,"",20170101,20170331,13903.68]
[null,"GUANAJUATO","11DPT0008J",100,"AUME740716A41","AUME740716HPLGDN13","ENRIQUE AGUILAR MEDRANO",111,19,"1130","1003","02","33","0000001",19,"330063",3,"",20170101,20170331,22594.559999999998]
[null,"GUANAJUATO","11DPT0008J",100,"HEMB820716LV7","HEMB820716MGTRDR06","BRENDA HERNANDEZ MEDINA",111,27,"1130","1003","02","33","0000001",27,"330065",3,"",20170101,20170331,23684.52]
[null,"GUANAJUATO","11DPT0008J",100,"GOVA7403201E8","GOVA740320HGTMLR06","JOSE ARMANDO GOMEZ VALENCIA",111,28,"1130","1003","02","33","0000001",28,"330066",3,"",20170101,20170331,28486.23]
[null,"GUANAJUATO","11DPT0008J",100,"AETA681104M99","AETA681104MGTRPL00","ALEJANDRA ARREGUIN TAPIA",111,23,"1130","1003","02","33","0000001",23,"330068",3,"",20170101,20170331,15140.25]
[null,"GUANAJUATO","11DPT0008J",100,"CAFJ650317IR5","CAFJ650317HGTRLR08","JORGE CARRANCO FLORES",111,12,"1130","1003","02","33","0000001",12,"330071",3,"",20170101,20170331,8533.380000000001]
[null,"GUANAJUATO","11DPT0008J",100,"ROFA621121CR4","ROFA621121HMCDLR04","ARTURO RODRIGUEZ FLORES",111,15,"1130","1003","02","33","0000001",15,"330102",3,"",20170101,20170331,8130.5]
[null,"GUANAJUATO","11DPT0011X",100,"AUGJ780722V55","AUGJ780722HGTGMN00","JUAN SIMON AGUILAR GOMEZ",111,8,"1130","1003","02","49","0000001",8,"490003",3,"",20170101,20170331,5032.47]
[null,"GUANAJUATO","11DPT0011X",100,"AALJ750316LPA","AALJ750316HGTYLS05","JOSE AYALA LULE",111,21,"1130","1003","02","49","0000001",21,"490007",3,"",20170101,20170331,14329.14]
[null,"GUANAJUATO","11DPT0011X",100,"BAEJ7111265C6","BAEJ711126HGTTSS04","JESUS MARIO BAUTISTA ESCAMILLA",111,25,"1130","1003","02","49","0000001",25,"490008",3,"",20170101,20170331,29243.130000000005]
[null,"GUANAJUATO","11DPT0011X",100,"CARH670101MS3","CARH670101HGTRZC08","HECTOR CARDENAS RUIZ",111,21,"1130","1003","02","49","0000001",21,"490010",3,"",20170101,20170331,21208.11]
[null,"GUANAJUATO","11DPT0011X",100,"CAER830626JA4","CAER830626MGTRSY00","REYNA LILIANA CARDOSO ESCUTIA",111,9,"1130","1003","02","49","0000001",9,"490011",3,"",20170101,20170331,8270.4599999999991]
[null,"GUANAJUATO","11DPT0011X",100,"CABG7405015A5","CABG740501MGTSRB06","GABRIELA CASTRO BARBOSA",111,20,"1130","1003","02","49","0000001",20,"490014",3,"",20170101,20170331,26328.73]
[null,"GUANAJUATO","11DPT0011X",100,"CILH750107I47","CILH750107MGTSPL00","HILDA LUCIA CISNEROS LOPEZ",111,18,"1130","1003","02","49","0000001",18,"490015",3,"",20170101,20170331,16150.809999999998]
[null,"GUANAJUATO","11DPT0011X",100,"EAMA860511UL8","EAMA860511MMNSRN08","ANA LUCIA ESCALANTE MARIN",111,15,"1130","1003","02","49","0000001",15,"490017",3,"",20170101,20170331,12316.3]
[null,"GUANAJUATO","11DPT0011X",100,"MOSA681126R27","MOSA681126MGTNRN06","MA DE LOS ANGELES MONTERO SIERRA",111,24,"1130","1003","02","49","0000001",24,"490023",3,"",20170101,20170331,33768.68]
[null,"GUANAJUATO","11DPT0011X",100,"GAMA5108287F5","GAMA510828HGTRRG09","AGUSTIN GARDIAZABAL MORALES",111,23,"1130","1003","02","49","0000001",23,"490024",3,"",20170101,20170331,22010.409999999996]
[null,"GUANAJUATO","11DPT0011X",100,"GUCT560830E19","GUCT560830MGTRSR17","MA TERESA GUERRERO CASTRO",111,27,"1130","1003","02","49","0000001",27,"490025",3,"",20170101,20170331,34315.130000000005]
[null,"GUANAJUATO","11DPT0011X",100,"HECM670422CC4","HECM670422MDFRBR02","MARIA MARCELA HERRERA CEBALLOS",111,25,"1130","1003","02","49","0000001",25,"490026",3,"",20170101,20170331,34340.699999999997]
[null,"GUANAJUATO","11DPT0011X",100,"LUCF7002115Q9","LUCF700211HGTLND05","FIDEL LULE CONTRERAS",111,15,"1130","1003","02","49","0000001",15,"490028",3,"",20170101,20170331,10840.85]
[null,"GUANAJUATO","11DPT0011X",100,"MABR8302104V5","MABR830210HGTRRB02","ROBERTO MARTINEZ BARRERA",111,5,"1130","1003","02","49","0000001",5,"490029",3,"",20170101,20170331,883.75]
[null,"GUANAJUATO","11DPT0011X",100,"MAHA821225TQ5","MAHA821225MGTRRL02","ALEJANDRA MARTINEZ HERNANDEZ",111,15,"1130","1003","02","49","0000001",15,"490030",3,"",20170101,20170331,18720.019999999997]
[null,"GUANAJUATO","11DPT0011X",100,"MERA6410168B4","MERA641016HGTDZL14","ALEJANDRO MEDINA REZA",111,14,"1130","1003","02","49","0000001",14,"490033",3,"",20170101,20170331,15972.830000000002]
[null,"GUANAJUATO","11DPT0011X",100,"NACJ810605U92","NACJ810605HGTRRR09","JORGE ALBERTO NARVAEZ CARDOSO",111,6,"1130","1003","02","49","0000001",6,"490036",3,"",20170101,20170331,3775.4]
[null,"GUANAJUATO","11DPT0011X",100,"NAFE720728918","NAFE720728MDFVRV08","EVANGELINA NAVARRETE FARFAN",111,25,"1130","1003","02","49","0000001",25,"490037",3,"",20170101,20170331,18046.190000000002]
[null,"GUANAJUATO","11DPT0011X",100,"PACM790918HT8","PACM790918HGTNRR13","MAURICIO PANIAGUA CARRILLO",111,18,"1130","1003","02","49","0000001",18,"490040",3,"",20170101,20170331,25403.24]
[null,"GUANAJUATO","11DPT0011X",100,"PEHS851206HS7","PEHS851206HGTXRL09","JOSE SALUD PEÑA HERNANDEZ",111,19,"1130","1003","02","49","0000001",19,"490042",3,"",20170101,20170331,21002.109999999997]
[null,"GUANAJUATO","11DPT0011X",100,"PATF850801UJA","PATF850801HGTLPR02","FRANCISCO EVERARDO PLAZA TAPIA",111,20,"1130","1003","02","49","0000001",20,"490043",3,"",20170101,20170331,18529.29]
[null,"GUANAJUATO","11DPT0011X",100,"RISA740722842","RISA740722MGTCNL08","ALEJANDRA RICALDE SANCHEZ",111,20,"1130","1003","02","49","0000001",20,"490045",3,"",20170101,20170331,17594.34]
[null,"GUANAJUATO","11DPT0011X",100,"SACF740918BK7","SACF740918HJCNML11","FELIX SANCHEZ CAMPOS",111,21,"1130","1003","02","49","0000001",21,"490049",3,"",20170101,20170331,12048.529999999999]
[null,"GUANAJUATO","11DPT0011X",100,"SAPG631009QMA","SAPG631009MGTNRD02","GUADALUPE SANCHEZ PARRA",111,18,"1130","1003","02","49","0000001",18,"490051",3,"",20170101,20170331,8484]
[null,"GUANAJUATO","11DPT0011X",100,"SIPH640527P81","SIPH640527HGTRRG09","HUGO EVERARDO SIERRA PARADA",111,27,"1130","1003","02","49","0000001",27,"490052",3,"",20170101,20170331,29003.590000000004]
[null,"GUANAJUATO","11DPT0011X",100,"ZAMJ740416IL1","ZAMJ740416HDFMXR00","JORGE ZAMORA MUÑIZ",111,18,"1130","1003","02","49","0000001",18,"490056",3,"",20170101,20170331,6901.42]
[null,"GUANAJUATO","11DPT0011X",100,"HEMY820605MZ2","HEMY820605MGTRNL07","YOLANDA HERNANDEZ MONTOYA",111,26,"1130","1003","02","49","0000001",26,"490067",3,"",20170101,20170331,25393.11]
[null,"GUANAJUATO","11DPT0011X",100,"LIRK810903L47","LIRK810903MCHNLR02","KARLA ROCIO LINO DEL REAL",111,4,"1130","1003","02","49","0000001",4,"490083",3,"",20170101,20170331,2436.77]
[null,"GUANAJUATO","11DPT0011X",100,"SACM860807655","SACM860807HGTMMN00","JOSE MANUEL SAMANO CAMARGO",111,26,"1130","1003","02","49","0000001",26,"490085",3,"",20170101,20170331,29462.760000000002]
[null,"GUANAJUATO","11DPT0011X",100,"LUML8603214V6","LUML860321MGTNDN02","LINA LUNA MEDINA",111,19,"1130","1003","02","49","0000001",19,"490096",3,"",20170101,20170331,21351.42]
[null,"GUANAJUATO","11DPT0011X",100,"GACL6901175Y4","GACL690117HGTRRN01","LEONEL GARCIA CRUZ",111,33,"1130","1003","02","49","0000001",33,"490097",3,"",20170101,20170331,14818.08]
[null,"GUANAJUATO","11DPT0011X",100,"RAGE851021JI8","RAGE851021MGTYML08","ELVIA SUSANA RAYA GOMEZ",111,28,"1130","1003","02","49","0000001",28,"490101",3,"",20170101,20170331,27184.17]
[null,"GUANAJUATO","11DPT0011X",100,"GARR8203151UA","GARR820315HHGRBY08","REYMUNDO GARCIA ROBLES",111,18,"1130","1003","02","49","0000001",18,"490102",3,"",20170101,20170331,10929.060000000001]
[null,"GUANAJUATO","11DPT0011X",100,"GOLU740104CZ2","GOXL740104HGTNXS05","JOSE LUIS GONZALEZ",111,7,"1130","1003","02","49","0000001",7,"490127",3,"",20170101,20170331,2659.6400000000003]
[null,"GUANAJUATO","11DPT0011X",100,"GAAM880803SI2","GAAM880803MGTNLR00","MARIANA GANTES ALCANTAR",111,4,"1130","1003","02","49","0000001",4,"490128",3,"",20170101,20170331,2168.13]
[null,"GUANAJUATO","11DPT0012W",100,"AUMJ800706AM9","AUMJ800706HMCGRL14","JOEL AGUILLON MORALES",111,21,"1130","1003","04","02","0000001",21,"700001",3,"",20170101,20170331,18149.989999999998]
[null,"GUANAJUATO","11DPT0012W",100,"AEDI770518KX0","AEDI770518HGTRRS01","ISRAEL ARMANDO ARREDONDO DORANTES",111,20,"1130","1003","04","02","0000001",20,"700002",3,"",20170101,20170331,15041.7]
[null,"GUANAJUATO","11DPT0012W",100,"CACV851205PW0","CACV851205MQTBRR00","VERA CABELLO CORONA",111,30,"1130","1003","04","02","0000001",30,"700005",3,"",20170101,20170331,15198.2]
[null,"GUANAJUATO","11DPT0012W",100,"EIHA701029QW9","EIHA701029HGTSRL01","ALEJANDRO ESPINOSA HERNANDEZ",111,12,"1130","1003","04","02","0000001",12,"700007",3,"",20170101,20170331,10942.29]
[null,"GUANAJUATO","11DPT0012W",100,"HELM570929SP8","HELM570929HQTRRG04","MIGUEL HERNANDEZ LIRA",111,16,"1130","1003","04","02","0000001",16,"700012",3,"",20170101,20170331,11825.45]
[null,"GUANAJUATO","11DPT0012W",100,"JAAM590516MH6","JAAM590516HGTMRN03","MANUEL JAIME ARELLANO",111,20,"1130","1003","04","02","0000001",20,"700013",3,"",20170101,20170331,16143.18]
[null,"GUANAJUATO","11DPT0012W",100,"LOZE710604574","LOZE710604MGTZRG00","MA. EUGENIA LOZADA ZARAZUA",111,12,"1130","1003","04","02","0000001",12,"700016",3,"",20170101,20170331,13289.67]
[null,"GUANAJUATO","11DPT0012W",100,"MEGR720113GQ8","MEGR720113HMNRNM02","RAMIRO MERCADO GONZALEZ",111,10,"1130","1003","04","02","0000001",10,"700018",3,"",20170101,20170331,12481.84]
[null,"GUANAJUATO","11DPT0012W",100,"MUIM841205CWA","MUIM841205MQTXBR03","MARIANA MUÑOZ IBARRA",111,35,"1130","1003","04","02","0000001",35,"700020",3,"",20170101,20170331,19274.010000000002]
[null,"GUANAJUATO","11DPT0012W",100,"OAVO8206077E6","OAVO820607HMNCZM08","OMAR ANTONIO OCAMPO VAZQUEZ",111,23,"1130","1003","04","02","0000001",23,"700021",3,"",20170101,20170331,17331.82]
[null,"GUANAJUATO","11DPT0012W",100,"OIMG610814NA3","OIMG610814MGTRLD00","MA GUADALUPE ORTIZ MELENDEZ",111,20,"1130","1003","04","02","0000001",20,"700026",3,"",20170101,20170331,8324.6]
[null,"GUANAJUATO","11DPT0012W",100,"PARB8612287J6","PARB861228MGTCDR09","BARBARA PALOMA PACHECO RODRIGUEZ",111,24,"1130","1003","04","02","0000001",24,"700027",3,"",20170101,20170331,21295.11]
[null,"GUANAJUATO","11DPT0012W",100,"PEGA8608144V9","PEGA860814MGTRTD07","MARIA AIDA PEREZ GUTIERREZ",111,35,"1130","1003","04","02","0000001",35,"700029",3,"",20170101,20170331,24096.940000000002]
[null,"GUANAJUATO","11DPT0012W",100,"PEQP6003137R3","PEQP600313MQTRNT01","PATRICIA ANTONIA PEREZ QUINTERO",111,29,"1130","1003","04","02","0000001",29,"700030",3,"",20170101,20170331,32289.88]
[null,"GUANAJUATO","11DPT0012W",100,"PABJ671110D69","PABJ671110HJCLRS08","JOSE DE JESUS PLACENCIA BARAJAS",111,23,"1130","1003","04","02","0000001",23,"700031",3,"",20170101,20170331,21953.379999999997]
[null,"GUANAJUATO","11DPT0012W",100,"RASN800226H40","RASN800226HGTNRS07","NESTOR RANGEL SUAREZ",111,31,"1130","1003","04","02","0000001",31,"700035",3,"",20170101,20170331,16871.84]
[null,"GUANAJUATO","11DPT0012W",100,"RERE660715NDA","RERE660715HGTYMN06","ENRIQUE REYES ROMERO",111,22,"1130","1003","04","02","0000001",22,"700036",3,"",20170101,20170331,26773.9]
[null,"GUANAJUATO","11DPT0012W",100,"RIHS8511232P3","RIHS851123MGTVRC00","MARIA SOCORRO RIVERA HERNANDEZ",111,34,"1130","1003","04","02","0000001",34,"700038",3,"",20170101,20170331,24980.690000000002]
[null,"GUANAJUATO","11DPT0012W",100,"ROEL820326QF8","ROEL820326MGTCSZ05","MARIA DE LA LUZ ROCHA ESCOBAR",111,35,"1130","1003","04","02","0000001",35,"700040",3,"",20170101,20170331,16982.75]
[null,"GUANAJUATO","11DPT0012W",100,"ROGJ7510022G2","ROGJ751002HGTDNL09","J JOEL RODRIGUEZ GONZALEZ",111,10,"1130","1003","04","02","0000001",10,"700042",3,"",20170101,20170331,7280.51]
[null,"GUANAJUATO","11DPT0012W",100,"RORJ620506HP8","RORJ620506HTLDMN05","JUAN RODRIGUEZ ROMERO",111,16,"1130","1003","04","02","0000001",16,"700043",3,"",20170101,20170331,18328.78]
[null,"GUANAJUATO","11DPT0012W",100,"ROFM640322BG7","ROFM640322HGTMRR00","MARTIN ROMERO FERRO",111,16,"1130","1003","04","02","0000001",16,"700044",3,"",20170101,20170331,14400.45]
[null,"GUANAJUATO","11DPT0012W",100,"SAPG700911SZ4","SAPG700911HDFNRS05","GUSTAVO SANCHEZ PEREZ",111,34,"1130","1003","04","02","0000001",34,"700046",3,"",20170101,20170331,21208.54]
[null,"GUANAJUATO","11DPT0012W",100,"SATE820405F51","SATE820405MGTNRV00","EVA MARIA DEL ROSARIO SANCHEZ TURRUBIARTES",111,20,"1130","1003","04","02","0000001",20,"700047",3,"",20170101,20170331,18881.34]
[null,"GUANAJUATO","11DPT0012W",100,"SOZC590907935","SOZC590907HQTRXN08","JOSE CONRADO SORIA ZUÑIGA",111,28,"1130","1003","04","02","0000001",28,"700049",3,"",20170101,20170331,26366.94]
[null,"GUANAJUATO","11DPT0012W",100,"SORR730605V46","SORR730605HDFTMD03","RODOLFO SOTO ROMERO",111,25,"1130","1003","04","02","0000001",25,"700051",3,"",20170101,20170331,20749.39]
[null,"GUANAJUATO","11DPT0012W",100,"VAMG850109N64","VAMG850109MBSZNB01","GABRIELA VAZQUEZ MONJARAZ",111,30,"1130","1003","04","02","0000001",30,"700052",3,"",20170101,20170331,21335.58]
[null,"GUANAJUATO","11DPT0012W",100,"VAPG660502A11","VAPG660502HMCZRR05","GERMAN VAZQUEZ PERALTA",111,26,"1130","1003","04","02","0000001",26,"700053",3,"",20170101,20170331,21100.989999999998]
[null,"GUANAJUATO","11DPT0012W",100,"ZARI821025R29","ZARI821025MGTRBG09","MARIA IGNACIA ZARAZUA RUBIO",111,30,"1130","1003","04","02","0000001",30,"700054",3,"",20170101,20170331,20359.79]
[null,"GUANAJUATO","11DPT0012W",100,"MASA840303K12","MASA840303MDFRNN08","MARIA DE LOS ANGELES MARTINEZ SANCHEZ",111,12,"1130","1003","04","02","0000001",12,"700074",3,"",20170101,20170331,10516.619999999999]
[null,"GUANAJUATO","11DPT0012W",100,"GOHJ740202PJ6","GOHJ740202MGTMRN01","MA JUANA GOMEZ HERNANDEZ",111,22,"1130","1003","04","02","0000001",22,"700076",3,"",20170101,20170331,11668.43]
[null,"GUANAJUATO","11DPT0012W",100,"GOHS8907177Z1","GOHS890717MQTMRN05","SANDRA IRAIS GOMEZ HERNANDEZ",111,12,"1130","1003","04","02","0000001",12,"700083",3,"",20170101,20170331,9096.5]
[null,"GUANAJUATO","11DPT0012W",100,"GARB840625CP8","GARB840625MQTLDR08","BRENDA LIDIA GALLEGOS RODRIGUEZ",111,37,"1130","1003","04","02","0000001",37,"700084",3,"",20170101,20170331,23772.89]
[null,"GUANAJUATO","11DPT0012W",100,"BASC910503127","BASC910503MGTZNR03","MARIA CRUZ BAEZA SANCHEZ",111,20,"1130","1003","04","02","0000001",20,"700090",3,"",20170101,20170331,11902.86]
[null,"GUANAJUATO","11DPT0012W",100,"AEPI820115AQ1","AEPI820115MDFRLS04","ISABEL ARREDONDO PLATA",111,20,"1130","1003","04","02","0000001",20,"700102",3,"",20170101,20170331,13845.43]
[null,"GUANAJUATO","11DPT0012W",100,"ZARJ781201E25","ZARJ781201HGTRNS07","JESUS ZARAZUA RANGEL",111,20,"1130","1003","04","02","0000001",20,"700105",3,"",20170101,20170331,11135.239999999998]
[null,"GUANAJUATO","11DPT0012W",100,"CAMJ890730SG6","CAMJ890730MDFSDZ09","JAZMIN CASASOLA MEDINA",111,30,"1130","1003","04","02","0000001",30,"700106",3,"",20170101,20170331,12385.77]
[null,"GUANAJUATO","11DPT0012W",100,"PEGR750725A34","PEGR750725HDFRTC00","RICARDO PEREZ GUTIERREZ",111,17,"1130","1003","04","02","0000001",17,"700112",3,"",20170101,20170331,11812.77]
[null,"GUANAJUATO","11DPT0012W",100,"RORE431022TB0","RORE431022HGTDMD08","EDILBERTO RODRIGUEZ ROMERO",111,20,"1130","1003","04","02","0000001",20,"700130",3,"",20170101,20170331,25984.489999999998]
[null,"GUANAJUATO","11DPT0012W",100,"PEBG910930PM0","PEBG910930MQTRCD08","MARIA GUADALUPE PEREZ BECERRA",111,10,"1130","1003","04","02","0000001",10,"700137",3,"",20170101,20170331,3496.7199999999993]
[null,"GUANAJUATO","11DPT0012W",100,"AUMA910826RH0","AUMA910826MGTGXL03","ALEJANDRA AGUILLON MUÑOZ",111,20,"1130","1003","04","02","0000001",20,"700143",3,"",20170101,20170331,13124.95]
[null,"GUANAJUATO","11DPT0012W",100,"ZABA871015J40","ZABA871015HGTRCM04","AMANDO ZARAZUA BECERRA",111,15,"1130","1003","04","02","0000001",15,"700153",3,"",20170101,20170331,3383.0299999999997]
[null,"GUANAJUATO","11DPT0012W",100,"MOHS911002I27","MOHS911002HMCNRR00","SERGIO MONTES DE OCA HURTADO",111,10,"1130","1003","04","02","0000001",10,"700154",3,"",20170101,20170331,1809.5499999999997]
[null,"GUANAJUATO","11DPT0012W",100,"SOMJ860107SDA","SOMJ860107MTSSNS08","JESSICA SOSA MENA",111,22,"1130","1003","04","02","0000001",22,"700158",3,"",20170101,20170331,22163.55]
[null,"GUANAJUATO","11DPT0012W",100,"BAMV8801104X4","BAMV880110MGTRNR09","VERONICA GUADALUPE BRAVO MONTES",111,10,"1130","1003","04","02","0000001",10,"700161",3,"",20170101,20170331,3535]
[null,"GUANAJUATO","11DPT0012W",100,"MESL721106M79","MESL721106HMCNNC01","LUCIANO MENDOZA SANCHEZ",111,28,"1130","1003","04","02","0000001",28,"700163",3,"",20170101,20170331,15259.44]
[null,"GUANAJUATO","11DPT0012W",100,"NOIG870606719","NOIG870606HMCGNS09","GUSTAVO NOGUEZ INIESTA",111,25,"1130","1003","04","02","0000001",25,"700165",3,"",20170101,20170331,17262.599999999999]
[null,"GUANAJUATO","11DPT0012W",100,"GORC720101QI2","GORC720101MMNNBR04","CRISTINA GONZALEZ ROBLES",111,19,"1130","1003","04","02","0000001",19,"700178",3,"",20170101,20170331,16546.400000000001]
[null,"GUANAJUATO","11DPT0012W",100,"HEMJ750321M79","HEMJ750321HPLRRV10","JAVIER HERRERA MARTINEZ",111,7,"1130","1003","04","02","0000001",7,"700181",3,"",20170101,20170331,2789.59]
[null,"GUANAJUATO","11DPT0012W",100,"GACI810611U19","GACI810611HGTRRS03","JOSE ISRAEL GARCIA CORONA",111,5,"1130","1003","04","02","0000001",5,"700190",3,"",20170101,20170331,1992.5700000000002]
[null,"GUANAJUATO","11DPT0012W",100,"LOHF8609268M2","LOHF860926MGTPRR03","MARIA FERNANDA LOPEZ HERNANDEZ",111,20,"1130","1003","04","02","0000001",20,"700208",3,"",20170101,20170331,7970.27]
[null,"GUANAJUATO","11DPT0012W",100,"LEBA771021UG8","LEBA771021HGTDSR05","ARNULFO LEDESMA BASALDUA",111,6,"1130","1003","04","02","0000001",6,"700229",3,"",20170101,20170331,4218.66]
[null,"GUANAJUATO","11DPT0012W",100,"HEMM911106CQ0","HEMM911106MQTRRR07","MARIANA GUADALUPE HERRERA MORALES",111,10,"1130","1003","04","02","0000001",10,"700233",3,null,20170101,20170331,2599]
[null,"GUANAJUATO","11DPT0013V",100,"AAAL5409208IA","AAXA540920HDFLXL04","JOSE ALEJANDRO ALVAREZ",111,21,"1130","1003","03","02","0000001",21,"020003",3,null,20170101,20170331,23242.65]
[null,"GUANAJUATO","11DPT0013V",100,"AAMT5503211V3","AAMT550321MGTLRR02","MARIA TERESA ALVAREZ MARES",111,20,"1130","1003","03","02","0000001",20,"020004",3,null,20170101,20170331,22246.98]
[null,"GUANAJUATO","11DPT0013V",100,"BURL821104LM8","BURL821104MGTTMT09","LETICIA BUTANDA RAMIREZ",111,30,"1130","1003","03","02","0000001",30,"020006",3,null,20170101,20170331,21649.19]
[null,"GUANAJUATO","11DPT0013V",100,"COML571122DD6","COML571122MGTRRT18","LETICIA CORNEJO MARTINEZ",111,18,"1130","1003","03","02","0000001",18,"020009",3,null,20170101,20170331,22774.959999999999]
[null,"GUANAJUATO","11DPT0013V",100,"DOIB750304RM3","DOIB750304HGTRNN07","BENJAMIN DORANTES INFANTE",111,15,"1130","1003","03","02","0000001",15,"020011",3,null,20170101,20170331,12726]
[null,"GUANAJUATO","11DPT0013V",100,"HERA790726J96","HERA790726MGTRMN07","ANA VERONICA HERNANDEZ RAMIREZ",111,30,"1130","1003","03","02","0000001",30,"020018",3,null,20170101,20170331,25334.190000000002]
[null,"GUANAJUATO","11DPT0013V",100,"LORM590406948","LORG590406MGTPDD05","MA. GUADALUPE LOPEZ RODRIGUEZ",111,32,"1130","1003","03","02","0000001",32,"020020",3,null,20170101,20170331,31994.63]
[null,"GUANAJUATO","11DPT0013V",100,"MORJ631227S89","MORJ631227HGTTMN01","JUAN MOTA RAMIREZ",111,24,"1130","1003","03","02","0000001",24,"020025",3,null,20170101,20170331,14832.53]
[null,"GUANAJUATO","11DPT0013V",100,"RIGM700422KM3","RIGM700422MGTVNG06","MA. MAGDALENA RIVERA GONZALEZ",111,30,"1130","1003","03","02","0000001",30,"020028",3,null,20170101,20170331,25093.279999999999]
[null,"GUANAJUATO","11DPT0013V",100,"SAPJ7305052R5","SAPJ730505HGTNRN06","JUAN CARLOS SANCHEZ PEREZ",111,27,"1130","1003","03","02","0000001",27,"020035",3,null,20170101,20170331,24728.27]
[null,"GUANAJUATO","11DPT0013V",100,"VEVS430308H18","VEVS430308MGTRLL04","MA SOLEDAD VERA VALTIERRA",111,23,"1130","1003","03","02","0000001",23,"020038",3,null,20170101,20170331,21106.250000000004]
[null,"GUANAJUATO","11DPT0013V",100,"VIBM750212ED8","VIBM750212MDFLRN06","MONICA VILCHIS BARCENAS",111,32,"1130","1003","03","02","0000001",32,"020039",3,null,20170101,20170331,31051.96]
[null,"GUANAJUATO","11DPT0013V",100,"DULJ8108233XA","DULJ810823HGTQPN02","JUAN IGNACIO DUQUE LOPEZ",111,30,"1130","1003","03","02","0000001",30,"020042",3,null,20170101,20170331,23348.15]
[null,"GUANAJUATO","11DPT0013V",100,"MEGC861127FF5","MEGC861127HGTZRR00","CARLOS FRANCISCO MEZA GARCIA",111,24,"1130","1003","03","02","0000001",24,"020056",3,null,20170101,20170331,17528.120000000003]
[null,"GUANAJUATO","11DPT0013V",100,"MAEC6907295B4","MAEC690729MGTTSL04","CLAUDIA MATA ESTRADA",111,25,"1130","1003","03","02","0000001",25,"020057",3,null,20170101,20170331,25658.23]
[null,"GUANAJUATO","11DPT0013V",100,"RAEM750806613","RAEM750806MDFMLN07","MONICA MARCELA RAMIREZ ELIZALDE",111,16,"1130","1003","03","02","0000001",16,"020058",3,null,20170101,20170331,15987.67]
[null,"GUANAJUATO","11DPT0013V",100,"GOAJ880125GX4","GOAJ880125HGTNLS06","JOSUE ABRAHAM GONZaLEZ ALCANTAR",111,21,"1130","1003","03","02","0000001",21,"020092",3,null,20170101,20170331,14229.52]
[null,"GUANAJUATO","11DPT0013V",100,"MARM860927BI6","MARM860927MGTRVN09","MARIA MONTSERRAT MARES RIVERA",111,13,"1130","1003","03","02","0000001",13,"020093",3,null,20170101,20170331,12528.19]
[null,"GUANAJUATO","11DPT0013V",100,"REDA870319HH9","REDA870319HGTGVR03","ARTURO REGALADO DaVILA",111,21,"1130","1003","03","02","0000001",21,"020094",3,null,20170101,20170331,18283.899999999998]
[null,"GUANAJUATO","11DPT0013V",100,"SECJ780511UPA","SECJ780511MGTRHN02","JUANA MARiA CONCEPCIoN SERRANO CHAGOYA",111,21,"1130","1003","03","02","0000001",21,"020096",3,null,20170101,20170331,17409.88]
[null,"GUANAJUATO","11DPT0013V",100,"MOCL7210035P7","MOCL721003MGTRLL04","LILIA ADRIANA MORENO CALDERAS",111,9,"1130","1003","03","02","0000001",9,"020106",3,null,20170101,20170331,6328.01]
[null,"GUANAJUATO","11DPT0013V",100,"OINM651022J76","OINM651022HGTRVR07","MARTiN ORTIZ NAVARRO",111,25,"1130","1003","03","02","0000001",25,"020111",3,null,20170101,20170331,21202.240000000002]
[null,"GUANAJUATO","11DPT0013V",100,"LOSC860106KF2","LOSC860106HGTPRH07","CHRISTIAN EMMANUEL LoPEZ SUaREZ",111,15,"1130","1003","03","02","0000001",15,"020114",3,null,20170101,20170331,16520.849999999999]
[null,"GUANAJUATO","11DPT0013V",100,"ROAA890923NX1","ROAA890923MGTMLR00","ARACELI ROMERO ALDERETE",111,16,"1130","1003","03","02","0000001",16,"020115",3,null,20170101,20170331,14089.74]
[null,"GUANAJUATO","11DPT0013V",100,"EILL500310BA8","EILL500310MDFLLL09","LILIA SUSANA ELIZALDE LLOPIS",111,18,"1130","1003","03","02","0000001",18,"020117",3,null,20170101,20170331,21386.77]
[null,"GUANAJUATO","11DPT0013V",100,"CAMJ6704193Z4","CAMJ670419HGTRRS00","JOSE DE JESUS CARRILLO MARTINEZ",111,24,"1130","1003","03","02","0000001",24,"020120",3,null,20170101,20170331,23182.65]
[null,"GUANAJUATO","11DPT0013V",100,"MAFM7705021D2","MAFM770502MGTCNR08","MARICRUZ MACIAS FUENTES",111,15,"1130","1003","03","02","0000001",15,"020129",3,null,20170101,20170331,10862.46]
[null,"GUANAJUATO","11DPT0013V",100,"HEMG701231TT3","HEMG701231HGTRRL00","GUILLERMO HERNANDEZ MARTINEZ",111,10,"1130","1003","03","02","0000001",10,"020137",3,null,20170101,20170331,6091.93]
[null,"GUANAJUATO","11DPT0013V",100,"VAMA890131B41","VAMA890131MGTZRR09","ARELY VAZQUEZ MORALES",111,12,"1130","1003","03","02","0000001",12,"020138",3,null,20170101,20170331,8045.3200000000006]
[null,"GUANAJUATO","11DPT0013V",100,"CANL660925TG9","CANL660925HJCSVS04","LUIS GUILLERMO CASTELLANOS NAVARRO",111,14,"1130","1003","03","02","0000001",14,"020142",3,null,20170101,20170331,8230.73]
[null,"GUANAJUATO","11DPT0013V",100,"VESF650920AD9","VESF650920HNLGLR08","FROYLAN VEGA SALAZAR",111,15,"1130","1003","03","02","0000001",15,"020144",3,null,20170101,20170331,10542.080000000002]
[null,"GUANAJUATO","11DPT0013V",100,"MAFV670203JA9","MAFV670203MGTCNR06","VERONICA MACiAS FUENTES",111,9,"1130","1003","03","02","0000001",9,"020154",3,null,20170101,20170331,6160.64]
[null,"GUANAJUATO","11DPT0013V",100,"LACC8208037T6","LACC820803MGTRBL02","CLARA BERENICE LARA COBIAN",111,12,"1130","1003","03","02","0000001",12,"020159",3,null,20170101,20170331,2542.7200000000003]
[null,"GUANAJUATO","11DPT0013V",100,"RECF741129SW1","RECF741129HJCYRR05","FRANCISCO JAVIER DE LOS REYES CRUZ",111,20,"1130","1003","03","02","0000001",20,"020163",3,null,20170101,20170331,10840.67]
[null,"GUANAJUATO","11DPT0013V",100,"GOPR871116UA7","GOPR871116MGTNLS07","ROSA ISELA GONZaLEZ PALACIOS",111,9,"1130","1003","03","02","0000001",9,"020164",3,null,20170101,20170331,5482.7400000000007]
[null,"GUANAJUATO","11DPT0013V",100,"LOGL7610287C2","LOGL761028HGTPRS09","LUIS PASCUAL LoPEZ GUERRERO",111,5,"1130","1003","03","02","0000001",5,"020168",3,null,20170101,20170331,3045.9700000000003]
[null,"GUANAJUATO","11DPT0013V",100,"SAJM650712IR3","SAJM650712HMNNCG01","MIGUEL ANGEL SANCHEZ JACOBO",111,11,"1130","1003","03","02","0000001",11,"020174",3,null,20170101,20170331,6701.1299999999992]
[null,"GUANAJUATO","11DPT0013V",100,"COMM6011273IA","COMM601127MGTNRR08","MARGARITA CONTRERAS MARMOLEJO",111,9,"1130","1003","03","02","0000001",9,"020182",3,null,20170101,20170331,6328.01]
[null,"GUANAJUATO","11DPT0013V",100,"ROAD891227G7A","ROAD891227MGTMDN01","DIANA VERONICA ROMERO ADONA",111,10,"1130","1003","03","02","0000001",10,"020188",3,null,20170101,20170331,5406.19]
[null,"GUANAJUATO","11DPT0013V",100,"COAE9110233T9","COAE911023HGTRGD00","EDGAR ULISES CORDOVA AGUIRRE",111,7,"1130","1003","03","02","0000001",7,"020191",3,null,20170101,20170331,3072.45]
[null,"GUANAJUATO","11DPT0013V",100,"OECA580713U8A","OECA580713MGTJNM01","AMALIA OJEDA CONTRERAS",111,10,"1130","1003","03","02","0000001",10,"020196",3,null,20170101,20170331,7031.1]
[null,"GUANAJUATO","11DPT0013V",100,"VARR690117882","VARR690117MDFRVC00","MA DEL ROCIO VARGAS RIVERA",111,12,"1130","1003","03","02","0000001",12,"020197",3,null,20170101,20170331,4767.6000000000004]
[null,"GUANAJUATO","11DPT0014U",100,"CAPD830504746","CAPD830504HGTRTG05","DIEGO FELIPE CARDENAS PATIÑO",111,30,"1130","1003","03","03","0000001",30,"030001",3,null,20170101,20170331,35040.590000000004]
[null,"GUANAJUATO","11DPT0014U",100,"AACJ6404113K8","AACJ640411HGTNBV01","JAVIER ANDRADE CIBRIAN",111,24,"1130","1003","03","03","0000001",24,"030005",3,null,20170101,20170331,29855.09]
[null,"GUANAJUATO","11DPT0014U",100,"EALA741207MR5","EALA741207MGTSND01","ADRIANA ESCAMILLA LUNA",111,20,"1130","1003","03","03","0000001",20,"030008",3,null,20170101,20170331,14316.77]
[null,"GUANAJUATO","11DPT0014U",100,"EAGL600822HR9","EAGL600822HGTSNR08","LORENZO PABLO ESTRADA GONZALEZ",111,20,"1130","1003","03","03","0000001",20,"030009",3,null,20170101,20170331,8173.8600000000006]
[null,"GUANAJUATO","11DPT0014U",100,"GAAA750801K73","GAAA750801MGTYVN02","ANGELICA MARIA GAYTAN AVILA",111,25,"1130","1003","03","03","0000001",25,"030012",3,null,20170101,20170331,33301.5]
[null,"GUANAJUATO","11DPT0014U",100,"RIMF850611721","RIMF850611MGTNJB09","FABIOLA RINCON MOJICA",111,30,"1130","1003","03","03","0000001",30,"030013",3,null,20170101,20170331,33998.589999999997]
[null,"GUANAJUATO","11DPT0014U",100,"SACG751101985","SACG751101HDFNRR03","GERARDO JAVIER SANCHEZ CARRANZA",111,30,"1130","1003","03","03","0000001",30,"030016",3,null,20170101,20170331,23133.239999999998]
[null,"GUANAJUATO","11DPT0014U",100,"SEHJ520104JY1","SEHR520104HGTRRG15","J. RIGOBERTO SERVIN HERNANDEZ",111,12,"1130","1003","03","03","0000001",12,"030017",3,null,20170101,20170331,12661.19]
[null,"GUANAJUATO","11DPT0014U",100,"SAPG841029E61","SAPG841029HGTNRD01","JOSE GUADALUPE SANDOVAL PEREZ",111,30,"1130","1003","03","03","0000001",30,"030027",3,null,20170101,20170331,17610.37]
[null,"GUANAJUATO","11DPT0014U",100,"AEAJ830601BM3","AEAJ830601HGTRRN02","JUAN RAMON ARELLANO ARIAS",111,28,"1130","1003","03","03","0000001",28,"030029",3,null,20170101,20170331,22178.92]
[null,"GUANAJUATO","11DPT0014U",100,"SAMJ8108157T3","SAMJ810815HGTNTR06","JORGE ADRIAN SANCHEZ MATEHUALA",111,10,"1130","1003","03","03","0000001",10,"030031",3,null,20170101,20170331,9866.27]
[null,"GUANAJUATO","11DPT0014U",100,"VEFF790430A24","VEFF790430MGTNLT05","FATIMA NOHEMI VENEGAS FLORES",111,29,"1130","1003","03","03","0000001",29,"030039",3,null,20170101,20170331,29147.31]
[null,"GUANAJUATO","11DPT0014U",100,"CIHJ8210229R1","CIHJ821022HGTHRR04","JORGE LUIS CHIA HERNANDEZ",111,29,"1130","1003","03","03","0000001",29,"030047",3,null,20170101,20170331,24568.270000000004]
[null,"GUANAJUATO","11DPT0014U",100,"PELJ9208313F3","PELJ920831HSPRPN06","JUAN MARIO PEREZ LOPEZ",111,12,"1130","1003","03","03","0000001",12,"030095",3,null,20170101,20170331,7310.3200000000006]
[null,"GUANAJUATO","11DPT0014U",100,"LUAM950619UA1","LUAM950619HNLNLG07","MIGUEL ALBERTO LUNA ALONSO",111,7,"1130","1003","03","03","0000001",7,"030117",3,null,20170101,20170331,2789.59]
[null,"Total Personas : ",null,{"$f":"COUNTA(Tabla12[Turno])","v":1175},null,null,null,null,null,null,null,null,null,"Total Plazas : ",null,477,null,null,"Total Pto. Federal",null,{"$f":"SUBTOTAL(109,Tabla12[Percepciones pagadas en el Periodo de Comisión con Presupuesto Federal*])","v":42012175.270000115}]
[]
[null,null,null,null,null,null,null,null,null,null,null,null,null,null,null,null,null,null,"Total Ppto. Otras Fuentes:",null,null,{"$f":"SUM(V16:V1192)","v":0}]
[]
[null,"*Total de Percepciones reportadas por la Entidad Federativa como pagadas al trabajador durante la comisión."]
[null,"Fuente : Información proporcionada por las Entidades Federativas"]

{"sheet":"II D) 2","index":6,"n_rows":25,"n_cols":19,"rows_kept":25,"cut":false,"hidden":false,"merged":[[8,1,8,9],[11,0,12,0],[11,1,12,1],[11,5,12,5],[11,2,12,2],[11,3,12,3],[11,4,12,4],[11,16,12,16],[11,15,12,15],[11,17,12,17],[11,18,12,18],[11,6,11,12],[11,13,12,13],[11,14,12,14]]}
[]
[]
[]
[]
[]
[]
[]
[null,"Formato: Movimientos de Plazas"]
[null,{"$f":"IF('Caratula Resumen'!D22=\"Elige el Periodo…\",\"\",'Caratula Resumen'!D22)","v":"Fondo de Aportaciones para la Educación Tecnológica y de Adultos/Colegio Nacional de Educación Profesional Técnica (FAETA/CONALEP)"},null,null,null,null,null,null,null,null,null,null,null,null,null,null,"1er. Trimestre de 2017"]
[]
[]
[null,"Entidad Federativa","RFC","CURP","Nombre","Origen Presupuestal\n de la plazas","Clave Presupuestal",null,null,null,null,null,null,"Clave de nivel de puesto","Clave de nivel de sueldo","Zona Económica","Tipo de movimiento","Quincena Inicial","Quincena Final"]
[null,null,null,null,null,null,"Partida Presupuestal","Código de Pago","Clave de Unidad","Clave de Sub Unidad","Clave de Categoría","Horas Semana Mes ","Número de Plaza"]
[]
[null,"Entidad Federativa","RFC","CURP","Nombbre","Origen Presupuestal\n de la plazas","Partida Presupuestal","Código de Pago","Clave de Unidad","Clave de Sub Unidad","Clave de Categoría","Horas semana mes","Número de plaza","Clave de nivel de puesto","Clave de nivel de sueldo","Zona Económica","Tipo de movimiento","Quincena Inicial","Quincena Final"]
[]
[]
[]
[]
[]
[null,"Total Personas : ",null,null,null,null,null,null,null,null,"Total Plazas : "]
[]
[]
[]
[null,"Fuente : Información proporcionada por las Entidades Federativas"]

{"sheet":"II D) 4","index":7,"n_rows":25,"n_cols":17,"rows_kept":25,"cut":false,"hidden":false,"merged":[[21,13,21,14],[12,0,13,0],[12,6,13,6],[12,7,12,13],[12,14,12,15],[12,2,13,2],[12,1,13,1],[12,16,13,16],[12,5,13,5],[12,4,13,4],[12,3,13,3],[9,1,9,9]]}
[]
[]
[]
[]
[]
[]
[]
[]
[null,"Formato: Trabajadores Jubilados en el Periodo"]
[null,{"$f":"IF('Caratula Resumen'!D22=\"Elige el Periodo…\",\"\",'Caratula Resumen'!D22)","v":"Fondo de Aportaciones para la Educación Tecnológica y de Adultos/Colegio Nacional de Educación Profesional Técnica (FAETA/CONALEP)"},null,null,null,null,null,null,null,null,null,null,null,null,"1er. Trimestre de 2017"]
[]
[]
[null,"Entidad Federativa","R.F.C.","CURP","NOMBRE","Clave CT","Última(s) ó Penultima(s) Plaza(s) Ocupada(s)\n(*)","Clave Presupuestal de la Jubilación",null,null,null,null,null,null,"Periodo ocupado",null,"Quincena de inicio de jubilación"]
[null,null,null,null,null,null,null,"Partida Presupuestal","Código de Pago","Clave de Unidad","Clave de Sub Unidad","Clave de Categoría","Horas Semana Mes ","Número de Plaza","Inicio","Conclusión"]
[]
[null,"Entidad Federativa","R.F.C.","CURP","NOMBRE","Clave Centro de Trabajo","Última(s) ó Penultima(s) Plaza(s) Ocupada(s)\n(*)","Partida Presupuestal","Código de Pago","Clave de Unidad","Clave de Sub Unidad","Clave de Categoría","Horas Semana Mes ","Número de Plaza","Periodo ocupado\nInicio","Periodo ocupado\nConclusión","Quincena de inicio de jubilación"]
[null,"GUANAJUATO","HEXL501011H63","HEXL501011HGTRXZ04","JOSÉ DE LA LUZ HERNÁNDEZ","11DPT0007K",1,1130,1003,"02","03","CF33206","00.0",9184,199120,201624,201701]
[null,"GUANAJUATO","HECS621213HZ5","HECS621213HGTRLR02","SERGIO HERNANDEZ CALDERON","11DPT0005M",1,1130,1003,"00",72,"CF33206","00.0",4411,198617,201702,201703]
[null,"GUANAJUATO","GOSA4507257Y0","GOXS450725HGTNXN07","SANTIAGO GONZALEZ","11DPT0011X",1,1130,1003,"03",49,"S01202","00.0",10294,199419,201702,201703]
[null,"Total Personas : ",3,null,null,null,null,null,null,null,null,"Total Plazas : ",null,3]
[]
[]
[]
[null,"Fuente : Información proporcionada por las Entidades Federativas"]
[null,"(*) Si  el trabajador se jubila con más de una clave presupuestal, por cada plaza se debe llenar un registro hasta que se haya informado acerca de todas las plazas del trabajador."]

{"sheet":"II D) 4 A","index":8,"n_rows":26,"n_cols":18,"rows_kept":26,"cut":false,"hidden":false,"merged":[[20,13,20,14],[9,1,9,7],[22,13,22,14],[12,17,13,17],[12,1,13,1],[12,2,13,2],[12,3,13,3],[12,4,13,4],[12,5,13,5],[12,6,12,12],[12,13,12,14],[12,15,13,15],[12,16,13,16]]}
[]
[]
[]
[]
[]
[]
[]
[]
[null,"Formato: Trabajadores que Tramitaron Licencia Prejubilatoria en el Periodo"]
[null,{"$f":"IF('Caratula Resumen'!D22=\"Elige el Periodo…\",\"\",'Caratula Resumen'!D22)","v":"Fondo de Aportaciones para la Educación Tecnológica y de Adultos/Colegio Nacional de Educación Profesional Técnica (FAETA/CONALEP)"},null,null,null,null,null,null,null,null,null,null,null,null,null,null,"1er. Trimestre de 2017"]
[]
[]
[null,"Entidad Federativa","R.F.C.","CURP","NOMBRE","Clave integrada","Clave Presupuestal",null,null,null,null,null,null,"Periodo Licencia",null,"Percepciones pagadas con Presupuesto Federal en el  Periodo reportado*","Percepciones pagadas con Presupuesto de otra Fuente en el  Periodo reportado*","Clave CT Origen"]
[null,null,null,null,null,null,"Partida Presupuestal","Código de Pago","Clave de Unidad","Clave de Sub Unidad","Clave de Categoría","Horas Semana Mes ","Número de Plaza","Inicio","Conclusión"]
[]
[null,"Entidad Federativa","R.F.C.","CURP","NOMBRE","Clave integrada","Partida Presupuestal","Código de Pago","Clave de Unidad","Clave de Sub Unidad","Clave de Categoría","Horas Semana Mes ","Número de Plaza","Periodo Licencia\nInicio","Periodo Licencia\nConclusión","Percepciones pagadas con Presupuesto Federal en el  Periodo reportado*","Percepciones pagadas con Presupuesto de otra Fuente en el  Periodo reportado*","Clave CT Origen"]
[]
[]
[]
[]
[null,"Total Personas : ",4,null,null,null,null,null,null,null,"Total Plazas : ",null,4,"Total Pto. Federal",null,{"$f":"SUBTOTAL(109,Tabla5[Percepciones pagadas con Presupuesto Federal en el  Periodo reportado*])","v":0}]
[]
[null,null,null,null,null,null,null,null,null,null,null,null,null,"Total Ppto. Otras Fuentes",null,null,{"$f":"SUM(Q17:Q22)","v":0}]
[]
[null,"*Total de Percepciones reportadas por la Entidad Federativa como pagadas en el periodo "]
[null,"Fuente : Información proporcionada por las Entidades Federativas"]

{"sheet":"II D) 6","index":9,"n_rows":28,"n_cols":13,"rows_kept":28,"cut":false,"hidden":false,"merged":[[10,1,10,6],[13,12,14,12],[13,9,13,10],[13,11,14,11],[13,1,14,1],[13,2,14,2],[13,3,14,3],[13,4,14,4],[13,5,14,5],[13,6,14,6],[13,7,13,8]]}
[]
[]
[]
[]
[]
[]
[]
[]
[]
[null,"Formato: Trabajadores Contratados por Honorarios en el Periodo"]
[null,{"$f":"IF('Caratula Resumen'!D22=\"Elige el Periodo…\",\"\",'Caratula Resumen'!D22)","v":"Fondo de Aportaciones para la Educación Tecnológica y de Adultos/Colegio Nacional de Educación Profesional Técnica (FAETA/CONALEP)"},null,null,null,null,null,null,null,null,null,"1er. Trimestre de 2017"]
[]
[]
[null,"Entidad Federativa","Clave Centro de Trabajo","R.F.C.","CURP","Nombre","Identificador del Contrato","Equivalencia",null,"Periodo de Contratación",null,"Función","Percepciones pagadas dentro del periodo reportado"]
[null,null,null,null,null,null,null,"Clave de Categoría","Horas Semana Mes ","Inicio","Conclusión"]
[]
[null,"Entidad Federativa","Clave Centro de Trabajo","R.F.C.","CURP","Nombre","Identificador del Contrato","Clave de Categoría","Horas Semana Mes ","Periodo de Contratación\nInicio","Periodo de Contratación\nConclusión","Función","Percepciones pagadas dentro del periodo reportado"]
[]
[]
[]
[]
[]
[null,"Total Entidad Federativa Personas : ",null,null,null,null,null,null,null,null,null,"Subtotal Monto Pagado en el Periodo:"]
[]
[]
[null,null,null,null,null,null,null,null,null,"Total   Percepciones :"]
[]
[null,"Fuente : Información proporcionada por las Entidades Federativas"]

{"sheet":"II D) 7 1","index":10,"n_rows":50,"n_cols":19,"rows_kept":50,"cut":false,"hidden":false,"merged":[[46,16,46,17],[12,18,13,18],[12,13,13,13],[12,14,13,14],[12,15,13,15],[12,16,13,16],[8,17,8,18],[9,1,9,9],[12,6,13,6],[12,7,12,9],[12,10,13,10],[12,11,13,11],[12,12,13,12],[12,1,13,1],[12,2,13,2],[12,3,13,3],[12,4,13,4],[12,5,13,5],[12,17,13,17]]}
[]
[]
[]
[]
[]
[]
[]
[]
[null,"Formato: Analítico de Categorías / Plazas Autorizadas con su Tabulador",null,null,null,null,null,null,null,null,null,null,null,null,null,null,"Entidad Federativa:",{"$f":"IF('Caratula Resumen'!D21=\"Elige el Periodo…\",\"\",'Caratula Resumen'!D21)","v":" GUANAJUATO "}]
[null,{"$f":"IF('Caratula Resumen'!D22=\"Elige el Periodo…\",\"\",'Caratula Resumen'!D22)","v":"Fondo de Aportaciones para la Educación Tecnológica y de Adultos/Colegio Nacional de Educación Profesional Técnica (FAETA/CONALEP)"},null,null,null,null,null,null,null,null,null,null,null,null,null,null,null,"1er. Trimestre de 2017"]
[]
[]
[null,"Clave Tipo educativo","Clave Nivel educativo","Clave Subnivel educativo","Descripción Nivel / Subnivel","Tipo Financiamiento","Partida Presupuestal","CATEGORIA",null,null,"Zona Económica","Nivel Puesto","Nivel Sueldo","Tipo Contratación","Monto mensual\npor plaza jornada","Monto mensual\nPor Plaza HSM","Número de Plazas Jornada","Número de Plazas HSM","Monto total autorizado"]
[null,null,null,null,null,null,null,"Tipo de Categoría"," Categoría","Descripción"]
[]
[null,"Clave Tipo educativo","Clave Nivel educativo","Clave Subnivel educativo","Descripción Nivel / Subnivel","Tipo Financiamiento","Partida Presupestal","Tipo de Categoría"," Categoría","Descripción","Zona Económica","Nivel Puesto","Nivel Sueldo","Tipo Contratación","Monto mensual\npor plaza jornada","Monto mensual\nPor Plaza HSM","Número de Plazas Jornada","Número de Plazas HSM","Monto total autorizado"]
[null,3,32,31,"LICENCIATURA UNIVERSITARIA",1,1130,3,"000000PC","PROFESIONISTA INSTRUCTOR TIPO \"C\"","C","000000D1",1,"H",0,458.55,0,2073.5,950803.43]
[null,3,32,31,"LICENCIATURA UNIVERSITARIA",1,1130,3,"000000PB","PROFESIONISTA INSTRUCTOR TIPO \"B\"","C","000000D2",1,"H",0,397.3,0,2700,1072710]
[null,3,32,31,"LICENCIATURA UNIVERSITARIA",1,1130,3,"000000PA","PROFESIONISTA INSTRUCTOR TIPO \"A\"","C","000000D3",1,"H",0,353.5,0,3197.5,1130316.25]
[null,2,21,20,"PROFESIONAL TÉCNICO",1,1130,3,"000000TA","TÉCNICO INSTRUCTOR \"A\"","C","000000D4",1,"H",0,259.89999999999998,0,2304,598809.59999999998]
[null,1,12,4,"PRIMARIA GENERAL",1,1540,2,"00S01201","ASISTENTE DE SERV. BASICOS","C",2,1,"P",6220.4,0,68,0,422987.19999999995]
[null,1,12,4,"PRIMARIA GENERAL",1,1540,2,"0CF18201","AUXILIAR DE SEGURIDAD","C",2,1,"P",6220.4,0,15,0,93306]
[null,1,12,4,"PRIMARIA GENERAL",1,1540,2,"0CF18202","OPERADOR DE SERVICIOS BÁSICOS","C",2,1,"P",6220.4,0,1,0,6220.4]
[null,1,13,7,"SECUNDARIA GENERAL",1,1540,2,"00S01202","AUXILIAR DE SERV. GENERALES","C",4,1,"P",6778.6,0,54,0,366044.4]
[null,1,13,7,"SECUNDARIA GENERAL",1,1540,2,"0CF34202","PROMOTOR CULTURAL Y DEP.","C",5,1,"P",7059.85,0,9,0,63538.65]
[null,1,13,7,"SECUNDARIA GENERAL",1,1540,2,"00A03202","SECRETARIA \"C\"","C",5,1,"P",7059.85,0,32,0,225915.2]
[null,2,22,22,"BACHILLERATO GENERAL",1,1540,2,"0CF34201","TECNICO BIBLIOTECARIO","C",6,1,"P",7343.6,0,12,0,88123.200000000012]
[null,2,22,22,"BACHILLERATO GENERAL",1,1540,2,"0ED01201","TECNICO EN MAT. DIDÁCTICOS","C",6,1,"P",7343.6,0,11,0,80779.600000000006]
[null,2,22,22,"BACHILLERATO GENERAL",1,1540,2,"0CF19201","TUTOR ESCOLAR","C",6,1,"P",7343.6,0,15,0,110154]
[null,2,22,22,"BACHILLERATO GENERAL",1,1540,2,"0CF21202","ASISTENTE ESCOLAR Y S.","C",7,1,"P",7630.45,0,14,0,106826.3]
[null,2,22,22,"BACHILLERATO GENERAL",1,1540,2,"0CF04201","SECRETARIA \"B\"","C",7,1,"P",7630.45,0,14,0,106826.3]
[null,2,22,22,"BACHILLERATO GENERAL",1,1540,2,"00T08201","TECNICO EN GRAFICACIÓN","C",8,1,"P",7918.45,0,5,0,39592.25]
[null,2,22,22,"BACHILLERATO GENERAL",1,1540,2,"0CF33202","TECNICO EN CONTABILIDAD","C",9,1,"P",8210.9500000000007,0,7,0,57476.650000000009]
[null,2,22,22,"BACHILLERATO GENERAL",1,1540,2,"0CF33203","TECNICO FINANCIERO","C",9,1,"P",8210.9500000000007,0,9,0,73898.55]
[null,2,22,22,"BACHILLERATO GENERAL",1,1540,2,"0CF18203","SUPERVISOR DE MTTO","C",9,1,"P",8210.9500000000007,0,19,0,156008.05000000002]
[null,2,22,22,"BACHILLERATO GENERAL",1,1540,2,"00A01801","ADMINISTRATIVO TEC. ESP.","C",11,1,"P",8804.25,0,10,0,88042.5]
[null,2,22,22,"BACHILLERATO GENERAL",1,1540,2,"0CF33204","SUBJEFE TECNICO ESP.","C",13,1,"P",14521.7,0,60,0,871302]
[null,3,32,31,"LICENCIATURA UNIVERSITARIA",1,1540,2,"0CF33206","JEFE DE PROYECTO","C",15,1,"P",22390.75,0,81,0,1791260]
[null,3,32,31,"LICENCIATURA UNIVERSITARIA",1,1540,5,"0CF02105","COORDINADOR EJECUTIVO","C",21,1,"P",6414.54,0,10,0,257074]
[null,3,32,31,"LICENCIATURA UNIVERSITARIA",1,1540,5,"0CF01601","JEFE DE UNIDAD","C",22,1,"P",6828.12,0,6,0,178316.16]
[null,3,32,31,"LICENCIATURA UNIVERSITARIA",1,1540,5,"0CF11102","DIRECTOR DE CENTRO","C",24,1,"P",9588.43,0,1,0,113060.73000000001]
[null,3,32,31,"LICENCIATURA UNIVERSITARIA",1,1540,5,"0CF02100","SUBCOORDINADOR","C",25,1,"P",7497.02,0,3,0,37378.76]
[null,3,32,31,"LICENCIATURA UNIVERSITARIA",1,1540,5,"0CF02104","DIRECTOR DE PLANTEL \"D\" Y \"E\"","C",26,1,"P",7510.9100000000008,0,5,0,148479.15]
[null,3,32,31,"LICENCIATURA UNIVERSITARIA",1,1540,5,"0CF02103","DIRECTOR DE PLANTEL \"B\" Y \"C\"","C",27,1,"P",7919.9900000000007,0,8,0,242598.48]
[null,3,32,31,"LICENCIATURA UNIVERSITARIA",1,1540,5,"0CF02102","DIRECTOR DE PLANTEL \"A\"","C",28,1,"P",8839.01,0,1,0,30374.93]
[null,3,32,31,"LICENCIATURA UNIVERSITARIA",1,1540,5,"0CF11100","REPRESENTANTE","C",30,1,"P",16141.220000000001,0,1,0,79876.2]
[null,null,null,null,null,null,null,null,null,null,null,null,null,"Total Jornada:",{"$f":"SUBTOTAL(109,Tabla15[Monto mensual\npor plaza jornada])","v":225858.43999999997},null,"Total Autorizado:",null,{"$f":"SUBTOTAL(109,Tabla15[Monto total autorizado])","v":9588098.9400000013}]
[null,null,null,null,null,null,null,null,null,null,null,null,null,"Total HSM",{"$f":"SUM(Tabla15[Monto mensual\nPor Plaza HSM])","v":1469.25}]
[]
[null,"Fuente : Información proporcionada por las Entidades Federativas"]

{"sheet":"II D) 7 2 ","index":11,"n_rows":53,"n_cols":18,"rows_kept":53,"cut":false,"hidden":false,"merged":[[14,8,15,8],[14,9,14,13],[14,14,14,16],[10,16,10,17],[11,1,11,9],[14,1,15,1],[14,2,15,2],[14,3,15,3],[14,17,15,17],[14,6,15,6],[14,7,15,7],[14,4,15,4],[14,5,15,5]]}
[]
[]
[]
[]
[]
[]
[]
[]
[]
[]
[null,"Formato: Catálogo de Categorías y Tabuladores",null,null,null,null,null,null,null,null,null,null,null,null,null,"Entidad Federativa:",{"$f":"IF('Caratula Resumen'!D21=\"Elige el Periodo…\",\"\",'Caratula Resumen'!D21)","v":" GUANAJUATO "}]
[null,{"$f":"IF('Caratula Resumen'!D22=\"Elige el Periodo…\",\"\",'Caratula Resumen'!D22)","v":"Fondo de Aportaciones para la Educación Tecnológica y de Adultos/Colegio Nacional de Educación Profesional Técnica (FAETA/CONALEP)"},null,null,null,null,null,null,null,null,null,null,null,null,null,null,"1er. Trimestre de 2017"]
[]
[]
[null,"Identificador origen presupuestal de la plaza","Clave de categoría","Descripción de la categoría","Tipo de contratación","Tipo de categoría","Clave de concepto de pago","Clave de nivel de puesto","Clave de nivel de sueldo","Sueldo asignado por zona económica",null,null,null,null,"Datos adicionales de horas",null,null,"Fecha de actualización"]
[null,null,null,null,null,null,null,null,null,"Inicio de vigencia del sueldo","Fin de vigencia del sueldo","Monto Mensual Jornada ó de HSM\nZona A","Monto Mensual Jornada ó de HSM\nZona B","Monto Mensual Jornada ó de HSM\nZona C","Horas \nde compatibilidad","Horas de servicio (HSM)","Horas de docencia"]
[]
[null,"Identificador origen presupuestal de la plaza","Clave de categoría","Descripción de la categoría","Tipo de contratación","Tipo de categoría","Clave de concepto de pago","Clave de nivel de puesto","Clave de nivel de sueldo","Inicio de vigencia del sueldo","Fin de vigencia del sueldo","Monto Mensual Jornada ó de HSM\nZona A","Monto Mensual Jornada ó de HSM\nZona B","Monto Mensual Jornada ó de HSM\nZona C","Horas \nde compatibilidad","Horas de servicio (HSM)","Horas de docencia","Fecha de actualización"]
[null,1,"0CF02105","COORDINADOR EJECUTIVO II","P",5,1003,21,21,"201601",999999,6414.54,0,0,8,0,"00.0","20160901"]
[null,1,"0CF01601","JEFE DE UNIDAD","P",5,1003,22,22,"201601",999999,6828.12,0,0,8,0,"00.0","20160901"]
[null,1,"0CF11102","DIRECTOR DE CENTRO","P",5,1003,24,24,"201601",999999,9588.43,0,0,8,0,"00.0","20160901"]
[null,1,"0CF02100","SUBCOORDINADOR","P",5,1003,25,25,"201601",999999,7497.02,0,0,8,0,"00.0","20160901"]
[null,1,"0CF02104","DIRECTOR DE PLANTEL \"D\" Y \"E\" II","P",5,1003,26,26,"201601",999999,7510.9100000000008,0,0,8,0,"00.0","20160901"]
[null,1,"0CF02103","DIRECTOR DE PLANTEL \"B\" Y \"C\" II","P",5,1003,27,27,"201601",999999,7919.9900000000007,0,0,8,0,"00.0","20160901"]
[null,1,"0CF02102","DIRECTOR DE PLANTEL \"A\" II","P",5,1003,28,28,"201601",999999,8839.01,0,0,8,0,"00.0","20160901"]
[null,1,"0CF11100","REPRESENTANTE","P",5,1003,30,30,"201601",999999,16141.220000000001,0,0,8,0,"00.0","20160901"]
[null,1,"000000TA","DOCENTE TIPO 'TA'","H",1,1001,"000000D4",4,"201601",999999,259.89999999999998,0,0,0,0,20,"20160901"]
[null,1,"000000PA","DOCENTE TIPO 'PA'","H",1,1001,"000000D3",3,"201601",999999,353.5,0,0,0,0,20,"20160901"]
[null,1,"000000PB","DOCENTE TIPO 'PB'","H",1,1001,"000000D2",2,"201601",999999,397.3,0,0,0,0,20,"20160901"]
[null,1,"000000PC","DOCENTE TIPO 'PC'","H",1,1001,"000000D1",1,"201601",999999,458.55,0,0,0,0,20,"20160901"]
[null,1,"00S01201","ASISTENTE DE SERVICIOS BASICOS","P",2,1003,2,2,"201601",999999,6220.4,0,0,8,0,"00.0","20160901"]
[null,1,"0CF18201","AUXILIAR DE SEGURIDAD","P",2,1003,2,2,"201601",999999,6220.4,0,0,8,0,"00.0","20160901"]
[null,1,"0CF18202","OPERADOR DE SERVICIOS BASICOS","P",2,1003,2,2,"201601",999999,6220.4,0,0,8,0,"00.0","20160901"]
[null,1,"00S01202","AUXILIAR DE SERVICIOS GENERALES","P",2,1003,4,4,"201601",999999,6778.6,0,0,8,0,"00.0","20160901"]
[null,1,"0CF34202","PROMOTOR CULTURAL Y DEP","P",2,1003,5,5,"201601",999999,7059.85,0,0,8,0,"00.0","20160901"]
[null,1,"00A03202","SECRETARIA 'C'","P",2,1003,5,5,"201601",999999,7059.85,0,0,8,0,"00.0","20160901"]
[null,1,"0CF34201","TECNICO BIBILIOTECARIO","P",2,1003,6,6,"201601",999999,7343.6,0,0,8,0,"00.0","20160901"]
[null,1,"0ED01201","TECNICO DE MATS DIDACTICOS","P",2,1003,6,6,"201601",999999,7343.6,0,0,8,0,"00.0","20160901"]
[null,1,"0CF19201","TUTOR ESCOLAR","P",2,1003,6,6,"201601",999999,7343.6,0,0,8,0,"00.0","20160901"]
[null,1,"0CF21202","ASISTENTE ESCOLAR Y SOCIAL","P",2,1003,7,7,"201601",999999,7630.45,0,0,8,0,"00.0","20160901"]
[null,1,"0CF04201","SECRETARIA   B","P",2,1003,7,7,"201601",999999,7630.45,0,0,8,0,"00.0","20160901"]
[null,1,"00T08201","TECNICO EN GRAFICACION","P",2,1003,8,8,"201601",999999,7918.45,0,0,8,0,"00.0","20160901"]
[null,1,"0CF33202","TECNICO EN CONTABILIDAD","P",2,1003,9,9,"201601",999999,8210.9500000000007,0,0,8,0,"00.0","20160901"]
[null,1,"0CF33203","TECNICO FINANCIERO","P",2,1003,9,9,"201601",999999,8210.9500000000007,0,0,8,0,"00.0","20160901"]
[null,1,"0CF18203","SUPERVISOR DE MANTENIMIENTO","P",2,1003,9,9,"201601",999999,8210.9500000000007,0,0,8,0,"00.0","20160901"]
[null,1,"00A01801","ADMINISTRATIVO TECNICO ESPECIALISTA","P",2,1003,11,11,"201601",999999,8804.25,0,0,8,0,"00.0","20160901"]
[null,1,"0CF33204","SUBJEFE TECNICO ESPECIALISTA","P",2,1003,13,13,"201601",999999,14521.7,0,0,8,0,"00.0","20160901"]
[null,1,"0CF33206","JEFE DE PROYECTO","P",2,1003,15,15,"201601",999999,22390.75,0,0,8,0,"00.0","20160901"]
[null,null,null,null,null,null,null,null,null,null,"Total Zona A:",{"$f":"SUBTOTAL(109,Tabla16[Monto Mensual Jornada ó de HSM\nZona A])","v":227327.69000000009}]
[null,null,null,null,null,null,null,null,null,null,null,"Total Zona B:",{"$f":"SUM(M19:M49)","v":0}]
[null,null,null,null,null,null,null,null,null,null,null,null,"Total Zona C:",{"$f":"SUM(N19:N50)","v":0}]
[]
[null,"Fuente : Información proporcionada por las Entidades Federativas"]

{"sheet":"II D) 7 3","index":12,"n_rows":100,"n_cols":11,"rows_kept":100,"cut":false,"hidden":false,"merged":[[9,1,9,7],[8,9,8,10]]}
[]
[]
[]
[]
[]
[]
[]
[]
[null,"Formato: Catálogo de Percepciones y Deducciones",null,null,null,null,null,null,"Entidad Federativa:",{"$f":"IF('Caratula Resumen'!D21=\"Elige el Periodo…\",\"\",'Caratula Resumen'!D21)","v":" GUANAJUATO "}]
[null,{"$f":"IF('Caratula Resumen'!D22=\"Elige el Periodo…\",\"\",'Caratula Resumen'!D22)","v":"Fondo de Aportaciones para la Educación Tecnológica y de Adultos/Colegio Nacional de Educación Profesional Técnica (FAETA/CONALEP)"},null,null,null,null,null,null,null,"1er. Trimestre de 2017"]
[]
[]
[null,"Identificador origen presupuestal de la plaza","Tipo de concepto de pago ","Origen de financiamiento del concepto de percepciones.","Porcentaje de participación federal por fuente de recursos","Grupo al que pertenece concepto de pago (Percepción y/o Deducción)","Clave de concepto de pago","Descripción del concepto de pago ","Partida presupuestal","Fecha del","Fecha  al"]
[]
[null,"Identificador origen presupuestal de la plaza","Tipo de concepto de pago ","Origen de financiamiento del concepto de percepciones.","Porcentaje de participación federal por fuente de recursos","Grupo al que pertenece concepto de pago (Percepción y/o Deducción)","Clave de concepto de pago","Descripción del concepto de pago ","Partida presupuestal","Fecha del","Fecha  al"]
[null,"1","D","F","0","D1","0038","CREDITO INFONACOT","",20170101,"99999999"]
[null,"1","P","F","0","P3","1003","DIAS NO TRABAJADOS ADVO","",20170101,"99999999"]
[null,"1","P","F","0","P3","1003","SALARIO BASE","",20170101,"99999999"]
[null,"1","P","F","0","P3","1601","APOYO ECONOMICO NUPCIAS","",20170101,"99999999"]
[null,"1","P","F","0","P3","1602","DESARROLLO Y CAPACITACION","",20170101,"99999999"]
[null,"1","D","F","0","D1","1927","SEG. DAÑOS FOVISSSTE","",20170101,"99999999"]
[null,"1","P","F","0","P3","2517","ESTIMULO PRODUCTIVIDAD","",20170101,"99999999"]
[null,"1","P","F","0","P3","2517","ESTIMULO PRODUCTIVIDAD.","",20170101,"99999999"]
[null,"1","P","F","0","P3","2518","COMPENSACION GARANTIZADA","",20170101,"99999999"]
[null,"1","P","F","0","P3","2600","PUNTUALIDAD Y ASISTENCIA","",20170101,"99999999"]
[null,"1","P","F","0","P3","2655","APARATOS ORTOPEDICOS","",20170101,"99999999"]
[null,"1","P","F","0","P3","2680","ANTEOJOS O LENTES","",20170101,"99999999"]
[null,"1","D","F","0","D1","2735","SEGURO DE VIDA METLIFE","",20170101,"99999999"]
[null,"1","D","F","0","D1","2737","SEG.IND. METLIFE DE MEX.","",20170101,"99999999"]
[null,"1","P","F","0","P3","2754","GUARDERIA","",20170101,"99999999"]
[null,"1","P","F","0","P3","2766","PRIMA ANTIGÜEDAD","",20170101,"99999999"]
[null,"1","P","F","0","P3","2766","PRIMA ANTIGÜEDAD.","",20170101,"99999999"]
[null,"1","P","F","0","P3","2800","DESPENSA","",20170101,"99999999"]
[null,"1","P","F","0","P3","2800","DESPENSA MANDOS MEDIOS","",20170101,"99999999"]
[null,"1","P","F","0","P3","2805","PREVISION MULTIPLE","",20170101,"99999999"]
[null,"1","P","F","0","P3","2810","AYUDA PARA TITULACION","",20170101,"99999999"]
[null,"1","P","F","0","P3","2830","BONIF I.S.P.T B","",20170101,"99999999"]
[null,"1","P","F","0","P3","2830","BONIF. DE I.S.P.T. B","",20170101,"99999999"]
[null,"1","P","F","0","P3","2850","CONDICIONES INSALUBRES","",20170101,"99999999"]
[null,"1","D","F","0","D1","2920","SEGURO DE RETIRO","",20170101,"99999999"]
[null,"1","D","F","0","D1","2950","OTRAS DEDUCCIONES","",20170101,"99999999"]
[null,"1","P","F","0","P3","3613","AGUINALDO","",20170101,"99999999"]
[null,"1","P","F","0","P3","3613","AGUINALDO MM","",20170101,"99999999"]
[null,"1","P","F","0","P3","3623","PRIMA VACACIONAL","",20170101,"99999999"]
[null,"1","P","F","0","P3","3623","PRIMA VACACIONAL MM","",20170101,"99999999"]
[null,"1","P","F","0","P3","3701","PAGO POR DEFUNCION","",20170101,"99999999"]
[null,"1","D","","0","D1","5045","I.S.P.T. A RET. B","",20170101,"99999999"]
[null,"1","D","F","0","D1","5045","I.S.P.T. A RETENER","",20170101,"99999999"]
[null,"1","D","F","0","D1","5045","I.S.P.T. A RETENER B.","",20170101,"99999999"]
[null,"1","D","","0","D1","5045","R. I.S.P.T. A RET.","",20170101,"99999999"]
[null,"1","P","F","0","P3","5045","SUB. P/EMP.","",20170101,"99999999"]
[null,"1","D","F","0","D1","6250","SEG.SALUD T.ACTIVO","",20170101,"99999999"]
[null,"1","D","F","0","D1","6251","SEG.SALUD T.PENSIONADO","",20170101,"99999999"]
[null,"1","D","F","0","D1","6252","SEG.INVALIDEZ Y VIDA","",20170101,"99999999"]
[null,"1","D","F","0","D1","6253","S.SOCIALES Y CULT.","",20170101,"99999999"]
[null,"1","D","F","0","D1","6254","S.RET.CESANTIA AVZDA.","",20170101,"99999999"]
[null,"1","D","F","0","D1","8095","CRED. HIP. CRECIENTE","",20170101,"99999999"]
[null,"1","D","F","0","D1","8135","PRESTAMOS ISSSTE","",20170101,"99999999"]
[null,"1","D","F","0","D1","8523","CUOTA SINDICAL LOCAL","",20170101,"99999999"]
[null,"1","D","","0","D1","8580","PEN. ALIM. 01","",20170101,"99999999"]
[null,"1","D","F","0","D1","8580","PEN. ALIMENTICIA","",20170101,"99999999"]
[null,"1","D","F","0","D1","8580","PENSION ALIMENTICIA","",20170101,"99999999"]
[null,"1","D","F","0","D1","0038","CREDITO INFONACOT","",20170101,"99999999"]
[null,"4","P","F","0","P3","1001","SALARIO BASE DOC.","",20170101,"99999999"]
[null,"4","P","E","0","P3","1001","SALARIO BASE DOC. E","",20170101,"99999999"]
[null,"4","P","I","0","P3","1001","SALARIO BASE DOC. IP","",20170101,"99999999"]
[null,"4","P","F","0","P3","1002","SUBSIDIO AL EMPLEO","",20170101,"99999999"]
[null,"4","P","E","0","P3","1002","SUBSIDIO AL EMPLEO E","",20170101,"99999999"]
[null,"4","P","I","0","P3","1002","SUBSIDIO AL EMPLEO IP","",20170101,"99999999"]
[null,"1","D","F","0","D1","1927","SEG. DAÑOS FOVISSSTE","",20170101,"99999999"]
[null,"4","D","F","0","D1","2008","HORAS NO IMPARTIDAS","",20170101,"99999999"]
[null,"1","P","E","0","P3","2008","HORAS NO IMPARTIDAS E","",20170101,"99999999"]
[null,"1","P","F","0","P3","2008","HORAS NO IMPARTIDAS F","",20170101,"99999999"]
[null,"1","P","I","0","P3","2008","HORAS NO IMPARTIDAS IP","",20170101,"99999999"]
[null,"4","D","F","0","D1","2011","DESC. POR MIN. DE RETARDO","",20170101,"99999999"]
[null,"1","P","E","0","P3","2011","DESC. POR MIN. RET. E","",20170101,"99999999"]
[null,"1","P","F","0","P3","2011","DESC. POR MIN. RET. F","",20170101,"99999999"]
[null,"1","D","F","0","D1","2014","PRESTAMO A CORTO PLAZO","",20170101,"99999999"]
[null,"1","P","I","0","P3","2630","MATERIAL DIDÁCTICO","",20170101,"99999999"]
[null,"1","D","F","0","D1","2950","OTRAS DEDUCCIONES","",20170101,"99999999"]
[null,"4","P","F","0","P3","3613","AGUINALDO DOC","",20170101,"99999999"]
[null,"4","P","E","0","P3","3613","AGUINALDO DOC.","",20170101,"99999999"]
[null,"4","P","F","0","P3","3623","PRIMA VACACIONAL DOC","",20170101,"99999999"]
[null,"4","P","E","0","P3","3623","PRIMA VACACIONAL DOC.","",20170101,"99999999"]
[null,"1","D","","0","D1","5045","I.S.P.T. A RET. B","",20170101,"99999999"]
[null,"4","D","F","0","D1","5045","I.S.P.T. A RETEN. B","",20170101,"99999999"]
[null,"1","D","F","0","D1","5045","I.S.P.T. A RETENER","",20170101,"99999999"]
[null,"1","P","F","0","P3","5045","SUB. P/EMP.","",20170101,"99999999"]
[null,"1","D","F","0","D1","6250","SEG.SALUD T.ACTIVO","",20170101,"99999999"]
[null,"1","D","F","0","D1","6251","SEG.SALUD T.PENSIONADO","",20170101,"99999999"]
[null,"1","D","F","0","D1","6252","SEG.INVALIDEZ Y VIDA","",20170101,"99999999"]
[null,"1","D","F","0","D1","6253","S.SOCIALES Y CULT.","",20170101,"99999999"]
[null,"1","D","F","0","D1","6254","S.RET.CESANTIA AVZDA.","",20170101,"99999999"]
[null,"1","D","F","0","D1","8095","CRED. HIP. CRECIENTE","",20170101,"99999999"]
[null,"1","D","F","0","D1","8523","CUOTA SINDICAL LOCAL","",20170101,"99999999"]
[null,"4","D","F","0","D1","8523","CUOTA SINDICAL LOCAL DOC","",20170101,"99999999"]
[null,"1","D","","0","D1","8580","PEN. ALIM. 01","",20170101,"99999999"]
[null,"1","D","F","0","D1","8580","PEN. ALIMENTICIA","",20170101,"99999999"]
[null,"1","D","F","0","D1","8580","PENSION ALIMENTICIA","",20170101,"99999999"]
[null,"Fuente : Información proporcionada por las Entidades Federativas"]

{"sheet":"F) 1","index":13,"n_rows":26,"n_cols":19,"rows_kept":26,"cut":false,"hidden":false,"merged":[[9,1,9,6],[12,15,13,15],[12,16,13,16],[12,17,12,18],[12,1,13,1],[12,2,13,2],[12,3,13,3],[12,4,13,4],[12,5,13,5],[12,6,13,6],[12,7,13,7],[12,8,12,14]]}
[]
[]
[]
[]
[]
[]
[]
[]
[null,"Formato: Trabajadores con Doble Asignación Salarial en Municipios no Colindantes Geográficamente"]
[null,{"$f":"IF('Caratula Resumen'!D22=\"Elige el Periodo…\",\"\",'Caratula Resumen'!D22)","v":"Fondo de Aportaciones para la Educación Tecnológica y de Adultos/Colegio Nacional de Educación Profesional Técnica (FAETA/CONALEP)"},null,null,null,null,null,null,null,null,null,null,null,null,null,null,null,"1er.  Trimestre de 2017"]
[]
[]
[null,"Entidad Federativa","Municipio","Localidad","RFC","CURP","Nombre del Trabajador","Clave integrada","Clave Presupuestal",null,null,null,null,null,null,"Clave CT","Nombre CT","Periodo en el CT"]
[null,null,null,null,null,null,null,null,"Partida Presupuestal","Código de Pago","Clave de Unidad","Clave de Sub Unidad","Clave de Categoría","Horas Semana Mes ","Número de Plaza",null,null,"Desde","Hasta"]
[]
[null,"Entidad Federativa","Municipio","Localidad","RFC","CURP","Nombre del Trabajador","Clave integrada","Partida Presupuestal","Código de Pago","Clave de Unidad","Clave de Sub Unidad","Clave de Categoría","Horas semana mes","Número de Plaza","Clave CT","Nombre CT","Periodo en el CT\nDesde","Periodo en el CTH\nasta"]
[]
[]
[]
[]
[]
[null,"Total Personas : ",null,null,null,null,null,null,null,null,null,null,"Total Plazas : "]
[]
[]
[null,"Fuente : Información proporcionada por las Entidades Federativas"]
[null,"Importante: Listar Sólo los Municipios no Colindantes"]

{"sheet":"E)","index":14,"n_rows":26,"n_cols":8,"rows_kept":26,"cut":false,"hidden":false,"merged":[[9,1,9,5],[12,1,14,1],[12,2,14,2],[13,7,14,7],[12,3,14,3],[12,4,14,4],[12,5,12,7],[13,5,14,5],[13,6,14,6]]}
[]
[]
[]
[]
[]
[]
[]
[]
[null,"Formato: Trabajadores que Cobran con RFC / CURP con Formato Incorrecto"]
[null,{"$f":"IF('Caratula Resumen'!D22=\"Elige el Periodo…\",\"\",'Caratula Resumen'!D22)","v":"Fondo de Aportaciones para la Educación Tecnológica y de Adultos/Colegio Nacional de Educación Profesional Técnica (FAETA/CONALEP)"},null,null,null,null,null,"1er. Trimestre de 2017"]
[]
[]
[null,"Entidad Federativa","RFC","CURP","NOMBRE TRABAJADOR","Motivo"]
[null,null,null,null,null,"Sin RFC o erroneo","RFC Sin Homoclave","Sin CURP o Erronea"]
[]
[]
[null,"Entidad Federativa","RFC","CURP","NOMBRE TRABAJADOR","Sin RFC o erroneo","RFC Sin Homoclave","Sin CURP o Erronea"]
[]
[]
[]
[]
[]
[null,"Total Personas : ",null,null,"Total Sin RFC o Erroneo:"]
[null,null,null,null,null,"Total RFC Sin Homoclave:"]
[null,null,null,null,null,null,"Total Sin CURP o Erroneo:"]
[null,"Fuente : Información proporcionada por las Entidades Federativas"]

{"sheet":"F) 2","index":15,"n_rows":26,"n_cols":20,"rows_kept":26,"cut":false,"hidden":false,"merged":[[13,3,14,3],[13,4,14,4],[13,5,14,5],[10,1,10,9],[13,19,14,19],[13,18,14,18],[13,6,13,12],[13,13,14,13],[13,14,14,14],[13,15,14,15],[13,16,13,17],[13,1,14,1],[13,2,14,2]]}
[]
[]
[]
[]
[]
[]
[]
[]
[]
[null,"Formato: Trabajadores Ocupando Plazas que Superan el Número de Horas de Compatibilidad Autorizadas"]
[null,{"$f":"IF('Caratula Resumen'!D22=\"Elige el Periodo…\",\"\",'Caratula Resumen'!D22)","v":"Fondo de Aportaciones para la Educación Tecnológica y de Adultos/Colegio Nacional de Educación Profesional Técnica (FAETA/CONALEP)"},null,null,null,null,null,null,null,null,null,null,null,null,null,null,null,"1er. Trimestre de 2017"]
[]
[]
[null,"Entidad Federativa","RFC","CURP","Nombre","Clave integrada","Clave Presupuestal",null,null,null,null,null,null,"CT","Nombre CT","Turno CT","Periodo",null,"Total de Horas en el CT","Horas de compatibilidad de la categoría"]
[null,null,null,null,null,null,"Partida Presupuestal","Código de Pago","Clave de Unidad","Clave de Sub Unidad","Clave de Categoría","Horas Semana Mes ","Número de Plaza",null,null,null,"Desde","Hasta"]
[]
[null,"Entidad Federativa","RFC","CURP","Nombre","Clave integrada","Partida Presupuestal","Código de Pago","Clave de Unidad","Clave de Sub Unidad","Clave de Categoría","Horas semana mes","Número de plaza","CT","Nombre CT","Turno CT","Periodo\nDesde","Periodo\nHasta","Total de Horas en el CT","Horas de compatibilidad de la categoría"]
[]
[]
[]
[]
[]
[null,"Total Personas : ",null,null,null,null,null,null,null,null,"Total Plazas : "]
[]
[]
[null,"Fuente : Información proporcionada por las Entidades Federativas"]

{"sheet":"G)","index":16,"n_rows":28,"n_cols":20,"rows_kept":28,"cut":false,"hidden":false,"merged":[[13,19,14,19],[13,13,14,13],[13,14,14,14],[13,15,13,16],[13,17,14,17],[13,18,14,18],[10,1,10,8],[12,5,12,11],[13,1,14,1],[13,2,14,2],[13,3,14,3],[13,4,14,4],[13,5,14,5],[13,6,13,12]]}
[]
[]
[]
[]
[]
[]
[]
[]
[]
[null,"Formato: Trabajadores Cuyo Salario Básico Supere los Ingresos Promedio de un Docente en la Categoría más Alta del Tabulador Salarial Correspondiente a Cada Entidad"]
[null,{"$f":"IF('Caratula Resumen'!D22=\"Elige el Periodo…\",\"\",'Caratula Resumen'!D22)","v":"Fondo de Aportaciones para la Educación Tecnológica y de Adultos/Colegio Nacional de Educación Profesional Técnica (FAETA/CONALEP)"},null,null,null,null,null,null,null,null,null,null,null,null,null,null,null,null,"1er. Trimestre de 2017"]
[]
[]
[null,"Entidad Federativa","R.F.C.","CURP","Nombre","Clave integrada","Clave Presupuestal Integrada y Categoria aparte",null,null,null,null,null,null,"Clave CT Origen","Nombre CT","Periodo",null,"Monto de Remuneraciones Mensuales ","Monto de referencia","Diferencia\n(R-S)"]
[null,null,null,null,null,null,"Partida Presupuestal","Código de Pago","Clave de Unidad","Clave de Sub Unidad","Clave de Categoría","Horas Semana Mes ","Número de Plaza",null,null,"Desde","Hasta"]
[]
[null,"Entidad Federativa","R.F.C.","CURP","Nombre","Clave integrada","Partida Presupuestal","Código de Pago","Clave de Unidad","Clave de Sub Unidad","Clave de Categoría","Horas Semana Mes ","No. de plaza","CT","Nombre CT","Periodo\nDesde","Periodo\nHasta","Monto de Remuneraciones Mensuales ","Monto de referencia","Diferencia\n(R-S)"]
[]
[]
[]
[]
[]
[]
[null,"Total Personas : ",null,null,null,null,null,null,null,null,null,null,null,null,"Total Remuneraciones Mensuales:"]
[]
[null,null,null,null,null,null,null,null,null,null,null,null,null,null,null,null,null,"Total Diferencia:"]
[]
[null,"Fuente : Información proporcionada por las Entidades Federativas"]

{"sheet":"Listas","index":17,"n_rows":42,"n_cols":8,"rows_kept":42,"cut":false,"hidden":true,"merged":[]}
[]
[]
[]
[null,"Elige un Fondo…"]
[null,"Fondo de Aportaciones para la Educación Básica y Normal (FAEB)"]
[null,"Fondo de Aportaciones para la Educación Tecnológica y de Adultos/Colegio Nacional de Educación Profesional Técnica (FAETA/CONALEP)"]
[null,"Fondo de Aportaciones para la Educación Tecnológica y de Adultos/Instituto Nacional para la Educación de los Adultos (FAETA/INEA)"]
[]
[]
[null,null,null,null,null,null,null,"Elige la Entidad Federativa…"]
[null,"Elige el Periodo…",null,null,null,null,null,"AGUASCALIENTES"]
[null,"1er. Trimestre",null,null,null,null,null,"BAJA CALIFORNIA"]
[null,"2do. Trimestre",null,null,null,null,null,"BAJA CALIFORNIA SUR"]
[null,"3er. Trimestre",null,null,null,null,null,"CAMPECHE"]
[null,"4to. Trimestre",null,null,null,null,null,"COAHUILA "]
[null,null,null,"Elige el Año…",null,null,null,"COLIMA "]
[null,null,null,2013,null,null,null,"CHIAPAS "]
[null,null,null,2014,null,null,null,"CHIHUAHUA "]
[null,null,null,2015,null,null,null,"DISTRITO FEDERAL"]
[null,null,null,2016,null,null,null," DURANGO "]
[null,null,null,2017,null,null,null," GUANAJUATO "]
[null,null,null,2018,null,null,null," GUERRERO "]
[null,null,null,null,null,null,null," HIDALGO"]
[null,null,null,null,null,null,null," JALISCO "]
[null,null,null,null,null,null,null," MEXICO "]
[null,null,null,null,null,null,null," MICHOACAN "]
[null,null,null,null,null,null,null," MORELOS "]
[null,null,null,null,null,null,null," NAYARIT "]
[null,null,null,null,null,null,null," NUEVO LEON"]
[null,null,null,null,null,null,null," OAXACA "]
[null,null,null,null,null,null,null," PUEBLA "]
[null,null,null,null,null,null,null," QUERETARO "]
[null,null,null,null,null,null,null," QUINTANA ROO"]
[null,null,null,null,null,null,null," SAN LUIS"]
[null,null,null,null,null,null,null," SINALOA "]
[null,null,null,null,null,null,null," SONORA "]
[null,null,null,null,null,null,null," TABASCO "]
[null,null,null,null,null,null,null," TAMAULIPAS "]
[null,null,null,null,null,null,null," TLAXCALA "]
[null,null,null,null,null,null,null," VERACRUZ"]
[null,null,null,null,null,null,null," YUCATÁN "]
[null,null,null,null,null,null,null," ZACATECAS "]