{"text_format":"1","workbook":"xlsx","n_sheets":18,"sheets":["Caratula Resumen","A Y  II D3","A Y II D4","B)","II B) Y 1","II C y 1_","II D) 2","II D) 4","II D) 4 A","II D) 6","II D) 7 1","II D) 7 2 ","II D) 7 3","E)","F) 1","F) 2","G)","Listas"],"not_rendered":{"charts":0,"images":16,"macros":1,"external_links":0,"defined_names":17,"comments":16,"pivot_tables":0},"unopened":[],"bounds":{"document_bytes":16777216,"sheet_cells":100000,"rows_first":2000,"rows_last":500,"rows_between":2000,"halvings":0,"cell_chars":16384,"cell_head_chars":4096},"cells_cut":0,"cells_raw":0,"read":"whole","date_system":"1900"}

{"sheet":"Caratula Resumen","index":0,"n_rows":73,"n_cols":18,"rows_kept":73,"cut":false,"hidden":false,"merged":[[69,2,69,5],[71,2,71,5],[72,2,72,5],[73,2,73,5],[20,3,20,14],[21,3,21,14],[22,3,22,14],[49,3,49,6],[62,2,62,5],[63,2,63,5],[65,2,65,5],[66,2,66,5],[68,2,68,5],[43,3,43,6],[44,3,44,6],[45,3,45,6],[46,3,46,6],[47,3,47,6],[48,3,48,6],[37,3,37,6],[38,3,38,6],[39,3,39,6],[40,3,40,6],[41,3,41,6],[42,3,42,6],[36,3,36,6],[10,3,10,18],[11,3,11,18],[12,3,12,18],[34,3,34,6],[35,3,35,6]]}
[]
[]
[]
[]
[]
[]
[]
[]
[]
[]
[]
[null,null,null,"FORMATOS ENTREGADOS PARA DAR CUMPLIMIENTO AL ARTICULO 73 DE \"LA LEY GENERAL DE CONTABILIDAD GUBERNAMENTAL\""]
[]
[]
[]
[]
[]
[]
[]
[]
[null,null,"Entidad Federativa :"," GUANAJUATO "]
[null,null,"Fondo :","Fondo de Aportaciones para la Educación Tecnológica y de Adultos/Instituto Nacional para la Educación de los Adultos (FAETA/INEA)"]
[null,null,"Periodo :","1er. Trimestre"]
[]
[]
[]
[]
[]
[]
[]
[]
[null,null,null,null,null,null,null,"TOTAL REGISTROS ",null,"Num. de Paginas",null,"TOTAL PERSONAS",null,"TOTAL PLAZAS",null,"Total Pto. Federal",null,"Total Ppto. Otras Fuentes"]
[]
[]
[null,1,"A Y II D3","Personal Comisionado",null,null,null,0,null,1,null,0,null,0,null,0,null,0]
[null,2,"A Y II D4","Personal con Licencia",null,null,null,10,null,1,null,10,null,10,null,0,null,0]
[null,3,"B)   ","Registro Federal de Contribuyentes de Trabajadores con Pagos Retroactivos con un Periodo Mayor a 45 días",null,null,null,0,null,1,null,0,null,0,null,"N/A",null,"N/A"]
[null,4,"II B) Y 1","Plaza / Función",null,null,null,337,null,7,null,337,null,"N/A",null,"N/A",null,"N/A"]
[null,5,"II C y 1_","Personal Federalizado por Registro Federal de Contribuyentes",null,null,null,337,null,8,null,337,null,337,null,{"$f":"SUBTOTAL(109,Tabla12[Percepciones pagadas en el Periodo de Comisión con Presupuesto Federal*])","v":12080792},null,0]
[null,6,"II D) 2","Movimientos de Plazas",null,null,null,104,null,6,null,104,null,104,null,"N/A",null,"N/A"]
[null,7,"II D) 4","Trabajadores Jubilados en el Periodo",null,null,null,0,null,0,null,0,null,0,null,"N/A",null,"N/A"]
[null,8,"II D) 4 A","Trabajadores que Tramitaron Licencia Prejubilatoria en el Periodo",null,null,null,0,null,0,null,0,null,0,null,0,null,0]
[null,9,"II D) 6","Trabajadores Contratados por Honorarios en el Periodo",null,null,null,46,null,1,null,46,null,"N/A",null,"N/A",null,"N/A"]
[null,10,"II D) 7 1 ","Analítico de Categorías / Plazas Autorizadas con su Tabulador",null,null,null,19,null,1,null,"N/A",null,"N/A",null,"N/A",null,"N/A"]
[null,11,"II D) 7 2 ","Catálogo de Categorías y Tabuladores",null,null,null,228,null,7,null,"N/A",null,"N/A",null,"N/A",null,"N/A"]
[null,12,"II D) 7 3 ","Catálogo de Percepciones y Deducciones",null,null,null,237,null,8,null,"N/A",null,"N/A",null,"N/A",null,"N/A"]
[null,13,"E)","Trabajadores que Cobran con RFC / CURP con Formato Incorrecto",null,null,null,0,null,0,null,0,null,"N/A",null,"N/A",null,"N/A"]
[null,14,"F) 1","Trabajadores con Doble Asignación Salarial en Municipios no Colindantes Geográficamente",null,null,null,0,null,0,null,0,null,"N/A",null,"N/A",null,"N/A"]
[null,15,"F) 2","Trabajadores Ocupando Plazas que Superan el Número de Horas de Compatibilidad Autorizadas",null,null,null,1,null,1,null,1,null,1,null,"N/A",null,"N/A"]
[null,16,"G)","Trabajadores Cuyo Salario Básico Supere los Ingresos Promedio de un Docente en la Categoría más Alta del Tabulador Salarial Correspondiente a Cada Entidad",null,null,null,0,null,0,null,0,null,"N/A",null,"N/A",null,"N/A"]
[]
[]
[]
[]
[]
[]
[]
[]
[]
[]
[]
[]
[null,null,"C.P. ESMERALDA HERNANDEZ ESCOGIDO"]
[null,null,"Nombre del  Responsable"]
[]
[null,null,"SUBJEFE DE NOMINA FEDERAL"]
[null,null,"Cargo"]
[]
[]
[null,null,"Firma"]
[]
[null,null,"06 DE ABRIL DE 2017"]
[null,null,"Fecha"]

{"sheet":"A Y  II D3","index":1,"n_rows":27,"n_cols":25,"rows_kept":27,"cut":false,"hidden":false,"merged":[[9,1,9,7],[12,6,12,12],[12,1,13,1],[12,2,13,2],[12,3,13,3],[12,4,13,4],[12,5,13,5],[23,12,23,14],[12,24,13,24],[12,13,12,14],[12,15,13,15],[12,16,13,16],[12,17,13,17],[12,18,12,19],[12,20,13,20],[21,13,21,14],[12,21,13,21],[12,22,13,22],[12,23,13,23]]}
[]
[]
[]
[]
[]
[]
[]
[]
[null,"Formato: Personal Comisionado"]
[null,{"$f":"IF('Caratula Resumen'!D22=\"Elige el Periodo…\",\"\",'Caratula Resumen'!D22)","v":"Fondo de Aportaciones para la Educación Tecnológica y de Adultos/Instituto Nacional para la Educación de los Adultos (FAETA/INEA)"},null,null,null,null,null,null,null,null,null,null,null,null,null,null,null,null,null,null,null,null,null,"1er. Trimestre 2017"]
[]
[]
[null,"Entidad Federativa","R.F.C.","CURP","Nombre","Clave integrada","Clave Presupuestal",null,null,null,null,null,null,"Fecha Comisión",null,"Percepciones pagadas en el Periodo de Comisión con Presupuesto Federal*","Percepciones pagadas en el Periodo de Comisión con Presupuesto de otra fuente*","Clave CT Origen","CT Destino dentro del sector",null,"Lugar de la comisión fuera del sector educativo","Tipo de Comisión","Función Específica","Objeto de la comision","No. Oficio"]
[null,null,null,null,null,null,"Partida Presupuestal","Código de Pago","Clave de Unidad","Clave de Sub Unidad","Clave de Categoría","Horas Semana Mes ","Número de Plaza","Inicio","Conclusión",null,null,null,"Clave","Turno"]
[]
[null,"Entidad Federativa","R.F.C.","CURP","Nombre","Clave integrada","Partida Presupuestal","Código de Pago","Clave de Unidad","Clave de Sub Unidad","Clave de Categoría","Horas Semana Mes ","Número de Plaza","Fecha Comisión\nInicio","Fecha Comisión\nConclusión","Percepciones pagadas en el Periodo de Comisión con Presupuesto Federal*","Percepciones pagadas en el Periodo de Comisión con Presupuesto de otra fuente*","Clave CT Origen","Clave","Turno","Lugar de la comisión fuera del sector educativo","Tipo de Comisión","Función Específica","Objeto de la comision","No. Oficio"]
[]
[]
[]
[]
[]
[null,"Total Personas : ",null,null,null,null,null,null,null,null,"Total Plazas : ",null,null,"Total Pto. Federal"]
[]
[null,null,null,null,null,null,null,null,null,null,null,null,"Total Ppto. Otras Fuentes"]
[]
[null,"*Total de Percepciones reportadas por la Entidad Federativa como pagadas al trabajador durante la comisión."]
[null,"Fuente : Información proporcionada por las Entidades Federativas."]

{"sheet":"A Y II D4","index":2,"n_rows":26,"n_cols":21,"rows_kept":26,"cut":false,"hidden":false,"merged":[[9,1,9,6],[20,13,20,14],[12,16,13,16],[12,17,13,17],[12,20,13,20],[12,1,13,1],[12,3,13,3],[12,4,13,4],[12,5,13,5],[12,6,12,12],[12,13,12,14],[12,2,13,2],[12,18,12,19],[12,15,13,15]]}
[]
[]
[]
[]
[]
[]
[]
[]
[null,"Formato: Personal con Licencia"]
[null,{"$f":"IF('Caratula Resumen'!D22=\"Elige el Periodo…\",\"\",'Caratula Resumen'!D22)","v":"Fondo de Aportaciones para la Educación Tecnológica y de Adultos/Instituto Nacional para la Educación de los Adultos (FAETA/INEA)"},null,null,null,null,null,null,null,null,null,null,null,null,null,null,null,null,null,null,{"$f":"'A Y  II D3'!X10","v":"1er. Trimestre 2017"}]
[]
[]
[null,"Entidad Federativa","R.F.C.","CURP","NOMBRE","Clave integrada","Clave Presupuestal",null,null,null,null,null,null,"Periodo Licencia",null,"Percepciones pagadas en el Periodo de la Licencia con Presupuesto Federal*","Percepciones pagadas en el Periodo de la Licencia con Presupuesto de otra fuente*","Clave CT Origen","Licencia",null,"Descripción de la Licencia"]
[null,null,null,null,null,null,"Partida Presupuestal","Código de Pago","Clave de Unidad","Clave de Sub Unidad","Clave de Categoría","Horas Semana Mes ","Número de Plaza","Inicio","Conclusión",null,null,null,"Clave","Tipo"]
[]
[null,"Entidad Federativa","R.F.C.","CURP","NOMBRE","Clave integrada","Partida Presupuestal","Código de Pago","Clave de Unidad","Clave de Sub Unidad","Clave de Categoría","Horas Semana Mes ","Número de Plaza","Periodo Licencia\nInicio","Periodo Licencia\nConclusión","Percepciones pagadas en el Periodo de la Licencia con Presupuesto Federal*","Percepciones pagadas en el Periodo de la Licencia con Presupuesto de otra fuente*","Clave CT Origen","Licencia\nClave","Licencia\nTipo","Descripción de la Licencia"]
[null,"GUANAJUATO","HEAE670513TV7","HEAE670513HGTRGD08","EDUARDO HERNANDEZ AGUADO","831011725A0180600.0552",83101,1,7,25,"A01806",0,552,20170316,20170331,0,0,"11EBS0027E",null,"SIN GOCE DE SUELDO","ASUNTOS PERSONALES"]
[null,"GUANAJUATO","MOTE6904283LA","MOTE690428MGTRRL09","ELVIRA MORALES TORRES","831011724T0382000.01715",83101,1,7,24,"T03820",0,1715,20170316,20170331,0,0,"11EBS0027E",null,"SIN GOCE DE SUELDO","ASUNTOS PERSONALES"]
[null,"GUANAJUATO","RACR700730AH9","RACR700730MGTZNB06","REBECA RAZO CANO","831011720T0382000.02702",83101,1,7,20,"T03820",0,2702,20170316,20170331,6645.35,0,"11EBS0027E",null,"CON GOCE DE SUELDO","LICENCIA MEDICA"]
[null,"GUANAJUATO","CAOD910826S90","CAOD910826MSPNRL03","DULCE VIRIDIANA CANO ORTA","831011729T0381000.0201",83101,1,7,29,"T03810",0,201,20170316,20170331,0,0,"11EBS0027E",null,"SIN GOCE DE SUELDO","ASUNTOS PERSONALES"]
[null,"Total Personas : ",4,null,null,null,null,null,null,null,"Total Plazas : ",null,4,"Total Pto. Federal",null,{"$f":"SUBTOTAL(109,Tabla3[Percepciones pagadas en el Periodo de la Licencia con Presupuesto Federal*])","v":6645.35}]
[]
[null,null,null,null,null,null,null,null,null,null,null,null,null,"Total Ppto. Otras Fuentes"]
[]
[null,"*Total de Percepciones reportadas por la Entidad Federativa como pagadas al trabajador durante la Licencia."]
[null,"Fuente : Información proporcionada por las Entidades Federativas."]

{"sheet":"B)","index":3,"n_rows":27,"n_cols":19,"rows_kept":27,"cut":false,"hidden":false,"merged":[[9,1,9,10],[12,1,13,1],[12,2,13,2],[12,3,13,3],[12,4,13,4],[12,5,12,11],[12,18,13,18],[12,12,13,12],[12,13,13,13],[12,14,13,14],[12,15,12,16],[12,17,13,17]]}
[]
[]
[]
[]
[]
[]
[]
[]
[null,"Formato: Registro Federal de Contribuyentes de Trabajadores con Pagos Retroactivos con un Periodo Mayor a 45 días"]
[null,{"$f":"IF('Caratula Resumen'!D22=\"Elige el Periodo…\",\"\",'Caratula Resumen'!D22)","v":"Fondo de Aportaciones para la Educación Tecnológica y de Adultos/Instituto Nacional para la Educación de los Adultos (FAETA/INEA)"},null,null,null,null,null,null,null,null,null,null,null,null,null,null,null,{"$f":"'A Y  II D3'!X10","v":"1er. Trimestre 2017"}]
[]
[]
[null,"Entidad Federativa","RFC","CURP","Nombre","Clave Presupuestal",null,null,null,null,null,null,"Clave de Centro de Trabajo","Fecha de emisión de pago","Motivo del Pago Retroactivo","Periodo pagado",null,"Días transcurridos para el pago","Percepciones pagadas en el periodo reportado *"]
[null,null,null,null,null,"Partida Presupuestal","Código de Pago","Clave de Unidad","Clave de Sub Unidad","Clave de Categoría","Horas Semana Mes ","Número de Plaza",null,null,null,"Desde","Hasta"]
[]
[null,"Entidad Federativa","RFC","CURP","Nombre","Partida Presupuestal","Código de Pago","Clave de Unidad","Clave de Sub Unidad","Clave de Categoría","Horas semana mes","Número de plaza","Clave de Centro de Trabajo","Fecha de emisión de pago","Motivo del Pago Retroactivo","Periodo pagado\nDesde","Periodo pagado\nHasta","Días transcurridos para el pago","Percepciones pagadas en el periodo reportado *"]
[]
[]
[]
[]
[]
[null,"Total Personas : ",null,null,null,null,null,null,null,null,"Total Plazas : ",null,null,null,null,"Total Percepciones Pagadas:"]
[]
[]
[]
[null,"*Total de Percepciones reportadas por la Entidad Federativa como pagadas en el periodo "]
[null,"Fuente : Información proporcionada por las Entidades Federativas"]

{"sheet":"II B) Y 1","index":4,"n_rows":357,"n_cols":25,"rows_kept":357,"cut":false,"hidden":false,"merged":[[12,24,14,24],[13,6,13,8],[13,9,13,11],[13,12,13,14],[13,15,13,17],[13,18,13,20],[12,6,12,20],[12,21,14,21],[12,22,14,22],[12,23,14,23],[12,4,14,4],[12,3,14,3],[12,2,14,2],[9,1,9,9],[354,21,354,23],[12,1,14,1],[12,5,14,5]]}
[]
[]
[]
[]
[]
[]
[]
[]
[null,"Formato: Plaza / Función"]
[null,{"$f":"IF('Caratula Resumen'!D22=\"Elige el Periodo…\",\"\",'Caratula Resumen'!D22)","v":"Fondo de Aportaciones para la Educación Tecnológica y de Adultos/Instituto Nacional para la Educación de los Adultos (FAETA/INEA)"},null,null,null,null,null,null,null,null,null,null,null,null,null,null,null,null,null,null,null,null,null,{"$f":"'A Y  II D3'!X10","v":"1er. Trimestre 2017"}]
[]
[]
[null,"Entidad Federativa","RFC","CURP","Nombre","Centros de Trabajo","Plazas por tipo de función",null,null,null,null,null,null,null,null,null,null,null,null,null,null,"Total plazas Jornada","Total \nHSM","Total de Honorarios","Total de recursos presupuestales ejercidos en servicios personales en el periodo\n(2)"]
[null,null,null,null,null,null,"Apoyo a la labor educativa",null,null,"Administrativo y de servicio",null,null,"Docente y Apoyo Técnico Pedagógico",null,null,"Directivos y Supervisión",null,null,"Mandos medios y superiores"]
[null,null,null,null,null,null,"Jornada","HSM","Honorarios","Jornada","HSM","Honorarios","Jornada","HSM","Honorarios","Jornada","HSM","Honorarios","Jornada","HSM","Honorarios"]
[]
[null,"Entidad Federativa","RFC","CURP","Nombre","Centros de Trabajo","Jornada","HSM","Honorarios","Jornada2","HSM3","Honorarios4","Jornada5","HSM6","Honorarios7","Jornada8","HSM9","Honorarios10","Jornada11","HSM12","Honorarios13","Total plazas Jornada","Total \nHSM","Total de Honorarios","Total de recursos presupuestales ejercidos en servicios personales en el periodo\n(2)"]
[null,"GUANAJUATO","COPC760616J13","COPC760616HGTRTR05","CARLOS ALBERTO CORDOBA PATIﾑO",1,0,0,0,0,0,0,7,35,0,0,0,0,0,0,0,1,35,0,31710]
[null,"GUANAJUATO","TOMG850829D80","TOMG850829HGTRRD08","JOSE GUADALUPE DE LA TORRE MARQUEZ",1,0,0,0,0,0,0,7,35,0,0,0,0,0,0,0,1,35,0,32121]
[null,"GUANAJUATO","TEMY831012PC7","TEMY831012MGTRDD05","YADIRA ELISA TERAN MEDINA",1,0,0,0,0,0,0,7,35,0,0,0,0,0,0,0,1,35,0,32301]
[null,"GUANAJUATO","AUNC890701HB6","AUNC890701MQTGXR05","MARIA CRISTINA AGUADO NUﾑEZ",1,0,0,0,0,0,0,7,35,0,0,0,0,0,0,0,1,35,0,26722]
[null,"GUANAJUATO","SIHC930621FS8","SIHC930621MGTLRR01","CARMEN LAURA SILVA HERNANDEZ",1,0,0,0,0,0,0,7,35,0,0,0,0,0,0,0,1,35,0,21940]
[null,"GUANAJUATO","PETL870430KW3","PETL870430MMNRPZ02","LUZ MARIA PEREZ TAPIA",1,0,0,0,0,0,0,7,35,0,0,0,0,0,0,0,1,35,0,26328]
[null,"GUANAJUATO","CACJ850212C85","CACJ850212HGTMMN05","JUAN MIGUEL CAMARILLO CAMARILLO",1,0,0,0,0,0,0,7,35,0,0,0,0,0,0,0,1,35,0,26919]
[null,"GUANAJUATO","GUGJ930811J60","GUGJ930811MGTRNS05","MARIA JOSE GUERRERO GONZALEZ",1,0,0,0,0,0,0,7,35,0,0,0,0,0,0,0,1,35,0,26328]
[null,"GUANAJUATO","MISA810907T8A","MISA810907MGTRLL02","ALICIA MIRANDA SALAZAR",1,0,0,0,0,0,0,7,35,0,0,0,0,0,0,0,1,35,0,26328]
[null,"GUANAJUATO","VAMM8611122V7","VAMM861112MGTZCY00","MAYRA VAZQUEZ MACARENA",1,0,0,0,0,0,0,7,35,0,0,0,0,0,0,0,1,35,0,26919]
[null,"GUANAJUATO","MADS8906296J1","MADS890629MGTRMR05","SUREY VIRIDIANA MARTINEZ DOMINGUEZ",1,0,0,0,0,0,0,7,35,0,0,0,0,0,0,0,1,35,0,26328]
[null,"GUANAJUATO","AUVA8802214EA","AUVA880221MGTNLN08","ANGELICA ANGUIANO VILLAGRANA",1,0,0,0,0,0,0,7,35,0,0,0,0,0,0,0,1,35,0,26722]
[null,"GUANAJUATO","PITJ930828Q89","PITJ930828HGTCRN07","JONATHAN EDUARDO PICON TORRES",1,0,0,0,0,0,0,7,35,0,0,0,0,0,0,0,1,35,0,26919]
[null,"GUANAJUATO","FECM8910217I9","FECM891021MDFRVR01","MARIANA GUISELA FERREIRA CUEVAS",1,0,0,0,0,0,0,7,35,0,0,0,0,0,0,0,1,35,0,26722]
[null,"GUANAJUATO","GALA740123JB8","GALA740123MGTLPL08","ALMA ROSA GALINDO LOPEZ",1,0,0,0,0,0,0,7,35,0,0,0,0,0,0,0,1,35,0,26919]
[null,"GUANAJUATO","GAGY780903491","GAGY780903MDFLMS06","YOSELIN AIMEE GALVAN GAMEZ",1,0,0,0,0,0,0,7,35,0,0,0,0,0,0,0,1,35,0,26919]
[null,"GUANAJUATO","FAHG7612098T7","FAHG761209MGTLRD03","MA. GUADALUPE FALCON HERNANDEZ",1,0,0,0,0,0,0,7,35,0,0,0,0,0,0,0,1,35,0,26919]
[null,"GUANAJUATO","CADI801221FT5","CADI801221HGTRSS00","ISRAEL CARDENAS DIOSDADO",1,0,0,0,0,0,0,7,35,0,0,0,0,0,0,0,1,35,0,26919]
[null,"GUANAJUATO","MOPS740919966","MOPS740919MMCRRL01","SILVIA MORENO PARADA",1,0,0,0,0,0,0,7,35,0,0,0,0,0,0,0,1,35,0,26722]
[null,"GUANAJUATO","VATL701230M12","VATL701230MGTLRZ04","LUZ MARIA VALLE TORRES",1,0,0,0,0,0,0,7,35,0,0,0,0,0,0,0,1,35,0,26722]
[null,"GUANAJUATO","PAGG860302DX9","PAGG860302MDFDRB08","GABRIELA PADILLA GUERRERO",1,0,0,0,0,0,0,7,35,0,0,0,0,0,0,0,1,35,0,30039]
[null,"GUANAJUATO","GOGE831013479","GOGE831013MGTNRL03","ELIA JUDITH GONZALEZ GUERRA",1,0,0,0,0,0,0,7,35,0,0,0,0,0,0,0,1,35,0,31233]
[null,"GUANAJUATO","JUCR790316G8A","JUCR790316HGTRPL02","RAUL HERIBERTO JUAREZ CAPETILLO",1,0,0,0,0,0,0,7,35,0,0,0,0,0,0,0,1,35,0,26919]
[null,"GUANAJUATO","COBA780319BUA","COBA780319HGTRTN00","JOSE ANTONIO CORDOBA BAUTISTA",1,0,0,0,0,0,0,7,35,0,0,0,0,0,0,0,1,35,0,27099]
[null,"GUANAJUATO","CUPS720728BN7","CUPS720728MGTVSL06","SILVIA CUEVAS PESCADOR",1,0,0,0,0,0,0,7,35,0,0,0,0,0,0,0,1,35,0,26919]
[null,"GUANAJUATO","EAAJ8712218X3","EAAJ871221MMCSLS09","MARIA DE JESUS ESCAMILLA ALVAREZ",1,0,0,0,0,0,0,7,35,0,0,0,0,0,0,0,1,35,0,26722]
[null,"GUANAJUATO","RASE881027V79","RASE881027MGTMNL08","ELIA PATRICIA RAMIREZ SANCHEZ",1,0,0,0,0,0,0,7,35,0,0,0,0,0,0,0,1,35,0,8776]
[null,"GUANAJUATO","MERM890606QX7","MERM890606MGTNYY01","MYRIAM DE LOS ANGELES MENDOZA REYES",1,0,0,0,0,0,0,7,35,0,0,0,0,0,0,0,1,35,0,26722]
[null,"GUANAJUATO","PECA660503AR0","PECA660503MGTRBN07","ANTONIA PEREZ CABELLO",1,0,0,0,0,0,0,7,35,0,0,0,0,0,0,0,1,35,0,34724]
[null,"GUANAJUATO","SAAP650303N74","SAAP650303MGTNLT02","PATRICIA SANCHEZ ALVARADO",1,0,0,0,0,0,0,7,35,0,0,0,0,0,0,0,1,35,0,33927]
[null,"GUANAJUATO","MAAC750527A26","MAAC750527MGTRGR07","CAROLINA MARTINEZ AGREDA",1,0,0,0,0,0,0,7,35,0,0,0,0,0,0,0,1,35,0,29757]
[null,"GUANAJUATO","GOAA581209FLA","GOAA581209MGTNGL08","ALICIA GONZALEZ AGUIRRE",1,0,0,0,0,0,0,7,35,0,0,0,0,0,0,0,1,35,0,33573]
[null,"GUANAJUATO","CASR640104TEA","CASR640104MGTBNS05","ROSA MARIA CABRERA SANCHEZ",1,0,0,0,0,0,0,7,35,0,0,0,0,0,0,0,1,35,0,31353]
[null,"GUANAJUATO","SACA4609287F8","SACA460928MGTNRL03","MA. ALEJANDRINA CARMEN SANCHEZ CARRASCO",1,0,0,0,0,0,0,7,35,0,0,0,0,0,0,0,1,35,0,34281]
[null,"GUANAJUATO","UORV800303CD1","UORV800303MGTLNR08","VERONICA ULLOA RANGEL",1,0,0,0,0,0,0,7,35,0,0,0,0,0,0,0,1,35,0,29551]
[null,"GUANAJUATO","GUOA740914U2A","GUOA740914MMNDRN06","MA. DE LOS ANGELES GUDIﾑO ORDAZ",1,0,0,0,0,0,0,7,35,0,0,0,0,0,0,0,1,35,0,32331]
[null,"GUANAJUATO","GURV740105E98","GURV740105MGTRDR07","VERONICA GUERRERO RODRIGUEZ",1,0,0,0,0,0,0,7,35,0,0,0,0,0,0,0,1,35,0,31825]
[null,"GUANAJUATO","GOMM610218KG4","GOMM610218MGTNRR05","MARTA PATRICIA GONZALEZ MORENO",1,0,0,0,0,0,0,7,35,0,0,0,0,0,0,0,1,35,0,33897]
[null,"GUANAJUATO","LOCJ8109121HA","LOCJ810912HDFPRN00","JUAN CARLOS LOPEZ CRUZ",1,0,0,0,0,0,0,7,35,0,0,0,0,0,0,0,1,35,0,37655]
[null,"GUANAJUATO","GOND6504247RA","GOND650424MGTNXL03","DALIA SONIA GONZALEZ NIﾑO",1,0,0,0,0,0,0,7,35,0,0,0,0,0,0,0,1,35,0,31503]
[null,"GUANAJUATO","CUFC8809064X4","CUFC880906MOCRNY08","CYNTHIA CRUZ FUENTES",1,0,0,0,0,0,0,7,35,0,0,0,0,0,0,0,1,35,0,26921]
[null,"GUANAJUATO","PACP681127IL7","PACP681127MGTRHT00","PATRICIA PRADO CHAVEZ",1,0,0,0,0,0,0,7,35,0,0,0,0,0,0,0,1,35,0,41205]
[null,"GUANAJUATO","MAAC750325Q52","MAAC750325MGTLLR02","MA. DEL CARMEN MALDONADO ALMANZA",1,0,0,0,0,0,0,7,35,0,0,0,0,0,0,0,1,35,0,30039]
[null,"GUANAJUATO","HECG7209202C4","HECG720920MGTRRR07","GRISELDA HERRERA CERVANTES",1,0,0,0,0,0,0,7,35,0,0,0,0,0,0,0,1,35,0,34605]
[null,"GUANAJUATO","GOLC950116TN4","GOLC950116HGTMPR09","CARLOS ADEMIR EUSEBIO GOMEZ LOPEZ",1,0,0,0,0,0,0,7,35,0,0,0,0,0,0,0,1,35,0,8776]
[null,"GUANAJUATO","CAGR690302HRA","CAGR690302MGTMMS03","MA. DEL ROSARIO CAMPOS GOMEZ",1,0,0,0,0,0,0,7,35,0,0,0,0,0,0,0,1,35,0,34071]
[null,"GUANAJUATO","JABE820909HH0","JABE820909MGTSLL12","ELOISA JASSO BALLEZA",1,0,0,0,0,0,0,7,35,0,0,0,0,0,0,0,1,35,0,26919]
[null,"GUANAJUATO","TAML5306213J5","TAML530621HGTPRS02","JOSE LUIS TAPIA MARTINEZ",1,0,0,0,0,0,0,7,35,0,0,0,0,0,0,0,1,35,0,31179]
[null,"GUANAJUATO","LEGJ871018BN9","LEGJ871018MGTDNN02","JENIFER LEDEZMA GONZALEZ",1,0,0,0,0,0,0,7,35,0,0,0,0,0,0,0,1,35,0,26328]
[null,"GUANAJUATO","MAGG810106790","MAGG810106MGTRNR04","GRACIELA MARTINEZ GONZALEZ",1,0,0,0,0,0,0,7,35,0,0,0,0,0,0,0,1,35,0,28219]
[null,"GUANAJUATO","ZAZJ9610201D4","ZAZJ961020HQTRRN09","JONATAN REMBERTO ZARAZUA ZARAZUA",1,0,0,0,0,0,0,7,35,0,0,0,0,0,0,0,1,35,0,26722]
[null,"GUANAJUATO","MENM790123EM1","MENM790123MGTDVR00","MIRIAM DE LOS ANGELES GABRIELA MEDEL NAVARRETE",1,0,0,0,0,0,0,7,35,0,0,0,0,0,0,0,1,35,0,26722]
[null,"GUANAJUATO","GOPS8011178I3","GOPS801117MGTMRN09","MARIA SANDRA GOMEZ PEREZ",1,0,0,0,0,0,0,7,35,0,0,0,0,0,0,0,1,35,0,29847]
[null,"GUANAJUATO","EARF920415GZ8","EARF920415MGTSDT17","FATIMA YAZMIN ESTRADA RODRIGUEZ",1,0,0,0,0,0,0,7,35,0,0,0,0,0,0,0,1,35,0,26328]
[null,"GUANAJUATO","GUND770803A3A","GUND770803HGTTTN01","DANIEL ADRIAN GUTIERREZ NIETO",1,0,0,0,0,0,0,7,35,0,0,0,0,0,0,0,1,35,0,4388]
[null,"GUANAJUATO","VARJ8610196J7","VARJ861019HGTZMV06","JAVIER ALEJANDRO VAZQUEZ RAMIREZ",1,0,0,0,0,0,0,7,35,0,0,0,0,0,0,0,1,35,0,26328]
[null,"GUANAJUATO","PACM931219CM1","PACM931219MDGLBY03","MAYLEN NOEMI PLASCENCIA CABRERA",1,0,0,0,0,0,0,7,35,0,0,0,0,0,0,0,1,35,0,26919]
[null,"GUANAJUATO","ROHG921225D70","ROHG921225MGTDRL00","GLORIA LORENA BEATRIZ RODRIGUEZ HERNANDEZ",1,0,0,0,0,0,0,7,35,0,0,0,0,0,0,0,1,35,0,4388]
[null,"GUANAJUATO","HUSA860811CJ2","HUSA860811MGTRRN07","MARIA DE LOS ANGELES HURTADO SUAREZ",1,0,0,0,0,0,0,7,35,0,0,0,0,0,0,0,1,35,0,13164]
[null,"GUANAJUATO","DUPS9001267KA","DUPS900126MGTRRN08","SANDRA IVONNE DURAN PRADO",1,0,0,0,0,0,0,7,35,0,0,0,0,0,0,0,1,35,0,26919]
[null,"GUANAJUATO","BARA700515RH6","BARA700515MGTRML07","ALMA VELIA BARBOSA RAMIREZ",1,0,0,0,0,0,0,7,35,0,0,0,0,0,0,0,1,35,0,41722]
[null,"GUANAJUATO","CAGY820417182","CAGY820417MGTRTJ03","YAJAHIRA CARDENAS GUTIERREZ",1,0,0,0,0,0,0,7,35,0,0,0,0,0,0,0,1,35,0,26919]
[null,"GUANAJUATO","HEMF950111UT8","HEMF950111HGTRRR04","FRANCISCO ANTONIO HERNANDEZ MARTINEZ",1,0,0,0,0,0,0,7,35,0,0,0,0,0,0,0,1,35,0,4388]
[null,"GUANAJUATO","HUSM771116C7A","HUSM771116MMNNLR06","MARIZA HUANTE SILVA",1,0,0,0,0,0,0,7,35,0,0,0,0,0,0,0,1,35,0,26722]
[null,"GUANAJUATO","JAAX8707291Z3","JAAX870729MCLRRC03","XOCHITL YUVICELA JARA ARRIAGA",1,0,0,0,0,0,0,7,35,0,0,0,0,0,0,0,1,35,0,26919]
[null,"GUANAJUATO","NAMR8410165H3","NAMR841016MGTVRS07","ROSALINDA NAVARRO MARTINEZ",1,0,0,0,0,0,0,7,35,0,0,0,0,0,0,0,1,35,0,26919]
[null,"GUANAJUATO","RIRZ9005014I8","RIRZ900501MMCCJZ06","ZAZIL RICO ROJAS",1,0,0,0,0,0,0,7,35,0,0,0,0,0,0,0,1,35,0,26919]
[null,"GUANAJUATO","CARA730215VE3","CARA730215MGTHJL00","ALMA DELIA CHAVEZ ROJAS",1,0,0,0,0,0,0,7,35,0,0,0,0,0,0,0,1,35,0,33333]
[null,"GUANAJUATO","AIMM891226K29","AIMM891226MMCMXR03","MARIANA AMBRIZ MUﾑOZ",1,0,0,0,0,0,0,7,35,0,0,0,0,0,0,0,1,35,0,26328]
[null,"GUANAJUATO","GUZK880623FTA","GUZK880623HGTTVR00","KARIM MIGUEL GUTIERREZ ZAVALA",1,0,0,0,0,0,0,7,35,0,0,0,0,0,0,0,1,35,0,26328]
[null,"GUANAJUATO","OESD9012116A0","OESD901211MGTRVL05","DOLORES GUADALUPE ORTEGA SAAVEDRA",1,0,0,0,0,0,0,7,35,0,0,0,0,0,0,0,1,35,0,26328]
[null,"GUANAJUATO","VAPM701212VE4","VAPG701212MGTLRD04","MA. GUADALUPE VALADEZ PEREZ",1,0,0,0,0,0,0,7,35,0,0,0,0,0,0,0,1,35,0,26919]
[null,"GUANAJUATO","OELM6606116J8","OELM660611MGTRRR05","MARTINA ORNELAS LARA",1,0,0,0,0,0,0,7,35,0,0,0,0,0,0,0,1,35,0,4488]
[null,"GUANAJUATO","HEDM871214861","HEDM871214HGTRLN04","JOSE MANUEL HERNANDEZ DELGADO",1,0,0,0,0,0,0,7,35,0,0,0,0,0,0,0,1,35,0,28959]
[null,"GUANAJUATO","SEGE921103JEA","SEGE921103MMNRRS05","ESTEFANIA SERRATO GARCIA",1,0,0,0,0,0,0,7,35,0,0,0,0,0,0,0,1,35,0,26919]
[null,"GUANAJUATO","AAAL860804UN9","AAAL860804MTSBZD03","LUDIM ABRAHAM AZUARA",1,0,0,0,0,0,0,7,35,0,0,0,0,0,0,0,1,35,0,26919]
[null,"GUANAJUATO","FOQL7110275I8","FOQL711027MGTLVN02","LEONOR FLORES QUEVEDO",1,0,0,0,0,0,0,7,35,0,0,0,0,0,0,0,1,35,0,28959]
[null,"GUANAJUATO","MAAL680513MP3","MAAL680513MMNRNZ01","MARIA DE LA LUZ MARTINEZ ANDRADE",1,0,0,0,0,0,0,7,35,0,0,0,0,0,0,0,1,35,0,35195]
[null,"GUANAJUATO","COOS660919CRA","COOS660919MGTNLS08","SUSANA ISABEL CONTRERAS OLMOS",1,0,0,0,0,0,0,7,35,0,0,0,0,0,0,0,1,35,0,40538]
[null,"GUANAJUATO","HECA7404077F6","HECA740407MGTRND08","ADRIANA HERNANDEZ CANTERO",1,0,0,0,0,0,0,7,35,0,0,0,0,0,0,0,1,35,0,33957]
[null,"GUANAJUATO","HECS730303TG6","HECS730303MGTRNS05","SUSANA TERESA HERNANDEZ CANTERO",1,0,0,0,0,0,0,7,35,0,0,0,0,0,0,0,1,35,0,34191]
[null,"GUANAJUATO","RAJC810331LAA","RAJC810331MGTMRL02","CLAUDIA JACQUELINE RAMIREZ JARAMILLO",1,0,0,0,0,0,0,7,35,0,0,0,0,0,0,0,1,35,0,40717]
[null,"GUANAJUATO","FONO7308067J5","FOXN730806MGTLXR04","NORMA LILIA FLORES ",1,0,0,0,0,0,0,7,35,0,0,0,0,0,0,0,1,35,0,33503]
[null,"GUANAJUATO","CACP630616HG8","CACP630616MGTLHT16","MA. PATRICIA DOLORES CALDERON CHAVEZ",1,0,0,0,0,0,0,7,35,0,0,0,0,0,0,0,1,35,0,32466]
[null,"GUANAJUATO","CAVA651011TB7","CAVA651011HGTLRL04","JOSE ALFREDO CALDERON VARELA",1,0,0,0,0,0,0,7,35,0,0,0,0,0,0,0,1,35,0,35116]
[null,"GUANAJUATO","HERA790725FQ8","HERA790725MGTRDL08","ALEJANDRA HERNANDEZ RODRIGUEZ",1,0,0,0,0,0,0,7,35,0,0,0,0,0,0,0,1,35,0,32568]
[null,"GUANAJUATO","AURM640517UH3","AURM640517HGTGCR01","MARTIN AGUIRRE RICO",1,0,0,0,0,0,0,7,35,0,0,0,0,0,0,0,1,35,0,34420]
[null,"GUANAJUATO","ZAGJ830623IG5","ZAGJ830623MGTVLN06","JUANA ZAVALA GALLEGOS",1,0,0,0,0,0,0,7,35,0,0,0,0,0,0,0,1,35,0,31962]
[null,"GUANAJUATO","PACL700401SI9","PACL700401MGTRHR04","LAURA PRADO CHAVEZ",1,0,0,0,0,0,0,7,35,0,0,0,0,0,0,0,1,35,0,36450]
[null,"GUANAJUATO","RADL770820MV0","RADL770820HGTMZS07","LUIS ALEJANDRO RAMIREZ DIAZ",1,0,0,0,0,0,0,7,35,0,0,0,0,0,0,0,1,35,0,8934]
[null,"GUANAJUATO","MAGE751103B16","MAGE751103MGTYTR08","ERIKA GUADALUPE MAYCOTTE GUTIERREZ",1,0,0,0,0,0,0,7,35,0,0,0,0,0,0,0,1,35,0,34569]
[null,"GUANAJUATO","SACM760716KV0","SACM760716MJCNSN08","MONICA DEL CARMEN SANDOVAL CASTELLON",1,0,0,0,0,0,0,7,35,0,0,0,0,0,0,0,1,35,0,38294]
[null,"GUANAJUATO","VIRM731126CL3","VIRM731126MGTLMN06","MARIA MONICA VILLANUEVA RAMIREZ",1,0,0,0,0,0,0,7,35,0,0,0,0,0,0,0,1,35,0,34748]
[null,"GUANAJUATO","SOSM750119S26","SOSM750119MGTRTR02","MARTHA SORIA SOTO",1,0,0,0,0,0,0,7,35,0,0,0,0,0,0,0,1,35,0,34163]
[null,"GUANAJUATO","MISR800307LH4","MISR800307MGTRLS07","ROSAURA MIRANDA SALAZAR",1,0,0,0,0,0,0,7,35,0,0,0,0,0,0,0,1,35,0,34550]
[null,"GUANAJUATO","FEET711003EB8","FEET711003MGTLSR05","TERESA FELIX ESTRELLA",1,0,0,0,0,0,0,7,35,0,0,0,0,0,0,0,1,35,0,35844]
[null,"GUANAJUATO","AUGA6812277W5","AUGA681227MGTGRN03","ANA MARIA AGUILAR GARCIA",1,0,0,0,0,0,0,7,35,0,0,0,0,0,0,0,1,35,0,51192]
[null,"GUANAJUATO","RIRJ650926ED3","RIRJ650926HGTCMX07","J.JESUS RICO RAMIREZ",1,0,0,0,0,0,0,7,35,0,0,0,0,0,0,0,1,35,0,32349]
[null,"GUANAJUATO","JAAM880824146","JAAM880824MCLRRR06","MARISOL IBETH JARA ARRIAGA",1,0,0,0,0,0,0,7,35,0,0,0,0,0,0,0,1,35,0,22335]
[null,"GUANAJUATO","AIMF9209181C4","AIMF920918MJCVCL02","FLOR SOFIA AVILA MACIAS",1,0,0,0,0,0,0,7,35,0,0,0,0,0,0,0,1,35,0,22537]
[null,"GUANAJUATO","FAOI930617PD8","FAOI930617HGTRRS09","JOSE ISAAC FRAUSTO ORTEGA",1,0,0,0,0,0,0,7,35,0,0,0,0,0,0,0,1,35,0,4467]
[null,"GUANAJUATO","CAGK871023GK5","CAGK871023MGTDDR07","KARLA ESTEFANA CAUDILLO GODINEZ",1,0,0,0,0,0,0,7,35,0,0,0,0,0,0,0,1,35,0,27408]
[null,"GUANAJUATO","CAPA8005264B4","CAPA800526MGTMRN08","ANA RUTH CAMACHO PRADO",1,0,0,0,0,0,0,7,35,0,0,0,0,0,0,0,1,35,0,22335]
[null,"GUANAJUATO","VAQE630516EZ8","VAQE630516MGTRVS07","ESTHELA VARGAS QUEVEDO",1,0,0,0,0,0,0,7,35,0,0,0,0,0,0,0,1,35,0,36405]
[null,"GUANAJUATO","ROAS750805HA3","ROAS750805HGTDRR01","SERGIO RODRIGUEZ ARANDA",1,0,0,0,0,0,0,7,35,0,0,0,0,0,0,0,1,35,0,18532]
[null,"GUANAJUATO","MEGG6409203P0","MEGG640920HGTDLR04","GERARDO MEDINA GALVAN",1,0,0,0,0,0,0,7,35,0,0,0,0,0,0,0,1,35,0,32120]
[null,"GUANAJUATO","PEGH8706085G5","PEGH870608HGTDNM01","JOSE HUMBERTO PEDROZA GONZALEZ",1,0,0,0,0,0,0,7,35,0,0,0,0,0,0,0,1,35,0,18532]
[null,"GUANAJUATO","BINL4906195XA","BINL490619HDFRGS05","JOSE LUIS BRIBIESCA NEGRETE",1,0,0,0,0,0,0,7,35,0,0,0,0,0,0,0,1,35,0,50808]
[null,"GUANAJUATO","AIML940210D95","AIML940210MGTRNZ09","LUZ PATRICIA ARVIZU MONTES",1,0,0,0,0,0,0,7,35,0,0,0,0,0,0,0,1,35,0,28224]
[null,"GUANAJUATO","GUAA541207PD5","GUAA541207MGTTVL07","ALMA ROSA GUTIERREZ AVILES",1,0,0,0,0,0,0,7,35,0,0,0,0,0,0,0,1,35,0,33195]
[null,"GUANAJUATO","SAES9003201Z8","SAES900320MGTLSL08","SELMA ALEJANDRA SALDAﾑA ESTRADA",1,0,0,0,0,0,0,7,35,0,0,0,0,0,0,0,1,35,0,23165]
[null,"GUANAJUATO","EASG700512IU9","EASG700512MCMSNR00","GRACIELA ESCAMILLA SANCHEZ",1,0,0,0,0,0,0,7,35,0,0,0,0,0,0,0,1,35,0,34837]
[null,"GUANAJUATO","HEEI750809EB5","HEEI750809HGTRSS09","ISIDORO DE SEVILLA HERNANDEZ ESCOGIDO",1,0,0,0,0,0,0,7,35,0,0,0,0,0,0,0,1,35,0,13899]
[null,"GUANAJUATO","VAPR690730J94","VAPR690730MGTZNS03","ROSA LAURA VAZQUEZ PONCE",1,0,0,0,0,0,0,7,35,0,0,0,0,0,0,0,1,35,0,37761]
[null,"GUANAJUATO","PEGL800121UG2","PEGL800121MGTRNR07","LAURA PALOMA PEREZ GONZALEZ",1,0,0,0,0,0,0,7,35,0,0,0,0,0,0,0,1,35,0,23165]
[null,"GUANAJUATO","AILP690120TW9","AILP690120MSPRNT09","PATRICIA DE JESUS ARCIGA LEON",1,0,0,0,0,0,0,7,35,0,0,0,0,0,0,0,1,35,0,39389]
[null,"GUANAJUATO","HECR621219RI5","HECR621219MGTRRS02","MARIA DEL ROSARIO HERNANDEZ CARDENAS",1,0,0,0,0,0,0,7,35,0,0,0,0,0,0,0,1,35,0,37969]
[null,"GUANAJUATO","NAHL730801RV8","NAHL730801MGTVRR01","MARIA DE LOURDES NAVARRO HERNANDEZ",1,0,0,0,0,0,0,7,35,0,0,0,0,0,0,0,1,35,0,34281]
[null,"GUANAJUATO","HESF670102636","HESF670102HGTRLR07","FERMIN HERNANDEZ SILVA",1,0,0,0,0,0,0,7,35,0,0,0,0,0,0,0,1,35,0,38321]
[null,"GUANAJUATO","CAJU6804082V6","CAXJ680408MGTMXN08","JUANA MARIA CAMACHO ",1,0,0,0,0,0,0,7,35,0,0,0,0,0,0,0,1,35,0,37713]
[null,"GUANAJUATO","RAOM680518SX1","RAOM680518MMNNCR06","MARIBEL RANGEL OCHOA",1,0,0,0,0,0,0,7,35,0,0,0,0,0,0,0,1,35,0,36250]
[null,"GUANAJUATO","BARA6501175H5","BARA650117MGTRDN02","ANTONIA BARRERA RODRIGUEZ",1,0,0,0,0,0,0,7,35,0,0,0,0,0,0,0,1,35,0,37905]
[null,"GUANAJUATO","COOD541119637","COOD541119MGTNRL00","DULCE MARIA ELIZABETH CONTRERAS ORDUﾑA",1,0,0,0,0,0,0,7,35,0,0,0,0,0,0,0,1,35,0,37713]
[null,"GUANAJUATO","AOJM820726EC0","AOJM820726HGTRRR08","MARIO ARGOTE JUAREZ",1,0,0,0,0,0,0,7,35,0,0,0,0,0,0,0,1,35,0,27798]
[null,"GUANAJUATO","PECC830605V49","PECC830605MNEXSN04","CINTHYA PEﾑALOZA CISNEROS",1,0,0,0,0,0,0,7,35,0,0,0,0,0,0,0,1,35,0,33105]
[null,"GUANAJUATO","GORA840728TD1","GORA840728MDFNMN07","ANA LAURA GONZALEZ RAMOS",1,0,0,0,0,0,0,7,35,0,0,0,0,0,0,0,1,35,0,28224]
[null,"GUANAJUATO","SEER810904RN6","SEER810904HGTRSF07","RAFAEL SERRATO ESPINOSA",1,0,0,0,0,0,0,7,35,0,0,0,0,0,0,0,1,35,0,33788]
[null,"GUANAJUATO","VARL750211VB2","VARL750211MGTRMR07","MARIA LOURDES VARGAS RAMIREZ",1,0,0,0,0,0,0,7,35,0,0,0,0,0,0,0,1,35,0,35409]
[null,"GUANAJUATO","VARA71012288A","VARA710122MGTRMN01","MARIA DE LOS ANGELES VARGAS RAMIREZ",1,0,0,0,0,0,0,7,35,0,0,0,0,0,0,0,1,35,0,41064]
[null,"GUANAJUATO","MOCK900306NE6","MOCK900306MDFRSR15","KAREN ANEL MORENO CASTILLO",1,0,0,0,0,0,0,7,35,0,0,0,0,0,0,0,1,35,0,35205]
[null,"GUANAJUATO","PAGT5911092P8","PAGT591109HGTLRD01","TEODORO PALMERIN GARCIA",1,0,0,0,0,0,0,7,35,0,0,0,0,0,0,0,1,35,0,42555]
[null,"GUANAJUATO","GACC7402201D0","GACC740220MVZRYL09","CLAUDIA GARCIA CAYETANO",1,0,0,0,0,0,0,7,35,0,0,0,0,0,0,0,1,35,0,34542]
[null,"GUANAJUATO","GURR6007275B3","GURR600727HSPLMD06","RODOLFO GUEL RAMIREZ",1,0,0,0,0,0,0,7,35,0,0,0,0,0,0,0,1,35,0,40470]
[null,"GUANAJUATO","CAAB610110HC5","CAAB610110MGTRRR07","BERTHA ANGELICA CARPIO ARAGON",1,0,0,0,0,0,0,7,35,0,0,0,0,0,0,0,1,35,0,18231]
[null,"GUANAJUATO","BAGJ5610276T2","BAGC561027HGTLLR02","J. CARMEN BALDERAS GALLEGOS",1,0,0,0,0,0,0,7,35,0,0,0,0,0,0,0,1,35,0,37026]
[null,"GUANAJUATO","CAPJ840105CE0","CAPJ840105HGTMRL00","JULIO CESAR CAMACHO PRADO",1,0,0,0,0,0,0,7,35,0,0,0,0,0,0,0,1,35,0,32262]
[null,"GUANAJUATO","EIRJ6812089I5","EIRC681208HGTNMR05","J. CARLOS ENRIQUEZ RAMIREZ",1,0,0,0,0,0,0,7,35,0,0,0,0,0,0,0,1,35,0,41244]
[null,"GUANAJUATO","LAMZ780504N49","LAMZ780504MSLRNN01","ZINTIA DENISE LARA MENDIVIL",1,0,0,0,0,0,0,7,35,0,0,0,0,0,0,0,1,35,0,30833]
[null,"GUANAJUATO","GUMC6804029G4","GUMC680402MGTZNR09","MARIA DEL CARMEN GUZMAN MANZANILLA",1,0,0,0,0,0,0,7,35,0,0,0,0,0,0,0,1,35,0,41046]
[null,"GUANAJUATO","SAME750520NR8","SAME750520MGTNJR05","ERIKA SANCHEZ MEJIA",1,0,0,0,0,0,0,7,35,0,0,0,0,0,0,0,1,35,0,34542]
[null,"GUANAJUATO","GUMA6701215Q1","GUMA670121MGTTRN09","ANA GUTIERREZ MORENO",1,0,0,0,0,0,0,7,35,0,0,0,0,0,0,0,1,35,0,61658]
[null,"GUANAJUATO","FOTL950830PQ2","FOTL950830MGTLRR02","LAURA JAZMIN FLORES TORRES",1,0,0,0,0,0,0,7,35,0,0,0,0,0,0,0,1,35,0,32262]
[null,"GUANAJUATO","MAGE550714NZ1","MAGE550714HGTRNS03","ESTEBAN MARTINEZ GONZALEZ",1,0,0,0,0,0,0,7,35,0,0,0,0,0,0,0,1,35,0,58050]
[null,"GUANAJUATO","NEGM641224M74","NEGM641224MGTGVR06","MARTINA NEGRETE GOVEA",1,0,0,0,0,0,0,7,35,0,0,0,0,0,0,0,1,35,0,34050]
[null,"GUANAJUATO","MARC601223340","MARC601223MGTRLC03","CECILIA MARTINEZ RUELAS",1,0,0,0,0,0,0,7,35,0,0,0,0,0,0,0,1,35,0,37026]
[null,"GUANAJUATO","PEDM7406101Q5","PEDM740610MDFRMR01","MARGARITA PERALTA DOMINGUEZ",1,0,0,0,0,0,0,7,35,0,0,0,0,0,0,0,1,35,0,38880]
[null,"GUANAJUATO","RACR700730AH9","RACR700730MGTZNB06","REBECA RAZO CANO",1,0,0,0,0,0,0,7,35,0,0,0,0,0,0,0,1,35,0,13290]
[null,"GUANAJUATO","COIM780815PDA","COIM780815HGTPRR02","MARIO ALBERTO COPADO IRINEO",1,0,0,0,0,0,0,7,35,0,0,0,0,0,0,0,1,35,0,32262]
[null,"GUANAJUATO","BACA640430UIA","BACA640430HGTLRN06","ANTONIO BALTAZAR CORTES",1,0,0,0,0,0,0,7,35,0,0,0,0,0,0,0,1,35,0,40866]
[null,"GUANAJUATO","LERM7308264B5","LERM730826MGTDSN09","MONICA LEDESMA ROSALES",1,0,0,0,0,0,0,7,35,0,0,0,0,0,0,0,1,35,0,39078]
[null,"GUANAJUATO","GOGR650725KF1","GOGR650725HGTNRB02","ROBERTO GONZALEZ GARCIA",1,0,0,0,0,0,0,7,35,0,0,0,0,0,0,0,1,35,0,42456]
[null,"GUANAJUATO","DOVR6304095Y7","DOVR630409MBCMZS05","MARIA DEL ROSARIO DOMINGUEZ VAZQUEZ",1,0,0,0,0,0,0,7,35,0,0,0,0,0,0,0,1,35,0,39078]
[null,"GUANAJUATO","FICJ7603185H9","FICT760318HGTRSR03","J. TRINIDAD FRIAS CASTAﾑEDA",1,0,0,0,0,0,0,7,35,0,0,0,0,0,0,0,1,35,0,40110]
[null,"GUANAJUATO","VIGO710314HSA","VIGO710314HGTLNS05","OSCAR JACOBO VILLICAﾑA GONZALEZ",1,0,0,0,0,0,0,7,35,0,0,0,0,0,0,0,1,35,0,36528]
[null,"GUANAJUATO","MUHD640208LB9","MUHD640208MDFXRL08","MARIA DOLORES MUﾑOZ HERRERA",1,0,0,0,0,0,0,7,35,0,0,0,0,0,0,0,1,35,0,40272]
[null,"GUANAJUATO","RORC700828A28","RORC700828MGTMML06","CLAUDIA IMELDA ROMERO RAMOS",1,0,0,0,0,0,0,7,35,0,0,0,0,0,0,0,1,35,0,39078]
[null,"GUANAJUATO","AAGH700108U53","AAGH700108MGTLRR09","HORTENCIA ALMANZA GARCIA",1,0,0,0,0,0,0,7,35,0,0,0,0,0,0,0,1,35,0,46672]
[null,"GUANAJUATO","COMM660914G87","COMR660914MGTNDC09","MA. DEL ROCIO CONCHA MEDINA",1,0,0,0,0,0,0,7,35,0,0,0,0,0,0,0,1,35,0,36262]
[null,"GUANAJUATO","GOSL721116725","GOSL721116HGTRSS06","LUIS JAVIER GORDILLO SOSA",1,0,0,0,0,0,0,7,35,0,0,0,0,0,0,0,1,35,0,41707]
[null,"GUANAJUATO","VEPE671201NI6","VEPE671201MGTGRG04","MARIA EUGENIA VEGA PAREDES",1,0,0,0,0,0,0,7,35,0,0,0,0,0,0,0,1,35,0,39276]
[null,"GUANAJUATO","HEMM781102T78","HEMM781102MGTRNR07","MARISELA HERNANDEZ MONTOYA",1,0,0,0,0,0,0,7,35,0,0,0,0,0,0,0,1,35,0,39705]
[null,"GUANAJUATO","ROJJ671130GY1","ROJJ671130HGTDMS06","JOSE RODRIGUEZ JIMENEZ",1,0,0,0,0,0,0,7,35,0,0,0,0,0,0,0,1,35,0,39474]
[null,"GUANAJUATO","JUAA750702KJ9","JUAA750702HGTRRN04","JOSE ANDRES JUAREZ ARROYO",1,0,0,0,0,0,0,7,35,0,0,0,0,0,0,0,1,35,0,40272]
[null,"GUANAJUATO","COCB750608U65","COCB750608MGTRRL08","BLANCA RAQUEL CORONEL CARBAJAL",1,0,0,0,0,0,0,7,35,0,0,0,0,0,0,0,1,35,0,39456]
[null,"GUANAJUATO","GOGA680110DL7","GOGA680110MGTNYN00","ANA BERTHA GONZALEZ GAYTAN",1,0,0,0,0,0,0,7,35,0,0,0,0,0,0,0,1,35,0,61658]
[null,"GUANAJUATO","LAOJ8212131K9","LAOJ821213HGTRLS09","JESUS SAMUEL LARA OLMOS",1,0,0,0,0,0,0,7,35,0,0,0,0,0,0,0,1,35,0,34542]
[null,"GUANAJUATO","RARC7011229A3","RARC701122MGTNDR00","MA. CARLOTA PATRICIA RANGEL RODRIGUEZ",1,0,0,0,0,0,0,7,35,0,0,0,0,0,0,0,1,35,0,39672]
[null,"GUANAJUATO","ZAGB700228KX3","ZAGB700228MGTVMT03","BEATRIZ ZAVALA GOMEZ",1,0,0,0,0,0,0,7,35,0,0,0,0,0,0,0,1,35,0,39474]
[null,"GUANAJUATO","COOM721217SVA","COOM721217MGTNLN02","MA. MANUELA CONTRERAS OLMOS",1,0,0,0,0,0,0,7,35,0,0,0,0,0,0,0,1,35,0,40272]
[null,"GUANAJUATO","ROLA760606566","ROLA760606HGTJPN03","JOSE ANTONIO ROJAS LOPEZ",1,0,0,0,0,0,0,7,35,0,0,0,0,0,0,0,1,35,0,39540]
[null,"GUANAJUATO","MOGC720409SJ9","MOGC720409MGTJZL04","CLAUDIA ELISA MOJICA GUZMAN",1,0,0,0,0,0,0,7,35,0,0,0,0,0,0,0,1,35,0,37722]
[null,"GUANAJUATO","GOAS751103PH7","GOAS751103MGTNRL01","SILVIA SANTOS GONZALEZ ARANDA",1,0,0,0,0,0,0,7,35,0,0,0,0,0,0,0,1,35,0,38880]
[null,"GUANAJUATO","VARA570811AR0","VARA570811MVZLDN06","ANA YOLANDA VALERIO RODRIGUEZ",1,0,0,0,0,0,0,7,35,0,0,0,0,0,0,0,1,35,0,37755]
[null,"GUANAJUATO","ROSR7704116C6","ROSR770411MGTDLS01","MARIA DEL ROSARIO RODRIGUEZ SALGADO",1,0,0,0,0,0,0,7,35,0,0,0,0,0,0,0,1,35,0,46672]
[null,"GUANAJUATO","DOVL720318BXA","DOVL720318HGTMLS06","JOSE LUIS DOMINGUEZ VALDES",1,0,0,0,0,0,0,7,35,0,0,0,0,0,0,0,1,35,0,39672]
[null,"GUANAJUATO","SAMM750910419","SAMM750910MGTCRR00","MERCEDES ELENA SAUCEDO MORENO",1,0,0,0,0,0,0,7,35,0,0,0,0,0,0,0,1,35,0,39309]
[null,"GUANAJUATO","BEBL7508072M7","BEBL750807HQTRRS05","J. LUIS BERRA BORTOLINI",1,0,0,0,0,0,0,7,35,0,0,0,0,0,0,0,1,35,0,37128]
[null,"GUANAJUATO","ROPE881009G46","ROPE881009MGTDRV05","EVELIN GUADALUPE RODRIGUEZ PEREZ",1,0,0,0,0,0,0,7,35,0,0,0,0,0,0,0,1,35,0,32262]
[null,"GUANAJUATO","TOSH760727J54","TOSH760727HGTRNC04","HECTOR DANIEL TORRES SAENEZ",1,0,0,0,0,0,0,7,35,0,0,0,0,0,0,0,1,35,0,37128]
[null,"GUANAJUATO","RILM750601TH0","RILM750601MOCSSG04","MAGDALENA RIOS LUIS",1,0,0,0,0,0,0,7,35,0,0,0,0,0,0,0,1,35,0,32262]
[null,"GUANAJUATO","MENC680926QE2","MENC680926MGTDVR02","MARIA DEL CARMEN MEDEL NAVARRETE",1,0,0,0,0,0,0,7,35,0,0,0,0,0,0,0,1,35,0,40866]
[null,"GUANAJUATO","HELM710411Q56","HELM710411MGTRDR02","MARTHA ANGELICA HERNANDEZ LEDESMA",1,0,0,0,0,0,0,7,35,0,0,0,0,0,0,0,1,35,0,32442]
[null,"GUANAJUATO","GUHA770213FQ8","GUHA770213MGTVRL02","ALMA ROSA GUEVARA HERNANDEZ",1,0,0,0,0,0,0,7,35,0,0,0,0,0,0,0,1,35,0,46672]
[null,"GUANAJUATO","RALE870501NL5","RALE870501MGTMYL02","MARIA ELENA RAMOS LOYOLA",1,0,0,0,0,0,0,7,35,0,0,0,0,0,0,0,1,35,0,32262]
[null,"GUANAJUATO","FAHI7401088Z2","FAHI740108HGTBRV04","IVAN FABELA HERNANDEZ",1,0,0,0,0,0,0,7,35,0,0,0,0,0,0,0,1,35,0,40866]
[null,"GUANAJUATO","LUMR751129U75","LUMR751129HGTGTC02","RICARDO ERNESTO LUGO MATA",1,0,0,0,0,0,0,7,35,0,0,0,0,0,0,0,1,35,0,32502]
[null,"GUANAJUATO","RAMD681211IP3","RAMD681211HMCMRN05","DANIEL RAMIREZ MARTINEZ",1,0,0,0,0,0,0,7,35,0,0,0,0,0,0,0,1,35,0,41304]
[null,"GUANAJUATO","CAOC8910102C1","CAOC891010MGTSRR04","MARIA CRUZ CASTAﾑEDA ORNELAS",1,0,0,0,0,0,0,7,35,0,0,0,0,0,0,0,1,35,0,32262]
[null,"GUANAJUATO","ROSJ600516BL3","ROSJ600516MGTBNN05","JUANA ROBLES SANTANA",1,0,0,0,0,0,0,7,35,0,0,0,0,0,0,0,1,35,0,40305]
[null,"GUANAJUATO","EICS8311094H1","EICS831109MGTLNN06","SANDRA ELISA ELIAS CONTRERAS",1,0,0,0,0,0,0,7,35,0,0,0,0,0,0,0,1,35,0,32262]
[null,"GUANAJUATO","QULC671003EH8","QULC671003MDFRPL03","CLAUDIA REYNA QUIROZ LOPEZ",1,0,0,0,0,0,0,7,35,0,0,0,0,0,0,0,1,35,0,40238]
[null,"GUANAJUATO","IAJM900213S93","IAJM900213HGTBSR04","MARIO ALBERTO IBARRA JASSO",1,0,0,0,0,0,0,7,35,0,0,0,0,0,0,0,1,35,0,32262]
[null,"GUANAJUATO","RIRS751216TU4","RIRS751216MDFSMN07","SONIA RIOS RAMOS",1,0,0,0,0,0,0,7,35,0,0,0,0,0,0,0,1,35,0,37656]
[null,"GUANAJUATO","GUMM920308B42","GUMM920308MGTRJN03","MONICA JUANA GUERRERO MEJIA",1,0,0,0,0,0,0,7,35,0,0,0,0,0,0,0,1,35,0,32862]
[null,"GUANAJUATO","NEPR690831KW1","NEPR690831HGTGDM08","RAMON GUILLERMO NEGRETE PADRON",1,0,0,0,0,0,0,7,35,0,0,0,0,0,0,0,1,35,0,37656]
[null,"GUANAJUATO","HECG7108185E0","HECG710818HGTRBR07","GERARDO HERNANDEZ CABEZA",1,0,0,0,0,0,0,7,35,0,0,0,0,0,0,0,1,35,0,32262]
[null,"GUANAJUATO","ROPP680417AU8","ROPP680417MGTDRT05","PATRICIA RODRIGUEZ PEREZ",1,0,0,0,0,0,0,7,35,0,0,0,0,0,0,0,1,35,0,40102]
[null,"GUANAJUATO","AAGB8305061P7","AAGB830506MGTYTR02","BRENDA AYALA GUTIERREZ",1,0,0,0,0,0,0,7,35,0,0,0,0,0,0,0,1,35,0,32262]
[null,"GUANAJUATO","NAMS5306098W6","NAMS530609MGTRRL00","SILVIA LAURA NARVAEZ MORA",1,0,0,0,0,0,0,7,35,0,0,0,0,0,0,0,1,35,0,40068]
[null,"GUANAJUATO","JUEC8408019SA","JUEC840801MGTRSR08","MARIA DEL CARMEN IVONNE JUAREZ ESPITIA",1,0,0,0,0,0,0,7,35,0,0,0,0,0,0,0,1,35,0,32442]
[null,"GUANAJUATO","ZAMH6907077M4","ZAMH690707MGTVRR00","MARIA HERLINDA ZAVALA MARTINEZ",1,0,0,0,0,0,0,7,35,0,0,0,0,0,0,0,1,35,0,37524]
[null,"GUANAJUATO","GUMJ870317R44","GUMJ870317HGTRRN00","JONAS GUERRERO MARTINEZ",1,0,0,0,0,0,0,7,35,0,0,0,0,0,0,0,1,35,0,32262]
[null,"GUANAJUATO","RARC7301176A2","RARC730117MGTMVR07","MA. CARINA ALEJANDRA RAMIREZ RIVAS",1,0,0,0,0,0,0,7,35,0,0,0,0,0,0,0,1,35,0,37128]
[null,"GUANAJUATO","QUCL890311NE9","QUCL890311HGTNNS07","LUIS ALBERTO QUINTINO CINTORA",1,0,0,0,0,0,0,7,35,0,0,0,0,0,0,0,1,35,0,32262]
[null,"GUANAJUATO","LOLA751009LC7","LOLA751009MGTPNN06","MA. DE LOS ANGELES LOPEZ LUNA",1,0,0,0,0,0,0,7,35,0,0,0,0,0,0,0,1,35,0,40308]
[null,"GUANAJUATO","GORD8312168D4","GORD831216MGTMVL06","DULCE MARIA MONSERRAT GOMEZ RIVERA",1,0,0,0,0,0,0,7,35,0,0,0,0,0,0,0,1,35,0,32262]
[null,"GUANAJUATO","MELR640522PX9","MELR640522MGTNNT06","RITA MENDEZ LEON",1,0,0,0,0,0,0,7,35,0,0,0,0,0,0,0,1,35,0,40068]
[null,"GUANAJUATO","MABM7603207B6","MABM760320MGTCSR01","MARIANA MACHUCA BUSTAMANTE",1,0,0,0,0,0,0,7,35,0,0,0,0,0,0,0,1,35,0,32262]
[null,"GUANAJUATO","CAGR650930FB6","CAGR650930HGTLYB04","RUBEN CALDERON GAYTAN",1,0,0,0,0,0,0,7,35,0,0,0,0,0,0,0,1,35,0,40068]
[null,"GUANAJUATO","LOLB681130LWA","LOLB681130MGTPLT03","BEATRIZ LOPEZ LLANOS",1,0,0,0,0,0,0,7,35,0,0,0,0,0,0,0,1,35,0,37092]
[null,"GUANAJUATO","FOMO6906162N2","FOMO690616HGTNDS05","OSCAR FONSECA MEDRANO",1,0,0,0,0,0,0,7,35,0,0,0,0,0,0,0,1,35,0,40674]
[null,"GUANAJUATO","LOLG8002136P9","LOLG800213HGTPNS03","GUSTAVO LOPEZ LUNA",1,0,0,0,0,0,0,7,35,0,0,0,0,0,0,0,1,35,0,32262]
[null,"GUANAJUATO","CUSG780213V57","CUSG780213HGTRVL03","GUILIBALDO CRUZ SAAVEDRA",1,0,0,0,0,0,0,7,35,0,0,0,0,0,0,0,1,35,0,41842]
[null,"GUANAJUATO","NADP821016J68","NADP821016MGTVRL01","MARIA DEL PILAR NAVARRO DURAN",1,0,0,0,0,0,0,7,35,0,0,0,0,0,0,0,1,35,0,32262]
[null,"GUANAJUATO","AUTC7502082I3","AUTC750208MGTGRN15","MA. CONSUELO AGUILAR TIRADO",1,0,0,0,0,0,0,7,35,0,0,0,0,0,0,0,1,35,0,39870]
[null,"GUANAJUATO","RORD790510T10","RORD790510MGTMML09","DULCE MARIA ROMERO RAMIREZ",1,0,0,0,0,0,0,7,35,0,0,0,0,0,0,0,1,35,0,32262]
[null,"GUANAJUATO","MASV810101DZ8","MASV810101MGTRRR01","VERONICA MARTINEZ SARABIA",1,0,0,0,0,0,0,7,35,0,0,0,0,0,0,0,1,35,0,40068]
[null,"GUANAJUATO","GORE840602N47","GORE840602HGTNDM00","EMMANUEL GONZALEZ RODRIGUEZ",1,0,0,0,0,0,0,7,35,0,0,0,0,0,0,0,1,35,0,37089]
[null,"GUANAJUATO","AELM6906275A6","AELR690627MGTRPS15","MA ROSARIO ARREGUIN LOPEZ",1,0,0,0,0,0,0,7,35,0,0,0,0,0,0,0,1,35,0,40068]
[null,"GUANAJUATO","FEGR710424QJ8","FEXG710424MGTRXR09","GRACIELA FERRER ",1,0,0,0,0,0,0,7,35,0,0,0,0,0,0,0,1,35,0,32362]
[null,"GUANAJUATO","METC6212134V3","METC621213HGTRPS06","CESAR MARTIN MERINO TAPIA",1,0,0,0,0,0,0,7,35,0,0,0,0,0,0,0,1,35,0,40068]
[null,"GUANAJUATO","FOMJ7811187W8","FOMJ781118HGTLDN07","JUAN PABLO FLORES MEDINA",1,0,0,0,0,0,0,7,35,0,0,0,0,0,0,0,1,35,0,38082]
[null,"GUANAJUATO","RAAG660220BC0","RAAG660220MGTMVD07","MA. GUADALUPE RUTH RAMOS AVILA",1,0,0,0,0,0,0,7,35,0,0,0,0,0,0,0,1,35,0,46672]
[null,"GUANAJUATO","RAML6801057F2","RAML680105MMNMCN00","LINDA RAMIREZ MACEDO",1,0,0,0,0,0,0,7,35,0,0,0,0,0,0,0,1,35,0,37884]
[null,"GUANAJUATO","NEAC740715LD9","NEAC740715HGTGRR02","CRISTOBAL NEGRETE ARIAS",1,0,0,0,0,0,0,7,35,0,0,0,0,0,0,0,1,35,0,41040]
[null,"GUANAJUATO","VIPI821117493","VIPI821117MGTLLR07","IRMA VILLELA PALOMO",1,0,0,0,0,0,0,7,35,0,0,0,0,0,0,0,1,35,0,10754]
[null,"GUANAJUATO","OOPM650124AG1","OOPM650124HGTRRG05","MIGUEL OROZCO PEREZ",1,0,0,0,0,0,0,7,35,0,0,0,0,0,0,0,1,35,0,42060]
[null,"GUANAJUATO","TESR910120NP3","TESR910120MGTRLS09","MARIA DEL ROSARIO TERAN SALAZAR",1,0,0,0,0,0,0,7,35,0,0,0,0,0,0,0,1,35,0,10754]
[null,"GUANAJUATO","GAML720417UE8","GAML720417HGTRRS07","LUIS ALBERTO GARCIA MARTINEZ",1,0,0,0,0,0,0,7,35,0,0,0,0,0,0,0,1,35,0,39870]
[null,"GUANAJUATO","OEAJ730613983","OEAJ730613HDFBGN02","JUAN CARLOS OBREGON AGUINACO",1,0,0,0,0,0,0,7,35,0,0,0,0,0,0,0,1,35,0,10754]
[null,"GUANAJUATO","FOQP690616QU0","FOQP690616MGTLVT01","PETRA FLORES QUEVEDO",1,0,0,0,0,0,0,7,35,0,0,0,0,0,0,0,1,35,0,41756]
[null,"GUANAJUATO","PIEA861225MB2","PIEA861225MGTCSL06","ALMA ROSA PICHARDO ESTRADA",1,0,0,0,0,0,0,7,35,0,0,0,0,0,0,0,1,35,0,10754]
[null,"GUANAJUATO","VIMG771213D20","VIMG771213MGTLNB08","GABRIELA VILLANUEVA MENDOZA",1,0,0,0,0,0,0,7,35,0,0,0,0,0,0,0,1,35,0,37736]
[null,"GUANAJUATO","VALF830903IU4","VALF830903HGTLNR07","FRANCISCO JAVIER VALDEZ LANDIN",1,0,0,0,0,0,0,7,35,0,0,0,0,0,0,0,1,35,0,32988]
[null,"GUANAJUATO","VAQG581212JV2","VAQG581212HGTLJD08","J. GUADALUPE VALENCIA QUIJAS",1,0,0,0,0,0,0,7,35,0,0,0,0,0,0,0,1,35,0,39312]
[null,"GUANAJUATO","MALA730704I26","MALA730704HGTRPR02","ARNULFO MARQUEZ LOPEZ",1,0,0,0,0,0,0,7,35,0,0,0,0,0,0,0,1,35,0,37884]
[null,"GUANAJUATO","MAGM6404092N1","MAGM640409MGTNNR08","MARTA MANDUJANO GONZALEZ",1,0,0,0,0,0,0,7,35,0,0,0,0,0,0,0,1,35,0,61658]
[null,"GUANAJUATO","OEMJ730208CX6","OEMM730208HGTJDR00","J. MERCED OJEDA MEDINA",1,0,0,0,0,0,0,7,35,0,0,0,0,0,0,0,1,35,0,37884]
[null,"GUANAJUATO","VINF7009219V8","VINF700921HGTLXR06","FRANCISCO ALFONSO VILCHES NUﾑEZ",1,0,0,0,0,0,0,7,35,0,0,0,0,0,0,0,1,35,0,41658]
[null,"GUANAJUATO","AEAJ851118LC0","AEAJ851118HGTRCN00","JUAN CARLOS ARMENTA ACEVEDO",1,0,0,0,0,0,0,7,35,0,0,0,0,0,0,0,1,35,0,37884]
[null,"GUANAJUATO","GUSS6608135L6","GUSS660813MGTRNF04","SOFIA GUERRERO SANDOVAL",1,0,0,0,0,0,0,7,35,0,0,0,0,0,0,0,1,35,0,39312]
[null,"GUANAJUATO","MOSR650129V62","MOSR650129MGTRNF09","MA. DEL REFUGIO MORONES SANCHEZ",1,0,0,0,0,0,0,7,35,0,0,0,0,0,0,0,1,35,0,37884]
[null,"GUANAJUATO","COPG660114BC1","COPG660114HGTNLR03","GERARDO LUIS CONTRERAS PALACIOS",1,0,0,0,0,0,0,7,35,0,0,0,0,0,0,0,1,35,0,42258]
[null,"GUANAJUATO","HERG640304LK9","HERG640304MGTRDR09","GRACIELA HERNANDEZ RODRIGUEZ",1,0,0,0,0,0,0,7,35,0,0,0,0,0,0,0,1,35,0,32262]
[null,"GUANAJUATO","TOAN630405S63","TOXA630405HGTLXN01","JOSE ANTONIO TOLENTINO ",1,0,0,0,0,0,0,7,35,0,0,0,0,0,0,0,1,35,0,39708]
[null,"GUANAJUATO","BABM6804276E6","BABM680427MMCXLR01","MARGARITA BAﾑOS BAILON",1,0,0,0,0,0,0,7,35,0,0,0,0,0,0,0,1,35,0,38682]
[null,"GUANAJUATO","HEPC690801P80","HEPC690801MGTRRR08","MA. DEL CARMEN HERNANDEZ PEREZ",1,0,0,0,0,0,0,7,35,0,0,0,0,0,0,0,1,35,0,41704]
[null,"GUANAJUATO","CIVM630826EF1","CIVR630826MGTSRS09","MA. DEL ROSARIO CISNEROS VERDIN",1,0,0,0,0,0,0,7,35,0,0,0,0,0,0,0,1,35,0,35538]
[null,"GUANAJUATO","CACF6710055H4","CACF671005HGTLDR06","FRANCISCO CALDERON CAUDILLO",1,0,0,0,0,0,0,7,35,0,0,0,0,0,0,0,1,35,0,41295]
[null,"GUANAJUATO","CABF530212GK8","CABF530212HGTNRR05","FRANCISCO JAVIER CANO BARRON",1,0,0,0,0,0,0,7,35,0,0,0,0,0,0,0,1,35,0,38319]
[null,"GUANAJUATO","MEVG630915G81","MEVG630915MGTRRD08","MA. GUADALUPE MERCADO VARELA",1,0,0,0,0,0,0,7,35,0,0,0,0,0,0,0,1,35,0,38916]
[null,"GUANAJUATO","PELL620125LZ0","PELL620125MVZRLR03","MARIA DE LOURDES PEREZ LLANOS",1,0,0,0,0,0,0,7,35,0,0,0,0,0,0,0,1,35,0,38082]
[null,"GUANAJUATO","DUVE540209Q63","DUVE540209HGTRLR06","ERNESTO DURAN VALDIVIA",1,0,0,0,0,0,0,7,35,0,0,0,0,0,0,0,1,35,0,43050]
[null,"GUANAJUATO","LAGG8705075P8","LAGG870507MGTGRS08","GISELA LAGUNA GUERRERO",1,0,0,0,0,0,0,7,35,0,0,0,0,0,0,0,1,35,0,32262]
[null,"GUANAJUATO","AURA5705038S9","AURA570503HGTGND03","JOSE ADOLFO AGUILERA RENDON",1,0,0,0,0,0,0,7,35,0,0,0,0,0,0,0,1,35,0,43050]
[null,"GUANAJUATO","SOBF761123PU9","SOBF761123HGTLRR07","FRANCISCO SOLORZANO BERNAL",1,0,0,0,0,0,0,7,35,0,0,0,0,0,0,0,1,35,0,32262]
[null,"GUANAJUATO","VAGL591217DU7","VAGL591217MGTRRL06","LILIA VARGAS GARCIDUEﾑAS",1,0,0,0,0,0,0,7,35,0,0,0,0,0,0,0,1,35,0,43050]
[null,"GUANAJUATO","VILR670220CZ3","VILR670220MGTLNM04","RAMONA VILLANUEVA LUNA",1,0,0,0,0,0,0,7,35,0,0,0,0,0,0,0,1,35,0,42852]
[null,"GUANAJUATO","LURF6001292T1","LURF600129HGTNMR01","FRANCISCO JAVIER LUNA RAMIREZ",1,0,0,0,0,0,0,7,35,0,0,0,0,0,0,0,1,35,0,42654]
[null,"GUANAJUATO","REPC540808QI9","REPC540808MGTNRN06","MARIA CONCEPCION RENTERIA PEREZ",1,0,0,0,0,0,0,7,35,0,0,0,0,0,0,0,1,35,0,45117]
[null,"GUANAJUATO","BIRL710430QF2","BIRL710430HGTRZB03","LIBRADO BRICEﾑO RUIZ",1,0,0,0,0,0,0,7,35,0,0,0,0,0,0,0,1,35,0,41064]
[null,"GUANAJUATO","LUOE610116R96","LUOE610116HDGNLM05","EMILIO LUNA OLAGUE",1,0,0,0,0,0,0,7,35,0,0,0,0,0,0,0,1,35,0,42654]
[null,"GUANAJUATO","RATR611023E56","RATR611023MGTMRS03","ROSA MAGDALENA RAMIREZ TRONCOSO",1,0,0,0,0,0,0,7,35,0,0,0,0,0,0,0,1,35,0,43050]
[null,"GUANAJUATO","PEEM590530399","PEEM590530HDFRSN06","MANUEL ANGEL PEREZ ESCAMILLA",1,0,0,0,0,0,0,7,35,0,0,0,0,0,0,0,1,35,0,42060]
[null,"GUANAJUATO","BAVG670930HU0","BAVG670930MGTRZD05","MA. GUADALUPE BARCENAS VAZQUEZ",1,0,0,0,0,0,0,7,35,0,0,0,0,0,0,0,1,35,0,57654]
[null,"GUANAJUATO","JUON6804281K2","JUON680428HGTRRX00","NOE JUAREZ ORTEGA",1,0,0,0,0,0,0,7,35,0,0,0,0,0,0,0,1,35,0,42456]
[null,"GUANAJUATO","AERS660208UT4","AERS660208HGTRYR01","SERGIO ARREDONDO RAYA",1,0,0,0,0,0,0,7,35,0,0,0,0,0,0,0,1,35,0,40668]
[null,"GUANAJUATO","YEPV780203IU0","YEPV780203MGTBVR00","VERONICA ADRIANA YEBRA PAVON",1,0,0,0,0,0,0,7,35,0,0,0,0,0,0,0,1,35,0,53668]
[null,"GUANAJUATO","GAMJ711118AJ8","GAMJ711118HGTRCC07","JACOBO GARCIA MICHACA",1,0,0,0,0,0,0,7,35,0,0,0,0,0,0,0,1,35,0,40866]
[null,"GUANAJUATO","CARJ550620A19","CARJ550620HGTSDM09","JAIME CASTILLO RODRIGUEZ",1,0,0,0,0,0,0,7,35,0,0,0,0,0,0,0,1,35,0,39606]
[null,"GUANAJUATO","CATE6508044X6","CATE650804MGTRRS04","ESPERANZA CARRILLO TORRES",1,0,0,0,0,0,0,7,35,0,0,0,0,0,0,0,1,35,0,39606]
[null,"GUANAJUATO","PAQF701109SJ2","PAQF701109HGTRNL00","FILEMON PAREDON QUINTERO",1,0,0,0,0,0,0,7,35,0,0,0,0,0,0,0,1,35,0,40611]
[null,"GUANAJUATO","CAVJ620328P75","CAVG620328HGTHRD03","J. GUADALUPE CHAVEZ VARGAZ",1,0,0,0,0,0,0,7,35,0,0,0,0,0,0,0,1,35,0,42423]
[null,"GUANAJUATO","GOGL670809V8A","GOGL670809HGTNRS00","LUIS ALBERTO GONZALEZ GARCIA",1,0,0,0,0,0,0,7,35,0,0,0,0,0,0,0,1,35,0,61060]
[null,"GUANAJUATO","CAEJ651225BV9","CAEJ651225HVZHSS03","JESUS CHAGALA ESPEJO",1,0,0,0,0,0,0,7,35,0,0,0,0,0,0,0,1,35,0,37722]
[null,"GUANAJUATO","RICR7705149U3","RICR770514HGTVRB05","ROBERTO CARLOS RIVERA CORONILLA",1,0,0,0,0,0,0,7,35,0,0,0,0,0,0,0,1,35,0,40512]
[null,"GUANAJUATO","BEMS700226KJ6","BEMS700226HGTCNL00","SALVADOR BECERRA MANDUJANO",1,0,0,0,0,0,0,7,35,0,0,0,0,0,0,0,1,35,0,40272]
[null,"GUANAJUATO","GOOG7802057F2","GOOG780205HGTNRD04","JOSE GUADALUPE GONZALEZ ORTEGA",1,0,0,0,0,0,0,7,35,0,0,0,0,0,0,0,1,35,0,32262]
[null,"GUANAJUATO","CAGJ791209EN4","CAGJ791209HGTRTR01","JORGE ADRIAN CARDENAS GUTIERREZ",1,0,0,0,0,0,0,7,35,0,0,0,0,0,0,0,1,35,0,32262]
[null,"GUANAJUATO","ROVK831026QX5","ROVK831026MGTSZR01","MARIA KARINA ROSAS VAZQUEZ",1,0,0,0,0,0,0,7,35,0,0,0,0,0,0,0,1,35,0,32262]
[null,"GUANAJUATO","VERT861015NB6","VERT861015MGTRMR01","TERESA VERDE RAMIREZ",1,0,0,0,0,0,0,7,35,0,0,0,0,0,0,0,1,35,0,32442]
[null,"GUANAJUATO","OIAH870824AG4","OIAH870824HGTVLG02","HUGO ADRIAN OVIEDO ALVARADO",1,0,0,0,0,0,0,7,35,0,0,0,0,0,0,0,1,35,0,26885]
[null,"GUANAJUATO","RAJR920212P12","RAJR920212HGTMRB07","ROBERTO RAMIREZ JUAREZ",1,0,0,0,0,0,0,7,35,0,0,0,0,0,0,0,1,35,0,26885]
[null,"GUANAJUATO","PERK9310249I6","PERK931024MGTRCR03","KARLA FERNANDA PEREZ ROCHA",1,0,0,0,0,0,0,7,35,0,0,0,0,0,0,0,1,35,0,26885]
[null,"GUANAJUATO","LOHD930413C30","LOHD930413MGTPDN05","DIANA GUADALUPE LOPEZ HIDALGO",1,0,0,0,0,0,0,7,35,0,0,0,0,0,0,0,1,35,0,32262]
[null,"GUANAJUATO","COSL800716SL8","COSL800716MGTRRD08","LIDIA CAROLINA CORTES SIERRA",1,0,0,0,0,0,0,7,35,0,0,0,0,0,0,0,1,35,0,32262]
[null,"GUANAJUATO","MAFR721206U28","MAFR721206MGTRLC04","ROCIO ANEL MARTINEZ FLORES",1,0,0,0,0,0,0,7,35,0,0,0,0,0,0,0,1,35,0,32262]
[null,"GUANAJUATO","CASE871206B31","CASE871206HGTSND05","JOSE EDUARDO CASTAﾑEDA SAENZ",1,0,0,0,0,0,0,7,35,0,0,0,0,0,0,0,1,35,0,32262]
[null,"GUANAJUATO","RERR850915EW0","RERR850915HGTGDY04","JOSE REYES REGALADO RODRIGUEZ",1,0,0,0,0,0,0,7,35,0,0,0,0,0,0,0,1,35,0,32262]
[null,"GUANAJUATO","GOAR790919E90","GOAR790919MGTNLS24","ROSA MARIA GONZALEZ ALEJOS",1,0,0,0,0,0,0,7,35,0,0,0,0,0,0,0,1,35,0,5377]
[null,"GUANAJUATO","TOFF601228BV5","TOFF601228HGTRGR04","FRANCISCO JAVIER TORRES FIGUEROA",1,0,0,0,0,0,0,7,35,0,0,0,0,0,0,0,1,35,0,32262]
[null,"GUANAJUATO","TOFM860110TE7","TOFM860110MGTRNR00","MARTHA EDITH TORRES FUENTES",1,0,0,0,0,0,0,7,35,0,0,0,0,0,0,0,1,35,0,31204]
[null,"GUANAJUATO","GAVR910621UJ2","GAVR910621HGTRLL01","RAUL ALEJANDRO GRANADOS VALLE",1,0,0,0,0,0,0,7,35,0,0,0,0,0,0,0,1,35,0,21508]
[null,"GUANAJUATO","VEVS760824QM4","VEVS760824MGTNLL09","SILVINA ELIZABETH VENEGAS VILLALOBOS",1,0,0,0,0,0,0,7,35,0,0,0,0,0,0,0,1,35,0,32262]
[null,"GUANAJUATO","MANL580917DN5","MANL580917HGTRXS04","JOSE LUIS MARTINEZ NUﾑEZ",1,0,0,0,0,0,0,7,35,0,0,0,0,0,0,0,1,35,0,32262]
[null,"GUANAJUATO","JAAA741109NM2","JAAA741109MGTSGL04","ALMA PATRICIA JASSO AGUILERA",1,0,0,0,0,0,0,7,35,0,0,0,0,0,0,0,1,35,0,32262]
[null,"GUANAJUATO","MOHC8308189E4","MOHC830818MGTRRL03","CLAUDIA GABRIELA MORENO HERNANDEZ",1,0,0,0,0,0,0,7,35,0,0,0,0,0,0,0,1,35,0,5377]
[null,"GUANAJUATO","FOLI910518MEA","FOLI910518HGTLPS09","ISRAEL FLORES LOPEZ",1,0,0,0,0,0,0,7,35,0,0,0,0,0,0,0,1,35,0,16131]
[null,"GUANAJUATO","REFE870611H65","REFE870611HGTYNL02","ELI JUAN RUBEN REYES FUENTES",1,0,0,0,0,0,0,7,35,0,0,0,0,0,0,0,1,35,0,31352]
[null,"GUANAJUATO","MACB900101238","MACB900101MGTRRR07","BRENDA ARACELI MARTINEZ CRUZ",1,0,0,0,0,0,0,7,35,0,0,0,0,0,0,0,1,35,0,21508]
[null,"GUANAJUATO","PAEB921210T37","PAEB921210HCHLNR04","BRIAN KEDWIN PALOMINO ENRIQUEZ",1,0,0,0,0,0,0,7,35,0,0,0,0,0,0,0,1,35,0,24750]
[null,"GUANAJUATO","GUNC8511262G5","GUNC851126HQRTVR08","CARLOS FELIPE GUTIERREZ NOVELO",1,0,0,0,0,0,0,7,35,0,0,0,0,0,0,0,1,35,0,26802]
[null,"GUANAJUATO","FOAP6704124J5","FOAP670412MGTLLT01","PATRICIA FLORES ALVAREZ",1,0,0,0,0,0,0,7,35,0,0,0,0,0,0,0,1,35,0,29700]
[null,"GUANAJUATO","MEMS601125CV5","MEMS601125HMNNLM04","SAMUEL MENDOZA MALDONADO",1,0,0,0,0,0,0,7,35,0,0,0,0,0,0,0,1,35,0,32262]
[null,"GUANAJUATO","CIRJ660404UI3","CIRJ660404HGTFMN03","JUAN SIMITRIO CIFUENTES RAMIREZ",1,0,0,0,0,0,0,7,35,0,0,0,0,0,0,0,1,35,0,31234]
[null,"GUANAJUATO","ROBC900904U49","ROBC900904MDFCZT03","CITLALLIN MARGARITA ROCHA BAEZA",1,0,0,0,0,0,0,7,35,0,0,0,0,0,0,0,1,35,0,42896]
[null,"GUANAJUATO","ROGA8911109P7","ROGA891110MMNJRN09","MARIA DE LOS ANGELES ROJAS GARCIA",1,0,0,0,0,0,0,7,35,0,0,0,0,0,0,0,1,35,0,34068]
[null,"GUANAJUATO","COJP700317TZ9","COJP700317HMNRMD06","PEDRO CORTES JIMENEZ",1,0,0,0,0,0,0,7,35,0,0,0,0,0,0,0,1,35,0,46860]
[null,"GUANAJUATO","OEGL8003134Z8","OEGL800313MGTRMR09","LAURA AMERICA ORTEGA GAMIﾑO",1,0,0,0,0,0,0,7,35,0,0,0,0,0,0,0,1,35,0,46860]
[null,"GUANAJUATO","HEEE731209HI1","HEEE731209MGTRSS09","ESMERALDA HERNANDEZ ESCOGIDO",1,0,0,0,0,0,0,7,35,0,0,0,0,0,0,0,1,35,0,47232]
[null,"GUANAJUATO","CALM860815G43","CALM860815MJCHNY02","MAYRA CAROLINA CHAVEZ DE LEﾓN",1,0,0,0,0,0,0,7,35,0,0,0,0,0,0,0,1,35,0,48852]
[null,"GUANAJUATO","RAGM9005156P3","RAGM900515MGTMJN01","MONICA SAMANTHA RAMOS GOUJON",1,0,0,0,0,0,0,7,35,0,0,0,0,0,0,0,1,35,0,34068]
[null,"GUANAJUATO","AEPB811216AUA","AEPB811216MGTRLL03","BLANCA BERENICE ARREGUIN PALMA",1,0,0,0,0,0,0,7,35,0,0,0,0,0,0,0,1,35,0,47160]
[null,"GUANAJUATO","GARM751031J11","GARM751031HGTRMS07","MOISES GRANADOS RAMOS",1,0,0,0,0,0,0,7,35,0,0,0,0,0,0,0,1,35,0,47382]
[null,"GUANAJUATO","HERG571023MS0","HERG571023MGTRPD07","MA. GUADALUPE JUDITH HERNANDEZ RIPALDA",1,0,0,0,0,0,0,7,35,0,0,0,0,0,0,0,1,35,0,47460]
[null,"GUANAJUATO","TONL701209CT8","TONL701209MGTRCR09","LAURA MA GUADALUPE TORRES NACHE",1,0,0,0,0,0,0,7,35,0,0,0,0,0,0,0,1,35,0,60447]
[null,"GUANAJUATO","HELJ920419M66","HELJ920419HQTRYS06","JOSE DE JESUS HERNANDEZ LOYOLA",1,0,0,0,0,0,0,0,0,0,0,0,0,0,0,0,1,40,0,52836]
[null,"GUANAJUATO","ROVR580704ND4","ROVR580704HVZXLB09","ROBERTO ROA VELAZQUEZ",1,0,0,0,0,0,0,0,0,0,0,0,0,0,0,0,1,40,0,68832]
[null,"GUANAJUATO","LUGL7801215UA","LUGL780121HGTNRS00","LUIS ALBERTO LUNA GUERRA",1,0,0,0,0,0,0,0,0,0,0,0,0,0,0,0,1,40,0,68154]
[null,"GUANAJUATO","CAVS681207JX2","CAVS681207HGTNRL04","SALVADOR CANO VARGAS",1,0,0,0,0,0,0,0,0,0,0,0,0,0,0,0,1,40,0,68754]
[null,"GUANAJUATO","HEMJ740921F99","HEMJ740921HGTRXND8","JUAN LORENZO HERNANDEZ MUﾑOZ",1,0,0,0,0,0,0,0,0,0,0,0,0,0,0,0,1,40,0,68154]
[null,"GUANAJUATO","MACE770912412","MACE770912HQTRHC07","ECTOR JAVIER MARTINEZ CHAVEZ",1,0,0,0,0,0,0,0,0,0,0,0,0,0,0,0,1,40,0,68681]
[null,"GUANAJUATO","POLH650106FW2","POLH650106HDFZPG03","HUGO POZADA LOPEZ",1,0,0,0,0,0,0,0,0,0,0,0,0,0,0,0,1,40,0,63048]
[null,"GUANAJUATO","BEGL8709056T2","BEGL870905HGTCRS09","LUIS ALFONSO BECERRA GARCIA",1,0,0,0,0,0,0,0,0,0,0,0,0,0,0,0,1,40,0,52836]
[null,"GUANAJUATO","LISA7512109V7","LISA751210MGTRLN04","ANA ISABEL LIRA SALDAﾑA",1,0,0,0,0,0,0,0,0,0,0,0,0,0,0,0,1,40,0,63048]
[null,"GUANAJUATO","AUGF640316LK3","AUGF640316HGTGRR05","FRANCISCO JAVIER AGUIRRE GUERRERO",1,0,0,0,0,0,0,0,0,0,0,0,0,0,0,0,1,40,0,68154]
[null,"GUANAJUATO","GUVJ850624HM6","GUVJ850624HGTZYN02","JUAN MIGUEL GUZMAN VIEYRA",1,0,0,0,0,0,0,0,0,0,0,0,0,0,0,0,1,40,0,45436]
[null,"GUANAJUATO","DITJ760122R33","DITJ760122HGTZRN01","JUAN GABRIEL DIAZ TORRES",1,0,0,0,0,0,0,0,0,0,0,0,0,0,0,0,1,40,0,45436]
[null,"GUANAJUATO","VECE760116MWA","VECE760116HCSLSD09","EDIES VELASCO CASANOVA",1,0,0,0,0,0,0,0,0,0,0,0,0,0,0,0,1,40,0,45436]
[null,"GUANAJUATO","SAPA740111LK4","SAPA740111HOCNCB03","ABDON SANDOVAL PACHECO",1,0,0,0,0,0,0,0,0,0,0,0,0,0,0,0,1,40,0,45436]
[null,"GUANAJUATO","PEJR701210KIA","PEJR701210HSLRRB08","RUBEN PEREZ JUAREZ",1,0,0,0,0,0,0,0,0,0,0,0,0,0,0,0,1,40,0,51640]
[null,"GUANAJUATO","NIJV910312FZ6","NIJV910312HDFTSC07","VICTOR DAVID NIETO JASSO",1,0,0,0,0,0,0,0,0,0,0,0,0,0,0,0,1,40,0,52836]
[null,"GUANAJUATO","EAOM860526KN2","EAOM860526HASSCR02","MARIANO ESPARZA OCHOA",1,0,0,0,0,0,0,0,0,0,0,0,0,0,0,0,1,40,0,77460]
[null,"GUANAJUATO","HOHL860601124","HOHL860601MGTRRZ09","LUZ ANGELICA HORTA HERNANDEZ",1,0,0,0,0,0,0,0,0,0,0,0,0,0,0,0,1,40,0,69252]
[null,"GUANAJUATO","REGJ781111QG6","REGJ781111HGTYRN09","JUAN MANUEL REYES GUERRERO",1,0,0,0,0,0,0,0,0,0,0,0,0,0,0,0,1,40,0,74658]
[null,"GUANAJUATO","HESJ680622CM5","HESJ680622HGTRLS06","JOSE DE JESUS HERNANDEZ SALAZAR",1,0,0,0,0,0,0,0,0,0,0,0,0,0,0,0,1,40,0,29230]
[null,"GUANAJUATO","JIAR5906097A6","JIAR590609HVZMNB07","ROBERTO JIMENEZ DEL ANGEL",1,0,0,0,0,0,0,0,0,0,0,0,0,0,0,0,1,40,0,205275]
[null,"Total Personas : ",337,null,null,null,null,null,null,null,null,null,null,null,null,null,null,null,null,null,null,"Total Recursos Ejercidos:",null,null,{"$f":"SUBTOTAL(109,Tabla11[Total de recursos presupuestales ejercidos en servicios personales en el periodo\n(2)])","v":12080792}]
[]
[null,"Fuente : Información proporcionada por las Entidades Federativas."]

{"sheet":"II C y 1_","index":5,"n_rows":358,"n_cols":22,"rows_kept":358,"cut":false,"hidden":false,"merged":[[352,18,352,19],[11,6,12,6],[11,7,12,7],[11,18,11,19],[11,3,12,3],[11,4,12,4],[8,1,8,8],[11,1,12,1],[11,2,12,2],[11,5,12,5],[11,20,12,20],[11,21,12,21],[11,8,12,8],[11,9,11,15],[11,16,12,16],[11,17,12,17]]}
[]
[]
[]
[]
[]
[]
[]
[null,"Formato: Personal Federalizado por Registro Federal de Contribuyentes"]
[null,{"$f":"IF('Caratula Resumen'!D22=\"Elige el Periodo…\",\"\",'Caratula Resumen'!D22)","v":"Fondo de Aportaciones para la Educación Tecnológica y de Adultos/Instituto Nacional para la Educación de los Adultos (FAETA/INEA)"},null,null,null,null,null,null,null,null,null,null,null,null,null,null,null,null,null,null,{"$f":"'A Y  II D3'!X10","v":"1er. Trimestre 2017"}]
[]
[]
[null,"Entidad Federativa","Clave CT","Turno","RFC","CURP","Nombre","Funcion Real","Horas que labora en el Centro de Trabajo","Clave Presupuestal",null,null,null,null,null,null,"Tipo de Categoría","Identificador de Contrato de Honorarios","Periodo de efecto de pago en el trimestre",null,"Percepciones pagadas en el Periodo de Comisión con Presupuesto Federal*","Percepciones pagadas en el Periodo de Comisión con Presupuesto de otra fuente*"]
[null,null,null,null,null,null,null,null,null,"Partida Presupuestal","Código de Pago","Clave de Unidad","Clave de Sub Unidad","Clave de Categoría","Horas Semana Mes ","Número de Plaza",null,null,"Inicial","Termino"]
[]
[null,"Entidad Federativa","Clave CT","Turno","RFC","CURP","Nombre","Funcion Real","Horas que labora en el Centro de Trabajo","Partida Presupuestal","Código de Pago","Clave de Unidad","Clave de Sub Unidad","Clave de Categoría","Horas semana mes","Número de plaza","Tipo de Categoría","Identificador de Contrato de Honorarios","Periodo de efecto de pago en el trimestre\nInicial","Periodo de efecto de pago en el trimestre\nTermino","Percepciones pagadas en el Periodo de Comisión con Presupuesto Federal*","Percepciones pagadas en el Periodo de Comisión con Presupuesto de otra fuente*"]
[null,"GUANAJUATO","11EBS0027E",100,"AAAL860804UN9","AAAL860804MTSBZD03","LUDIM ABRAHAM AZUARA","TECNICO MEDIO",35,83101,1,7,28,"T03803",0,184,2,null,null,null,26919,0]
[null,"GUANAJUATO","11EBS0027E",100,"AAGB8305061P7","AAGB830506MGTYTR02","BRENDA AYALA GUTIERREZ","TECNICO DOCENTE",35,83101,1,7,20,"T03820",0,62,2,null,null,null,32262,0]
[null,"GUANAJUATO","11EBS0027E",100,"AAGH700108U53","AAGH700108MGTLRR09","HORTENCIA ALMANZA GARCIA","TECNICO DOCENTE",35,83101,1,7,17,"T03820",0,1943,2,null,null,null,46672,0]
[null,"GUANAJUATO","11EBS0027E",100,"AEAJ851118LC0","AEAJ851118HGTRCN00","JUAN CARLOS ARMENTA ACEVEDO","TECNICO DOCENTE",35,83101,1,7,13,"T03820",0,1280,2,null,null,null,37884,0]
[null,"GUANAJUATO","11EBS0027E",100,"AELM6906275A6","AELR690627MGTRPS15","MA ROSARIO ARREGUIN LOPEZ","TECNICO DOCENTE",35,83101,1,7,25,"T03820",0,2195,2,null,null,null,40068,0]
[null,"GUANAJUATO","11EBS0027E",100,"AEPB811216AUA","AEPB811216MGTRLL03","BLANCA BERENICE ARREGUIN PALMA","COORD. DE SERVICIOS ESP.",35,83101,1,2,4,"CF33849",0,154,2,null,null,null,47160,0]
[null,"GUANAJUATO","11EBS0027E",100,"AERS660208UT4","AERS660208HGTRYR01","SERGIO ARREDONDO RAYA","TECNICO DOCENTE",35,83101,1,7,40,"T03820",0,2241,2,null,null,null,40668,0]
[null,"GUANAJUATO","11EBS0027E",100,"AILP690120TW9","AILP690120MSPRNT09","PATRICIA DE JESUS ARCIGA LEON","JEFE DE OFICINA",35,83101,1,7,29,"A01807",0,169,2,null,null,null,39389,0]
[null,"GUANAJUATO","11EBS0027E",100,"AIMF9209181C4","AIMF920918MJCVCL02","FLOR SOFIA AVILA MACIAS","ANALISTA ADMINISTRATIVO",35,83101,1,2,4,"A01806",0,153,2,null,null,null,22537,0]
[null,"GUANAJUATO","11EBS0027E",100,"AIML940210D95","AIML940210MGTRNZ09","LUZ PATRICIA ARVIZU MONTES","JEFE DE OFICINA",35,83101,1,7,30,"A01807",0,172,2,null,null,null,28224,0]
[null,"GUANAJUATO","11EBS0027E",100,"AIMM891226K29","AIMM891226MMCMXR03","MARIANA AMBRIZ MUÑOZ","TECNICO MEDIO",35,83101,1,7,13,"T03803",0,338,2,null,null,null,26328,0]
[null,"GUANAJUATO","11EBS0027E",100,"AOJM820726EC0","AOJM820726HGTRRR08","MARIO ARGOTE JUAREZ","JEFE DE OFICINA",35,83101,1,2,6,"A01807",0,168,2,null,null,null,27798,0]
[null,"GUANAJUATO","11EBS0027E",100,"AUGA6812277W5","AUGA681227MGTGRN03","ANA MARIA AGUILAR GARCIA","ANALISTA ADMINISTRATIVO",35,83101,1,7,19,"A01806",0,450,2,null,null,null,51192,0]
[null,"GUANAJUATO","11EBS0027E",100,"AUGF640316LK3","AUGF640316HGTGRR05","FRANCISCO JAVIER AGUIRRE GUERRERO","COORDINADOR DE ZONA",40,83101,1,7,16,"CF36014",0,522,5,null,null,null,68154,0]
[null,"GUANAJUATO","11EBS0027E",100,"AUNC890701HB6","AUNC890701MQTGXR05","MARIA CRISTINA AGUADO NUÑEZ","OFICIAL DE SERVICIOS Y MANTEN.",35,83101,1,7,30,"S01803",0,1241,2,null,null,null,26722,0]
[null,"GUANAJUATO","11EBS0027E",100,"AURA5705038S9","AURA570503HGTGND03","JOSE ADOLFO AGUILERA RENDON","TECNICO DOCENTE",35,83101,1,7,43,"T03820",0,362,2,null,null,null,43050,0]
[null,"GUANAJUATO","11EBS0027E",100,"AURM640517UH3","AURM640517HGTGCR01","MARTIN AGUIRRE RICO","ANALISTA ADMINISTRATIVO",35,83101,1,7,40,"A01806",0,117,2,null,null,null,34420,0]
[null,"GUANAJUATO","11EBS0027E",100,"AUTC7502082I3","AUTC750208MGTGRN15","MA. CONSUELO AGUILAR TIRADO","TECNICO DOCENTE",35,83101,1,7,16,"T03820",0,1623,2,null,null,null,39870,0]
[null,"GUANAJUATO","11EBS0027E",100,"AUVA8802214EA","AUVA880221MGTNLN08","ANGELICA ANGUIANO VILLAGRANA","ESPECIALISTA EN PROYECTOS TECNICOS",35,83101,1,3,10,"T03810",0,2682,2,null,null,null,26722,0]
[null,"GUANAJUATO","11EBS0027E",100,"BABM6804276E6","BABM680427MMCXLR01","MARGARITA BAÑOS BAILON","TECNICO DOCENTE",35,83101,1,7,13,"T03820",0,1101,2,null,null,null,38682,0]
[null,"GUANAJUATO","11EBS0027E",100,"BACA640430UIA","BACA640430HGTLRN06","ANTONIO BALTAZAR CORTES","TECNICO DOCENTE",35,83101,1,7,16,"T03820",0,1739,2,null,null,null,40866,0]
[null,"GUANAJUATO","11EBS0027E",100,"BAGJ5610276T2","BAGC561027HGTLLR02","J. CARMEN BALDERAS GALLEGOS","TECNICO DOCENTE",35,83101,1,7,19,"T03820",0,658,2,null,null,null,37026,0]
[null,"GUANAJUATO","11EBS0027E",100,"BARA6501175H5","BARA650117MGTRDN02","ANTONIA BARRERA RODRIGUEZ","JEFE DE OFICINA",35,83101,1,7,16,"A01807",0,231,2,null,null,null,37905,0]
[null,"GUANAJUATO","11EBS0027E",100,"BARA700515RH6","BARA700515MGTRML07","ALMA VELIA BARBOSA RAMIREZ","SECRETARIA \"C\"",35,83101,1,7,25,"A03804",0,97,2,null,null,null,41722,0]
[null,"GUANAJUATO","11EBS0027E",100,"BAVG670930HU0","BAVG670930MGTRZD05","MA. GUADALUPE BARCENAS VAZQUEZ","TECNICO DOCENTE",35,83101,1,7,14,"T03820",0,664,2,null,null,null,57654,0]
[null,"GUANAJUATO","11EBS0027E",100,"BEBL7508072M7","BEBL750807HQTRRS05","J. LUIS BERRA BORTOLINI","TECNICO DOCENTE",35,83101,1,7,28,"T03820",0,125,2,null,null,null,37128,0]
[null,"GUANAJUATO","11EBS0027E",100,"BEGL8709056T2","BEGL870905HGTCRS09","LUIS ALFONSO BECERRA GARCIA","COORDINADOR DE ZONA",40,83101,1,5,12,"CF36014",0,44,5,null,null,null,52836,0]
[null,"GUANAJUATO","11EBS0027E",100,"BEMS700226KJ6","BEMS700226HGTCNL00","SALVADOR BECERRA MANDUJANO","TECNICO DOCENTE",35,83101,1,7,13,"T03820",0,2892,2,null,null,null,40272,0]
[null,"GUANAJUATO","11EBS0027E",100,"BINL4906195XA","BINL490619HDFRGS05","JOSE LUIS BRIBIESCA NEGRETE","JEFE DE OFICINA",35,83101,1,7,42,"A01807",0,132,2,null,null,null,50808,0]
[null,"GUANAJUATO","11EBS0027E",100,"BIRL710430QF2","BIRL710430HGTRZB03","LIBRADO BRICEÑO RUIZ","TECNICO DOCENTE",35,83101,1,7,42,"T03820",0,1590,2,null,null,null,41064,0]
[null,"GUANAJUATO","11EBS0027E",100,"CAAB610110HC5","CAAB610110MGTRRR07","BERTHA ANGELICA CARPIO ARAGON","TECNICO DOCENTE",35,83101,1,7,13,"T03820",0,2463,2,null,null,null,18231,0]
[null,"GUANAJUATO","11EBS0027E",100,"CABF530212GK8","CABF530212HGTNRR05","FRANCISCO JAVIER CANO BARRON","TECNICO DOCENTE",35,83101,1,7,33,"T03820",0,686,2,null,null,null,38319,0]
[null,"GUANAJUATO","11EBS0027E",100,"CACF6710055H4","CACF671005HGTLDR06","FRANCISCO CALDERON CAUDILLO","TECNICO DOCENTE",35,83101,1,7,15,"T03820",0,1102,2,null,null,null,41295,0]
[null,"GUANAJUATO","11EBS0027E",100,"CACJ850212C85","CACJ850212HGTMMN05","JUAN MIGUEL CAMARILLO CAMARILLO","ADMINISTRATIVO ESPECIALIZADO",35,83101,1,7,27,"A01803",0,27,2,null,null,null,26919,0]
[null,"GUANAJUATO","11EBS0027E",100,"CACP630616HG8","CACP630616MGTLHT16","MA. PATRICIA DOLORES CALDERON CHAVEZ","TECNICO MEDIO",35,83101,1,7,14,"T03803",0,178,2,null,null,null,32466,0]
[null,"GUANAJUATO","11EBS0027E",100,"CADI801221FT5","CADI801221HGTRSS00","ISRAEL CARDENAS DIOSDADO","ESPECIALISTA EN PROYECTOS TECNICOS",35,83101,1,7,28,"T03810",0,3702,2,null,null,null,26919,0]
[null,"GUANAJUATO","11EBS0027E",100,"CAEJ651225BV9","CAEJ651225HVZHSS03","JESUS CHAGALA ESPEJO","TECNICO DOCENTE",35,83101,1,7,14,"T03820",0,2946,2,null,null,null,37722,0]
[null,"GUANAJUATO","11EBS0027E",100,"CAGJ791209EN4","CAGJ791209HGTRTR01","JORGE ADRIAN CARDENAS GUTIERREZ","TECNICO DOCENTE",35,83101,1,7,14,"T03820",0,2462,2,null,null,null,32262,0]
[null,"GUANAJUATO","11EBS0027E",100,"CAGK871023GK5","CAGK871023MGTDDR07","KARLA ESTEFANA CAUDILLO GODINEZ","ANALISTA ADMINISTRATIVO",35,83101,1,7,41,"A01806",0,116,2,null,null,null,27408,0]
[null,"GUANAJUATO","11EBS0027E",100,"CAGR650930FB6","CAGR650930HGTLYB04","RUBEN CALDERON GAYTAN","TECNICO DOCENTE",35,83101,1,7,25,"T03820",0,1269,2,null,null,null,40068,0]
[null,"GUANAJUATO","11EBS0027E",100,"CAGR690302HRA","CAGR690302MGTMMS03","MA. DEL ROSARIO CAMPOS GOMEZ","SECRETARIA \"C\"",35,83101,1,7,13,"A03804",0,300,2,null,null,null,34071,0]
[null,"GUANAJUATO","11EBS0027E",100,"CAGY820417182","CAGY820417MGTRTJ03","YAJAHIRA CARDENAS GUTIERREZ","TECNICO MEDIO",35,83101,1,7,24,"T03803",0,32,2,null,null,null,26919,0]
[null,"GUANAJUATO","11EBS0027E",100,"CAJU6804082V6","CAXJ680408MGTMXN08","JUANA MARIA CAMACHO ","JEFE DE OFICINA",35,83101,1,7,18,"A01807",0,2681,2,null,null,null,37713,0]
[null,"GUANAJUATO","11EBS0027E",100,"CALM860815G43","CALM860815MJCHNY02","MAYRA CAROLINA CHAVEZ DE LEÓN","COORD. DE SERVICIOS ESP.",35,83101,1,2,6,"CF33849",0,191,2,null,null,null,48852,0]
[null,"GUANAJUATO","11EBS0027E",100,"CAOC8910102C1","CAOC891010MGTSRR04","MARIA CRUZ CASTAÑEDA ORNELAS","TECNICO DOCENTE",35,83101,1,7,29,"T03820",0,367,2,null,null,null,32262,0]
[null,"GUANAJUATO","11EBS0027E",100,"CAPA8005264B4","CAPA800526MGTMRN08","ANA RUTH CAMACHO PRADO","ANALISTA ADMINISTRATIVO",35,83101,1,2,4,"A01806",0,252,2,null,null,null,22335,0]
[null,"GUANAJUATO","11EBS0027E",100,"CAPJ840105CE0","CAPJ840105HGTMRL00","JULIO CESAR CAMACHO PRADO","TECNICO DOCENTE",35,83101,1,7,13,"T03820",0,1116,2,null,null,null,32262,0]
[null,"GUANAJUATO","11EBS0027E",100,"CARA730215VE3","CARA730215MGTHJL00","ALMA DELIA CHAVEZ ROJAS","TECNICO MEDIO",35,83101,1,7,24,"T03803",0,7,2,null,null,null,33333,0]
[null,"GUANAJUATO","11EBS0027E",100,"CARJ550620A19","CARJ550620HGTSDM09","JAIME CASTILLO RODRIGUEZ","TECNICO DOCENTE",35,83101,1,7,17,"T03820",0,794,2,null,null,null,39606,0]
[null,"GUANAJUATO","11EBS0027E",100,"CASE871206B31","CASE871206HGTSND05","JOSE EDUARDO CASTAÑEDA SAENZ","TECNICO DOCENTE",35,83101,1,7,40,"T03820",0,2887,2,null,null,null,32262,0]
[null,"GUANAJUATO","11EBS0027E",100,"CASR640104TEA","CASR640104MGTBNS05","ROSA MARIA CABRERA SANCHEZ","ESPECIALISTA EN PROYECTOS TECNICOS",35,83101,1,7,24,"T03810",0,2212,2,null,null,null,31353,0]
[null,"GUANAJUATO","11EBS0027E",100,"CATE6508044X6","CATE650804MGTRRS04","ESPERANZA CARRILLO TORRES","TECNICO DOCENTE",35,83101,1,7,16,"T03820",0,622,2,null,null,null,39606,0]
[null,"GUANAJUATO","11EBS0027E",100,"CAVA651011TB7","CAVA651011HGTLRL04","JOSE ALFREDO CALDERON VARELA","TECNICO MEDIO",35,83101,1,7,15,"T03803",0,20,2,null,null,null,35116,0]
[null,"GUANAJUATO","11EBS0027E",100,"CAVJ620328P75","CAVG620328HGTHRD03","J. GUADALUPE CHAVEZ VARGAZ","TECNICO DOCENTE",35,83101,1,7,15,"T03820",0,2591,2,null,null,null,42423,0]
[null,"GUANAJUATO","11EBS0027E",100,"CAVS681207JX2","CAVS681207HGTNRL04","SALVADOR CANO VARGAS","COORDINADOR DE ZONA",40,83101,1,7,17,"CF36014",0,45,5,null,null,null,68754,0]
[null,"GUANAJUATO","11EBS0027E",100,"CIRJ660404UI3","CIRJ660404HGTFMN03","JUAN SIMITRIO CIFUENTES RAMIREZ","COORD. DE SERVICIOS ESP.",35,83101,1,9,51,"CF33849",0,193,2,null,null,null,31234,0]
[null,"GUANAJUATO","11EBS0027E",100,"CIVM630826EF1","CIVR630826MGTSRS09","MA. DEL ROSARIO CISNEROS VERDIN","TECNICO DOCENTE",35,83101,1,7,13,"T03820",0,1959,2,null,null,null,35538,0]
[null,"GUANAJUATO","11EBS0027E",100,"COBA780319BUA","COBA780319HGTRTN00","JOSE ANTONIO CORDOBA BAUTISTA","ESPECIALISTA EN PROYECTOS TECNICOS",35,83101,1,7,16,"T03810",0,3572,2,null,null,null,27099,0]
[null,"GUANAJUATO","11EBS0027E",100,"COCB750608U65","COCB750608MGTRRL08","BLANCA RAQUEL CORONEL CARBAJAL","TECNICO DOCENTE",35,83101,1,7,15,"T03820",0,1867,2,null,null,null,39456,0]
[null,"GUANAJUATO","11EBS0027E",100,"COIM780815PDA","COIM780815HGTPRR02","MARIO ALBERTO COPADO IRINEO","TECNICO DOCENTE",35,83101,1,7,28,"T03820",0,176,2,null,null,null,32262,0]
[null,"GUANAJUATO","11EBS0027E",100,"COJP700317TZ9","COJP700317HMNRMD06","PEDRO CORTES JIMENEZ","COORD. DE SERVICIOS ESP.",35,83101,1,2,4,"CF33849",0,411,2,null,null,null,46860,0]
[null,"GUANAJUATO","11EBS0027E",100,"COMM660914G87","COMR660914MGTNDC09","MA. DEL ROCIO CONCHA MEDINA","TECNICO DOCENTE",35,83101,1,7,13,"T03820",0,151,2,null,null,null,36262,0]
[null,"GUANAJUATO","11EBS0027E",100,"COOD541119637","COOD541119MGTNRL00","DULCE MARIA ELIZABETH CONTRERAS ORDUÑA","JEFE DE OFICINA",35,83101,1,7,28,"A01807",0,578,2,null,null,null,37713,0]
[null,"GUANAJUATO","11EBS0027E",100,"COOM721217SVA","COOM721217MGTNLN02","MA. MANUELA CONTRERAS OLMOS","TECNICO DOCENTE",35,83101,1,7,41,"T03820",0,207,2,null,null,null,40272,0]
[null,"GUANAJUATO","11EBS0027E",100,"COOS660919CRA","COOS660919MGTNLS08","SUSANA ISABEL CONTRERAS OLMOS","TECNICO MEDIO",35,83101,1,7,41,"T03803",0,1631,2,null,null,null,40538,0]
[null,"GUANAJUATO","11EBS0027E",100,"COPC760616J13","COPC760616HGTRTR05","CARLOS ALBERTO CORDOBA PATIÑO","OFICIAL DE SERVICIOS Y MANTEN.",35,83101,1,7,14,"S01803",0,117,2,null,null,null,31710,0]
[null,"GUANAJUATO","11EBS0027E",100,"COPG660114BC1","COPG660114HGTNLR03","GERARDO LUIS CONTRERAS PALACIOS","TECNICO DOCENTE",35,83101,1,7,19,"T03820",0,281,2,null,null,null,42258,0]
[null,"GUANAJUATO","11EBS0027E",100,"COSL800716SL8","COSL800716MGTRRD08","LIDIA CAROLINA CORTES SIERRA","TECNICO DOCENTE",35,83101,1,7,42,"T03820",0,4511,2,null,null,null,32262,0]
[null,"GUANAJUATO","11EBS0027E",100,"CUFC8809064X4","CUFC880906MOCRNY08","CYNTHIA CRUZ FUENTES","SECRETARIA \"C\"",35,83101,1,7,13,"A03804",0,171,2,null,null,null,26921,0]
[null,"GUANAJUATO","11EBS0027E",100,"CUPS720728BN7","CUPS720728MGTVSL06","SILVIA CUEVAS PESCADOR","ESPECIALISTA EN PROYECTOS TECNICOS",35,83101,1,7,43,"T03810",0,1102,2,null,null,null,26919,0]
[null,"GUANAJUATO","11EBS0027E",100,"CUSG780213V57","CUSG780213HGTRVL03","GUILIBALDO CRUZ SAAVEDRA","TECNICO DOCENTE",35,83101,1,7,42,"T03820",0,675,2,null,null,null,41842,0]
[null,"GUANAJUATO","11EBS0027E",100,"DITJ760122R33","DITJ760122HGTZRN01","JUAN GABRIEL DIAZ TORRES","COORDINADOR DE ZONA",40,83101,1,7,20,"CF36014",0,310,5,null,null,null,45436,0]
[null,"GUANAJUATO","11EBS0027E",100,"DOVL720318BXA","DOVL720318HGTMLS06","JOSE LUIS DOMINGUEZ VALDES","TECNICO DOCENTE",35,83101,1,7,15,"T03820",0,1701,2,null,null,null,39672,0]
[null,"GUANAJUATO","11EBS0027E",100,"DOVR6304095Y7","DOVR630409MBCMZS05","MARIA DEL ROSARIO DOMINGUEZ VAZQUEZ","TECNICO DOCENTE",35,83101,1,7,27,"T03820",0,1449,2,null,null,null,39078,0]
[null,"GUANAJUATO","11EBS0027E",100,"DUPS9001267KA","DUPS900126MGTRRN08","SANDRA IVONNE DURAN PRADO","SECRETARIA \"C\"",35,83101,1,7,42,"A03804",0,112,2,null,null,null,26919,0]
[null,"GUANAJUATO","11EBS0027E",100,"DUVE540209Q63","DUVE540209HGTRLR06","ERNESTO DURAN VALDIVIA","TECNICO DOCENTE",35,83101,1,7,27,"T03820",0,1242,2,null,null,null,43050,0]
[null,"GUANAJUATO","11EBS0027E",100,"EAAJ8712218X3","EAAJ871221MMCSLS09","MARIA DE JESUS ESCAMILLA ALVAREZ","ESPECIALISTA EN PROYECTOS TECNICOS",35,83101,1,7,25,"T03810",0,220,2,null,null,null,26722,0]
[null,"GUANAJUATO","11EBS0027E",100,"EAOM860526KN2","EAOM860526HASSCR02","MARIANO ESPARZA OCHOA","JEFE DE DEPARTAMENTO",40,83101,1,1,1,"CF01059",0,241,5,null,null,null,77460,0]
[null,"GUANAJUATO","11EBS0027E",100,"EARF920415GZ8","EARF920415MGTSDT17","FATIMA YAZMIN ESTRADA RODRIGUEZ","SECRETARIA \"C\"",35,83101,1,1,1,"A03804",0,3571,2,null,null,null,26328,0]
[null,"GUANAJUATO","11EBS0027E",100,"EASG700512IU9","EASG700512MCMSNR00","GRACIELA ESCAMILLA SANCHEZ","JEFE DE OFICINA",35,83101,1,7,42,"A01807",0,526,2,null,null,null,34837,0]
[null,"GUANAJUATO","11EBS0027E",100,"EICS8311094H1","EICS831109MGTLNN06","SANDRA ELISA ELIAS CONTRERAS","TECNICO DOCENTE",35,83101,1,7,29,"T03820",0,263,2,null,null,null,32262,0]
[null,"GUANAJUATO","11EBS0027E",100,"EIRJ6812089I5","EIRC681208HGTNMR05","J. CARLOS ENRIQUEZ RAMIREZ","TECNICO DOCENTE",35,83101,1,7,18,"T03820",0,1561,2,null,null,null,41244,0]
[null,"GUANAJUATO","11EBS0027E",100,"FAHG7612098T7","FAHG761209MGTLRD03","MA. GUADALUPE FALCON HERNANDEZ","ESPECIALISTA EN PROYECTOS TECNICOS",35,83101,1,7,41,"T03810",0,219,2,null,null,null,26919,0]
[null,"GUANAJUATO","11EBS0027E",100,"FAHI7401088Z2","FAHI740108HGTBRV04","IVAN FABELA HERNANDEZ","TECNICO DOCENTE",35,83101,1,7,33,"T03820",0,1793,2,null,null,null,40866,0]
[null,"GUANAJUATO","11EBS0027E",100,"FAOI930617PD8","FAOI930617HGTRRS09","JOSE ISAAC FRAUSTO ORTEGA","ANALISTA ADMINISTRATIVO",35,83101,1,7,13,"A01806",0,91,2,null,null,null,4467,0]
[null,"GUANAJUATO","11EBS0027E",100,"FECM8910217I9","FECM891021MDFRVR01","MARIANA GUISELA FERREIRA CUEVAS","ESPECIALISTA EN PROYECTOS TECNICOS",35,83101,1,7,43,"T03810",0,116,2,null,null,null,26722,0]
[null,"GUANAJUATO","11EBS0027E",100,"FEET711003EB8","FEET711003MGTLSR05","TERESA FELIX ESTRELLA","ANALISTA ADMINISTRATIVO",35,83101,1,7,41,"A01806",0,283,2,null,null,null,35844,0]
[null,"GUANAJUATO","11EBS0027E",100,"FEGR710424QJ8","FEXG710424MGTRXR09","GRACIELA FERRER ","TECNICO DOCENTE",35,83101,1,7,24,"T03820",0,1392,2,null,null,null,32362,0]
[null,"GUANAJUATO","11EBS0027E",100,"FICJ7603185H9","FICT760318HGTRSR03","J. TRINIDAD FRIAS CASTAÑEDA","TECNICO DOCENTE",35,83101,1,7,40,"T03820",0,2114,2,null,null,null,40110,0]
[null,"GUANAJUATO","11EBS0027E",100,"FOAP6704124J5","FOAP670412MGTLLT01","PATRICIA FLORES ALVAREZ","ANALISTA PROGRAMADOR \"B\"",35,83101,1,2,4,"CF12804",0,0,2,null,null,null,29700,0]
[null,"GUANAJUATO","11EBS0027E",100,"FOLI910518MEA","FOLI910518HGTLPS09","ISRAEL FLORES LOPEZ","TECNICO SUPERIOR",35,83101,1,2,4,"T03823",0,138,2,null,null,null,16131,0]
[null,"GUANAJUATO","11EBS0027E",100,"FOMJ7811187W8","FOMJ781118HGTLDN07","JUAN PABLO FLORES MEDINA","TECNICO DOCENTE",35,83101,1,7,28,"T03820",0,128,2,null,null,null,38082,0]
[null,"GUANAJUATO","11EBS0027E",100,"FOMO6906162N2","FOMO690616HGTNDS05","OSCAR FONSECA MEDRANO","TECNICO DOCENTE",35,83101,1,5,12,"T03820",0,65,2,null,null,null,40674,0]
[null,"GUANAJUATO","11EBS0027E",100,"FONO7308067J5","FOXN730806MGTLXR04","NORMA LILIA FLORES ","TECNICO MEDIO",35,83101,1,7,19,"T03803",0,24,2,null,null,null,33503,0]
[null,"GUANAJUATO","11EBS0027E",100,"FOQL7110275I8","FOQL711027MGTLVN02","LEONOR FLORES QUEVEDO","TECNICO MEDIO",35,83101,1,7,28,"T03803",0,22,2,null,null,null,28959,0]
[null,"GUANAJUATO","11EBS0027E",100,"FOQP690616QU0","FOQP690616MGTLVT01","PETRA FLORES QUEVEDO","TECNICO DOCENTE",35,83101,1,7,41,"T03820",0,470,2,null,null,null,41756,0]
[null,"GUANAJUATO","11EBS0027E",100,"FOTL950830PQ2","FOTL950830MGTLRR02","LAURA JAZMIN FLORES TORRES","TECNICO DOCENTE",35,83101,1,7,27,"T03820",0,2251,2,null,null,null,32262,0]
[null,"GUANAJUATO","11EBS0027E",100,"GACC7402201D0","GACC740220MVZRYL09","CLAUDIA GARCIA CAYETANO","TECNICO DOCENTE",35,83101,1,7,27,"T03820",0,142,2,null,null,null,34542,0]
[null,"GUANAJUATO","11EBS0027E",100,"GAGY780903491","GAGY780903MDFLMS06","YOSELIN AIMEE GALVAN GAMEZ","ESPECIALISTA EN PROYECTOS TECNICOS",35,83101,1,7,30,"T03810",0,151,2,null,null,null,26919,0]
[null,"GUANAJUATO","11EBS0027E",100,"GALA740123JB8","GALA740123MGTLPL08","ALMA ROSA GALINDO LOPEZ","ESPECIALISTA EN PROYECTOS TECNICOS",35,83101,1,7,13,"T03810",0,187,2,null,null,null,26919,0]
[null,"GUANAJUATO","11EBS0027E",100,"GAMJ711118AJ8","GAMJ711118HGTRCC07","JACOBO GARCIA MICHACA","TECNICO DOCENTE",35,83101,1,7,18,"T03820",0,1932,2,null,null,null,40866,0]
[null,"GUANAJUATO","11EBS0027E",100,"GAML720417UE8","GAML720417HGTRRS07","LUIS ALBERTO GARCIA MARTINEZ","TECNICO DOCENTE",35,83101,1,7,35,"T03820",0,2754,2,null,null,null,39870,0]
[null,"GUANAJUATO","11EBS0027E",100,"GARM751031J11","GARM751031HGTRMS07","MOISES GRANADOS RAMOS","COORD. DE SERVICIOS ESP.",35,83101,1,8,44,"CF33849",0,188,2,null,null,null,47382,0]
[null,"GUANAJUATO","11EBS0027E",100,"GAVR910621UJ2","GAVR910621HGTRLL01","RAUL ALEJANDRO GRANADOS VALLE","TECNICO DOCENTE",35,83101,1,7,35,"T03820",0,1999,2,null,null,null,21508,0]
[null,"GUANAJUATO","11EBS0027E",100,"GOAA581209FLA","GOAA581209MGTNGL08","ALICIA GONZALEZ AGUIRRE","ESPECIALISTA EN PROYECTOS TECNICOS",35,83101,1,7,41,"T03810",0,201,2,null,null,null,33573,0]
[null,"GUANAJUATO","11EBS0027E",100,"GOAR790919E90","GOAR790919MGTNLS24","ROSA MARIA GONZALEZ ALEJOS","TECNICO DOCENTE",35,83101,1,7,24,"T03820",0,67,2,null,null,null,5377,0]
[null,"GUANAJUATO","11EBS0027E",100,"GOAS751103PH7","GOAS751103MGTNRL01","SILVIA SANTOS GONZALEZ ARANDA","TECNICO DOCENTE",35,83101,1,7,27,"T03820",0,1656,2,null,null,null,38880,0]
[null,"GUANAJUATO","11EBS0027E",100,"GOGA680110DL7","GOGA680110MGTNYN00","ANA BERTHA GONZALEZ GAYTAN","TECNICO DOCENTE",35,83101,1,7,25,"T03820",0,757,2,null,null,null,61658,0]
[null,"GUANAJUATO","11EBS0027E",100,"GOGE831013479","GOGE831013MGTNRL03","ELIA JUDITH GONZALEZ GUERRA","ESPECIALISTA EN PROYECTOS TECNICOS",35,83101,1,7,33,"T03810",0,198,2,null,null,null,31233,0]
[null,"GUANAJUATO","11EBS0027E",100,"GOGL670809V8A","GOGL670809HGTNRS00","LUIS ALBERTO GONZALEZ GARCIA","TECNICO DOCENTE",35,83101,1,7,25,"T03820",0,383,2,null,null,null,61060,0]
[null,"GUANAJUATO","11EBS0027E",100,"GOGR650725KF1","GOGR650725HGTNRB02","ROBERTO GONZALEZ GARCIA","TECNICO DOCENTE",35,83101,1,7,41,"T03820",0,235,2,null,null,null,42456,0]
[null,"GUANAJUATO","11EBS0027E",100,"GOLC950116TN4","GOLC950116HGTMPR09","CARLOS ADEMIR EUSEBIO GOMEZ LOPEZ","SECRETARIA \"C\"",35,83101,1,9,52,"A03804",0,2171,2,null,null,null,8776,0]
[null,"GUANAJUATO","11EBS0027E",100,"GOMM610218KG4","GOMM610218MGTNRR05","MARTA PATRICIA GONZALEZ MORENO","SECRETARIA \"C\"",35,83101,1,7,13,"A03804",0,4412,2,null,null,null,33897,0]
[null,"GUANAJUATO","11EBS0027E",100,"GOND6504247RA","GOND650424MGTNXL03","DALIA SONIA GONZALEZ NIÑO","SECRETARIA \"C\"",35,83101,1,7,17,"A03804",0,135,2,null,null,null,31503,0]
[null,"GUANAJUATO","11EBS0027E",100,"GOOG7802057F2","GOOG780205HGTNRD04","JOSE GUADALUPE GONZALEZ ORTEGA","TECNICO DOCENTE",35,83101,1,7,42,"T03820",0,1686,2,null,null,null,32262,0]
[null,"GUANAJUATO","11EBS0027E",100,"GOPS8011178I3","GOPS801117MGTMRN09","MARIA SANDRA GOMEZ PEREZ","SECRETARIA \"C\"",35,83101,1,7,20,"A03804",0,2221,2,null,null,null,29847,0]
[null,"GUANAJUATO","11EBS0027E",100,"GORA840728TD1","GORA840728MDFNMN07","ANA LAURA GONZALEZ RAMOS","JEFE DE OFICINA",35,83101,1,7,25,"A01807",0,312,2,null,null,null,28224,0]
[null,"GUANAJUATO","11EBS0027E",100,"GORD8312168D4","GORD831216MGTMVL06","DULCE MARIA MONSERRAT GOMEZ RIVERA","TECNICO DOCENTE",35,83101,1,7,28,"T03820",0,1638,2,null,null,null,32262,0]
[null,"GUANAJUATO","11EBS0027E",100,"GORE840602N47","GORE840602HGTNDM00","EMMANUEL GONZALEZ RODRIGUEZ","TECNICO DOCENTE",35,83101,1,7,27,"T03820",0,2520,2,null,null,null,37089,0]
[null,"GUANAJUATO","11EBS0027E",100,"GOSL721116725","GOSL721116HGTRSS06","LUIS JAVIER GORDILLO SOSA","TECNICO DOCENTE",35,83101,1,7,28,"T03820",0,3037,2,null,null,null,41707,0]
[null,"GUANAJUATO","11EBS0027E",100,"GUAA541207PD5","GUAA541207MGTTVL07","ALMA ROSA GUTIERREZ AVILES","JEFE DE OFICINA",35,83101,1,7,19,"A01807",0,4231,2,null,null,null,33195,0]
[null,"GUANAJUATO","11EBS0027E",100,"GUGJ930811J60","GUGJ930811MGTRNS05","MARIA JOSE GUERRERO GONZALEZ","ADMINISTRATIVO ESPECIALIZADO",35,83101,1,5,12,"A01803",0,471,2,null,null,null,26328,0]
[null,"GUANAJUATO","11EBS0027E",100,"GUHA770213FQ8","GUHA770213MGTVRL02","ALMA ROSA GUEVARA HERNANDEZ","TECNICO DOCENTE",35,83101,1,7,13,"T03820",0,2046,2,null,null,null,46672,0]
[null,"GUANAJUATO","11EBS0027E",100,"GUMA6701215Q1","GUMA670121MGTTRN09","ANA GUTIERREZ MORENO","TECNICO DOCENTE",35,83101,1,7,24,"T03820",0,700,2,null,null,null,61658,0]
[null,"GUANAJUATO","11EBS0027E",100,"GUMC6804029G4","GUMC680402MGTZNR09","MARIA DEL CARMEN GUZMAN MANZANILLA","TECNICO DOCENTE",35,83101,1,7,15,"T03820",0,1911,2,null,null,null,41046,0]
[null,"GUANAJUATO","11EBS0027E",100,"GUMJ870317R44","GUMJ870317HGTRRN00","JONAS GUERRERO MARTINEZ","TECNICO DOCENTE",35,83101,1,7,40,"T03820",0,1171,2,null,null,null,32262,0]
[null,"GUANAJUATO","11EBS0027E",100,"GUMM920308B42","GUMM920308MGTRJN03","MONICA JUANA GUERRERO MEJIA","TECNICO DOCENTE",35,83101,1,7,28,"T03820",0,2525,2,null,null,null,32862,0]
[null,"GUANAJUATO","11EBS0027E",100,"GUNC8511262G5","GUNC851126HQRTVR08","CARLOS FELIPE GUTIERREZ NOVELO","ANALISTA ADMINISTRATIVO",35,83101,1,5,12,"CF34810",0,31,2,null,null,null,26802,0]
[null,"GUANAJUATO","11EBS0027E",100,"GUND770803A3A","GUND770803HGTTTN01","DANIEL ADRIAN GUTIERREZ NIETO","SECRETARIA \"C\"",35,83101,1,8,44,"A03804",0,3291,2,null,null,null,4388,0]
[null,"GUANAJUATO","11EBS0027E",100,"GUOA740914U2A","GUOA740914MMNDRN06","MA. DE LOS ANGELES GUDIÑO ORDAZ","SECRETARIA \"C\"",35,83101,1,7,43,"A03804",0,16,2,null,null,null,32331,0]
[null,"GUANAJUATO","11EBS0027E",100,"GURR6007275B3","GURR600727HSPLMD06","RODOLFO GUEL RAMIREZ","TECNICO DOCENTE",35,83101,1,7,30,"T03820",0,2478,2,null,null,null,40470,0]
[null,"GUANAJUATO","11EBS0027E",100,"GURV740105E98","GURV740105MGTRDR07","VERONICA GUERRERO RODRIGUEZ","SECRETARIA \"C\"",35,83101,1,7,13,"A03804",0,393,2,null,null,null,31825,0]
[null,"GUANAJUATO","11EBS0027E",100,"GUSS6608135L6","GUSS660813MGTRNF04","SOFIA GUERRERO SANDOVAL","TECNICO DOCENTE",35,83101,1,7,13,"T03820",0,590,2,null,null,null,39312,0]
[null,"GUANAJUATO","11EBS0027E",100,"GUVJ850624HM6","GUVJ850624HGTZYN02","JUAN MIGUEL GUZMAN VIEYRA","COORDINADOR DE ZONA",40,83101,1,7,25,"CF36014",0,48,5,null,null,null,45436,0]
[null,"GUANAJUATO","11EBS0027E",100,"GUZK880623FTA","GUZK880623HGTTVR00","KARIM MIGUEL GUTIERREZ ZAVALA","TECNICO MEDIO",35,83101,1,7,40,"T03803",0,2172,2,null,null,null,26328,0]
[null,"GUANAJUATO","11EBS0027E",100,"HECA7404077F6","HECA740407MGTRND08","ADRIANA HERNANDEZ CANTERO","TECNICO MEDIO",35,83101,1,7,14,"T03803",0,311,2,null,null,null,33957,0]
[null,"GUANAJUATO","11EBS0027E",100,"HECG7108185E0","HECG710818HGTRBR07","GERARDO HERNANDEZ CABEZA","TECNICO DOCENTE",35,83101,1,7,20,"T03820",0,199,2,null,null,null,32262,0]
[null,"GUANAJUATO","11EBS0027E",100,"HECG7209202C4","HECG720920MGTRRR07","GRISELDA HERRERA CERVANTES","SECRETARIA \"C\"",35,83101,1,7,24,"A03804",0,80,2,null,null,null,34605,0]
[null,"GUANAJUATO","11EBS0027E",100,"HECR621219RI5","HECR621219MGTRRS02","MARIA DEL ROSARIO HERNANDEZ CARDENAS","JEFE DE OFICINA",35,83101,1,7,18,"A01807",0,2481,2,null,null,null,37969,0]
[null,"GUANAJUATO","11EBS0027E",100,"HECS730303TG6","HECS730303MGTRNS05","SUSANA TERESA HERNANDEZ CANTERO","TECNICO MEDIO",35,83101,1,7,14,"T03803",0,1921,2,null,null,null,34191,0]
[null,"GUANAJUATO","11EBS0027E",100,"HEDM871214861","HEDM871214HGTRLN04","JOSE MANUEL HERNANDEZ DELGADO","TECNICO MEDIO",35,83101,1,1,3,"T03803",0,512,2,null,null,null,28959,0]
[null,"GUANAJUATO","11EBS0027E",100,"HEEE731209HI1","HEEE731209MGTRSS09","ESMERALDA HERNANDEZ ESCOGIDO","COORD. DE SERVICIOS ESP.",35,83101,1,9,53,"CF33849",0,230,2,null,null,null,47232,0]
[null,"GUANAJUATO","11EBS0027E",100,"HEEI750809EB5","HEEI750809HGTRSS09","ISIDORO DE SEVILLA HERNANDEZ ESCOGIDO","JEFE DE OFICINA",35,83101,1,2,4,"A01807",0,457,2,null,null,null,13899,0]
[null,"GUANAJUATO","11EBS0027E",100,"HELJ920419M66","HELJ920419HQTRYS06","JOSE DE JESUS HERNANDEZ LOYOLA","COORDINADOR DE ZONA",40,83101,1,8,44,"CF36014",0,349,5,null,null,null,52836,0]
[null,"GUANAJUATO","11EBS0027E",100,"HELM710411Q56","HELM710411MGTRDR02","MARTHA ANGELICA HERNANDEZ LEDESMA","TECNICO DOCENTE",35,83101,1,7,27,"T03820",0,507,2,null,null,null,32442,0]
[null,"GUANAJUATO","11EBS0027E",100,"HEMF950111UT8","HEMF950111HGTRRR04","FRANCISCO ANTONIO HERNANDEZ MARTINEZ","TECNICO MEDIO",35,83101,1,7,42,"T03803",0,3742,2,null,null,null,4388,0]
[null,"GUANAJUATO","11EBS0027E",100,"HEMJ740921F99","HEMJ740921HGTRXND8","JUAN LORENZO HERNANDEZ MUÑOZ","COORDINADOR DE ZONA",40,83101,1,7,18,"CF36014",0,84,5,null,null,null,68154,0]
[null,"GUANAJUATO","11EBS0027E",100,"HEMM781102T78","HEMM781102MGTRNR07","MARISELA HERNANDEZ MONTOYA","TECNICO DOCENTE",35,83101,1,7,16,"T03820",0,1530,2,null,null,null,39705,0]
[null,"GUANAJUATO","11EBS0027E",100,"HEPC690801P80","HEPC690801MGTRRR08","MA. DEL CARMEN HERNANDEZ PEREZ","TECNICO DOCENTE",35,83101,1,7,27,"T03820",0,1221,2,null,null,null,41704,0]
[null,"GUANAJUATO","11EBS0027E",100,"HERA790725FQ8","HERA790725MGTRDL08","ALEJANDRA HERNANDEZ RODRIGUEZ","ANALISTA ADMINISTRATIVO",35,83101,1,7,15,"A01806",0,1523,2,null,null,null,32568,0]
[null,"GUANAJUATO","11EBS0027E",100,"HERG571023MS0","HERG571023MGTRPD07","MA. GUADALUPE JUDITH HERNANDEZ RIPALDA","COORD. DE SERVICIOS ESP.",35,83101,1,1,2,"CF33849",0,400,2,null,null,null,47460,0]
[null,"GUANAJUATO","11EBS0027E",100,"HERG640304LK9","HERG640304MGTRDR09","GRACIELA HERNANDEZ RODRIGUEZ","TECNICO DOCENTE",35,83101,1,7,41,"T03820",0,812,2,null,null,null,32262,0]
[null,"GUANAJUATO","11EBS0027E",100,"HESF670102636","HESF670102HGTRLR07","FERMIN HERNANDEZ SILVA","JEFE DE OFICINA",35,83101,1,7,35,"A01807",0,405,2,null,null,null,38321,0]
[null,"GUANAJUATO","11EBS0027E",100,"HESJ680622CM5","HESJ680622HGTRLS06","JOSE DE JESUS HERNANDEZ SALAZAR","COORDINADOR REGIONAL",40,83101,1,5,12,"CF36014",0,21,5,null,null,null,29230,0]
[null,"GUANAJUATO","11EBS0027E",100,"HOHL860601124","HOHL860601MGTRRZ09","LUZ ANGELICA HORTA HERNANDEZ","JEFE DE DEPARTAMENTO",40,83101,1,2,4,"CF01059",0,21,5,null,null,null,69252,0]
[null,"GUANAJUATO","11EBS0027E",100,"HUSA860811CJ2","HUSA860811MGTRRN07","MARIA DE LOS ANGELES HURTADO SUAREZ","SECRETARIA \"C\"",35,83101,1,7,30,"A03804",0,371,2,null,null,null,13164,0]
[null,"GUANAJUATO","11EBS0027E",100,"HUSM771116C7A","HUSM771116MMNNLR06","MARIZA HUANTE SILVA","TECNICO MEDIO",35,83101,1,7,25,"T03803",0,301,2,null,null,null,26722,0]
[null,"GUANAJUATO","11EBS0027E",100,"IAJM900213S93","IAJM900213HGTBSR04","MARIO ALBERTO IBARRA JASSO","TECNICO DOCENTE",35,83101,1,7,29,"T03820",0,87,2,null,null,null,32262,0]
[null,"GUANAJUATO","11EBS0027E",100,"JAAA741109NM2","JAAA741109MGTSGL04","ALMA PATRICIA JASSO AGUILERA","TECNICO DOCENTE",35,83101,1,7,15,"T03820",0,1779,2,null,null,null,32262,0]
[null,"GUANAJUATO","11EBS0027E",100,"JAAM880824146","JAAM880824MCLRRR06","MARISOL IBETH JARA ARRIAGA","ANALISTA ADMINISTRATIVO",35,83101,1,2,4,"A01806",0,1951,2,null,null,null,22335,0]
[null,"GUANAJUATO","11EBS0027E",100,"JAAX8707291Z3","JAAX870729MCLRRC03","XOCHITL YUVICELA JARA ARRIAGA","TECNICO MEDIO",35,83101,1,7,41,"T03803",0,511,2,null,null,null,26919,0]
[null,"GUANAJUATO","11EBS0027E",100,"JABE820909HH0","JABE820909MGTSLL12","ELOISA JASSO BALLEZA","SECRETARIA \"C\"",35,83101,1,8,44,"A03804",0,243,2,null,null,null,26919,0]
[null,"GUANAJUATO","11EBS0027E",100,"JIAR5906097A6","JIAR590609HVZMNB07","ROBERTO JIMENEZ DEL ANGEL","DELEGADO",40,83101,1,2,6,"CF14070",0,32,5,null,null,null,205275,0]
[null,"GUANAJUATO","11EBS0027E",100,"JUAA750702KJ9","JUAA750702HGTRRN04","JOSE ANDRES JUAREZ ARROYO","TECNICO DOCENTE",35,83101,1,7,19,"T03820",0,3033,2,null,null,null,40272,0]
[null,"GUANAJUATO","11EBS0027E",100,"JUCR790316G8A","JUCR790316HGTRPL02","RAUL HERIBERTO JUAREZ CAPETILLO","ESPECIALISTA EN PROYECTOS TECNICOS",35,83101,1,7,28,"T03810",0,83,2,null,null,null,26919,0]
[null,"GUANAJUATO","11EBS0027E",100,"JUEC8408019SA","JUEC840801MGTRSR08","MARIA DEL CARMEN IVONNE JUAREZ ESPITIA","TECNICO DOCENTE",35,83101,1,7,40,"T03820",0,704,2,null,null,null,32442,0]
[null,"GUANAJUATO","11EBS0027E",100,"JUON6804281K2","JUON680428HGTRRX00","NOE JUAREZ ORTEGA","TECNICO DOCENTE",35,83101,1,7,41,"T03820",0,2582,2,null,null,null,42456,0]
[null,"GUANAJUATO","11EBS0027E",100,"LAGG8705075P8","LAGG870507MGTGRS08","GISELA LAGUNA GUERRERO","TECNICO DOCENTE",35,83101,1,7,43,"T03820",0,391,2,null,null,null,32262,0]
[null,"GUANAJUATO","11EBS0027E",100,"LAMZ780504N49","LAMZ780504MSLRNN01","ZINTIA DENISE LARA MENDIVIL","TECNICO DOCENTE",35,83101,1,7,24,"T03820",0,2744,2,null,null,null,30833,0]
[null,"GUANAJUATO","11EBS0027E",100,"LAOJ8212131K9","LAOJ821213HGTRLS09","JESUS SAMUEL LARA OLMOS","TECNICO DOCENTE",35,83101,1,7,41,"T03820",0,1573,2,null,null,null,34542,0]
[null,"GUANAJUATO","11EBS0027E",100,"LEGJ871018BN9","LEGJ871018MGTDNN02","JENIFER LEDEZMA GONZALEZ","SECRETARIA \"C\"",35,83101,1,9,51,"A03804",0,209,2,null,null,null,26328,0]
[null,"GUANAJUATO","11EBS0027E",100,"LERM7308264B5","LERM730826MGTDSN09","MONICA LEDESMA ROSALES","TECNICO DOCENTE",35,83101,1,7,13,"T03820",0,1757,2,null,null,null,39078,0]
[null,"GUANAJUATO","11EBS0027E",100,"LISA7512109V7","LISA751210MGTRLN04","ANA ISABEL LIRA SALDAÑA","COORDINADOR DE ZONA",40,83101,1,1,1,"CF36014",0,378,5,null,null,null,63048,0]
[null,"GUANAJUATO","11EBS0027E",100,"LOCJ8109121HA","LOCJ810912HDFPRN00","JUAN CARLOS LOPEZ CRUZ","SECRETARIA \"C\"",35,83101,1,5,12,"A03804",0,2592,2,null,null,null,37655,0]
[null,"GUANAJUATO","11EBS0027E",100,"LOHD930413C30","LOHD930413MGTPDN05","DIANA GUADALUPE LOPEZ HIDALGO","TECNICO DOCENTE",35,83101,1,7,42,"T03820",0,708,2,null,null,null,32262,0]
[null,"GUANAJUATO","11EBS0027E",100,"LOLA751009LC7","LOLA751009MGTPNN06","MA. DE LOS ANGELES LOPEZ LUNA","TECNICO DOCENTE",35,83101,1,7,25,"T03820",0,1951,2,null,null,null,40308,0]
[null,"GUANAJUATO","11EBS0027E",100,"LOLB681130LWA","LOLB681130MGTPLT03","BEATRIZ LOPEZ LLANOS","TECNICO DOCENTE",35,83101,1,7,43,"T03820",0,282,2,null,null,null,37092,0]
[null,"GUANAJUATO","11EBS0027E",100,"LOLG8002136P9","LOLG800213HGTPNS03","GUSTAVO LOPEZ LUNA","TECNICO DOCENTE",35,83101,1,7,35,"T03820",0,122,2,null,null,null,32262,0]
[null,"GUANAJUATO","11EBS0027E",100,"LUGL7801215UA","LUGL780121HGTNRS00","LUIS ALBERTO LUNA GUERRA","COORDINADOR DE ZONA",40,83101,1,7,19,"CF36014",0,2581,5,null,null,null,68154,0]
[null,"GUANAJUATO","11EBS0027E",100,"LUMR751129U75","LUMR751129HGTGTC02","RICARDO ERNESTO LUGO MATA","TECNICO DOCENTE",35,83101,1,7,30,"T03820",0,109,2,null,null,null,32502,0]
[null,"GUANAJUATO","11EBS0027E",100,"LUOE610116R96","LUOE610116HDGNLM05","EMILIO LUNA OLAGUE","TECNICO DOCENTE",35,83101,1,7,14,"T03820",0,1922,2,null,null,null,42654,0]
[null,"GUANAJUATO","11EBS0027E",100,"LURF6001292T1","LURF600129HGTNMR01","FRANCISCO JAVIER LUNA RAMIREZ","TECNICO DOCENTE",35,83101,1,7,14,"T03820",0,200,2,null,null,null,42654,0]
[null,"GUANAJUATO","11EBS0027E",100,"MAAC750325Q52","MAAC750325MGTLLR02","MA. DEL CARMEN MALDONADO ALMANZA","SECRETARIA \"C\"",35,83101,1,7,14,"A03804",0,1522,2,null,null,null,30039,0]
[null,"GUANAJUATO","11EBS0027E",100,"MAAC750527A26","MAAC750527MGTRGR07","CAROLINA MARTINEZ AGREDA","ESPECIALISTA EN PROYECTOS TECNICOS",35,83101,1,7,14,"T03810",0,266,2,null,null,null,29757,0]
[null,"GUANAJUATO","11EBS0027E",100,"MAAL680513MP3","MAAL680513MMNRNZ01","MARIA DE LA LUZ MARTINEZ ANDRADE","TECNICO MEDIO",35,83101,1,7,27,"T03803",0,53,2,null,null,null,35195,0]
[null,"GUANAJUATO","11EBS0027E",100,"MABM7603207B6","MABM760320MGTCSR01","MARIANA MACHUCA BUSTAMANTE","TECNICO DOCENTE",35,83101,1,7,28,"T03820",0,1202,2,null,null,null,32262,0]
[null,"GUANAJUATO","11EBS0027E",100,"MACB900101238","MACB900101MGTRRR07","BRENDA ARACELI MARTINEZ CRUZ","TECNICO SUPERIOR",35,83101,1,2,4,"T03823",0,101,2,null,null,null,21508,0]
[null,"GUANAJUATO","11EBS0027E",100,"MACE770912412","MACE770912HQTRHC07","ECTOR JAVIER MARTINEZ CHAVEZ","COORDINADOR DE ZONA",40,83101,1,7,28,"CF36014",0,351,5,null,null,null,68681,0]
[null,"GUANAJUATO","11EBS0027E",100,"MADS8906296J1","MADS890629MGTRMR05","SUREY VIRIDIANA MARTINEZ DOMINGUEZ","ESPECIALISTA EN PROYECTOS TECNICOS",35,83101,1,7,15,"T03810",0,157,2,null,null,null,26328,0]
[null,"GUANAJUATO","11EBS0027E",100,"MAFR721206U28","MAFR721206MGTRLC04","ROCIO ANEL MARTINEZ FLORES","TECNICO DOCENTE",35,83101,1,7,15,"T03820",0,6162,2,null,null,null,32262,0]
[null,"GUANAJUATO","11EBS0027E",100,"MAGE550714NZ1","MAGE550714HGTRNS03","ESTEBAN MARTINEZ GONZALEZ","TECNICO DOCENTE",35,83101,1,7,30,"T03820",0,127,2,null,null,null,58050,0]
[null,"GUANAJUATO","11EBS0027E",100,"MAGE751103B16","MAGE751103MGTYTR08","ERIKA GUADALUPE MAYCOTTE GUTIERREZ","ANALISTA ADMINISTRATIVO",35,83101,1,7,16,"A01806",0,534,2,null,null,null,34569,0]
[null,"GUANAJUATO","11EBS0027E",100,"MAGG810106790","MAGG810106MGTRNR04","GRACIELA MARTINEZ GONZALEZ","SECRETARIA \"C\"",35,83101,1,7,28,"A03804",0,143,2,null,null,null,28219,0]
[null,"GUANAJUATO","11EBS0027E",100,"MAGM6404092N1","MAGM640409MGTNNR08","MARTA MANDUJANO GONZALEZ","TECNICO DOCENTE",35,83101,1,7,43,"T03820",0,749,2,null,null,null,61658,0]
[null,"GUANAJUATO","11EBS0027E",100,"MALA730704I26","MALA730704HGTRPR02","ARNULFO MARQUEZ LOPEZ","TECNICO DOCENTE",35,83101,1,7,27,"T03820",0,832,2,null,null,null,37884,0]
[null,"GUANAJUATO","11EBS0027E",100,"MANL580917DN5","MANL580917HGTRXS04","JOSE LUIS MARTINEZ NUÑEZ","TECNICO DOCENTE",35,83101,1,7,42,"T03820",0,435,2,null,null,null,32262,0]
[null,"GUANAJUATO","11EBS0027E",100,"MARC601223340","MARC601223MGTRLC03","CECILIA MARTINEZ RUELAS","TECNICO DOCENTE",35,83101,1,7,33,"T03820",0,475,2,null,null,null,37026,0]
[null,"GUANAJUATO","11EBS0027E",100,"MASV810101DZ8","MASV810101MGTRRR01","VERONICA MARTINEZ SARABIA","TECNICO DOCENTE",35,83101,1,7,40,"T03820",0,269,2,null,null,null,40068,0]
[null,"GUANAJUATO","11EBS0027E",100,"MEGG6409203P0","MEGG640920HGTDLR04","GERARDO MEDINA GALVAN","JEFE DE OFICINA",35,83101,1,2,4,"A01807",0,410,2,null,null,null,32120,0]
[null,"GUANAJUATO","11EBS0027E",100,"MELR640522PX9","MELR640522MGTNNT06","RITA MENDEZ LEON","TECNICO DOCENTE",35,83101,1,7,24,"T03820",0,456,2,null,null,null,40068,0]
[null,"GUANAJUATO","11EBS0027E",100,"MEMS601125CV5","MEMS601125HMNNLM04","SAMUEL MENDOZA MALDONADO","ESP. EN TELEINFORMATICA",35,83101,1,9,52,"CF12814",0,41,2,null,null,null,32262,0]
[null,"GUANAJUATO","11EBS0027E",100,"MENC680926QE2","MENC680926MGTDVR02","MARIA DEL CARMEN MEDEL NAVARRETE","TECNICO DOCENTE",35,83101,1,7,20,"T03820",0,1929,2,null,null,null,40866,0]
[null,"GUANAJUATO","11EBS0027E",100,"MENM790123EM1","MENM790123MGTDVR00","MIRIAM DE LOS ANGELES GABRIELA MEDEL NAVARRETE","SECRETARIA \"C\"",35,83101,1,7,20,"A03804",0,173,2,null,null,null,26722,0]
[null,"GUANAJUATO","11EBS0027E",100,"MERM890606QX7","MERM890606MGTNYY01","MYRIAM DE LOS ANGELES MENDOZA REYES","ESPECIALISTA EN PROYECTOS TECNICOS",35,83101,1,7,29,"T03810",0,112,2,null,null,null,26722,0]
[null,"GUANAJUATO","11EBS0027E",100,"METC6212134V3","METC621213HGTRPS06","CESAR MARTIN MERINO TAPIA","TECNICO DOCENTE",35,83101,1,7,15,"T03820",0,2186,2,null,null,null,40068,0]
[null,"GUANAJUATO","11EBS0027E",100,"MEVG630915G81","MEVG630915MGTRRD08","MA. GUADALUPE MERCADO VARELA","TECNICO DOCENTE",35,83101,1,7,43,"T03820",0,951,2,null,null,null,38916,0]
[null,"GUANAJUATO","11EBS0027E",100,"MISA810907T8A","MISA810907MGTRLL02","ALICIA MIRANDA SALAZAR","ADMINISTRATIVO ESPECIALIZADO",35,83101,1,7,15,"A01803",0,152,2,null,null,null,26328,0]
[null,"GUANAJUATO","11EBS0027E",100,"MISR800307LH4","MISR800307MGTRLS07","ROSAURA MIRANDA SALAZAR","ANALISTA ADMINISTRATIVO",35,83101,1,7,15,"A01806",0,4232,2,null,null,null,34550,0]
[null,"GUANAJUATO","11EBS0027E",100,"MOCK900306NE6","MOCK900306MDFRSR15","KAREN ANEL MORENO CASTILLO","TECNICO DOCENTE",35,83101,1,5,12,"T03820",0,1228,2,null,null,null,35205,0]
[null,"GUANAJUATO","11EBS0027E",100,"MOGC720409SJ9","MOGC720409MGTJZL04","CLAUDIA ELISA MOJICA GUZMAN","TECNICO DOCENTE",35,83101,1,7,27,"T03820",0,2819,2,null,null,null,37722,0]
[null,"GUANAJUATO","11EBS0027E",100,"MOHC8308189E4","MOHC830818MGTRRL03","CLAUDIA GABRIELA MORENO HERNANDEZ","TECNICO DOCENTE",35,83101,1,7,27,"T03820",0,17,2,null,null,null,5377,0]
[null,"GUANAJUATO","11EBS0027E",100,"MOPS740919966","MOPS740919MMCRRL01","SILVIA MORENO PARADA","ESPECIALISTA EN PROYECTOS TECNICOS",35,83101,1,7,25,"T03810",0,4512,2,null,null,null,26722,0]
[null,"GUANAJUATO","11EBS0027E",100,"MOSR650129V62","MOSR650129MGTRNF09","MA. DEL REFUGIO MORONES SANCHEZ","TECNICO DOCENTE",35,83101,1,7,27,"T03820",0,914,2,null,null,null,37884,0]
[null,"GUANAJUATO","11EBS0027E",100,"MUHD640208LB9","MUHD640208MDFXRL08","MARIA DOLORES MUÑOZ HERRERA","TECNICO DOCENTE",35,83101,1,7,27,"T03820",0,3030,2,null,null,null,40272,0]
[null,"GUANAJUATO","11EBS0027E",100,"NADP821016J68","NADP821016MGTVRL01","MARIA DEL PILAR NAVARRO DURAN","TECNICO DOCENTE",35,83101,1,7,27,"T03820",0,229,2,null,null,null,32262,0]
[null,"GUANAJUATO","11EBS0027E",100,"NAHL730801RV8","NAHL730801MGTVRR01","MARIA DE LOURDES NAVARRO HERNANDEZ","JEFE DE OFICINA",35,83101,1,7,14,"A01807",0,262,2,null,null,null,34281,0]
[null,"GUANAJUATO","11EBS0027E",100,"NAMR8410165H3","NAMR841016MGTVRS07","ROSALINDA NAVARRO MARTINEZ","TECNICO MEDIO",35,83101,1,7,18,"T03803",0,92,2,null,null,null,26919,0]
[null,"GUANAJUATO","11EBS0027E",100,"NAMS5306098W6","NAMS530609MGTRRL00","SILVIA LAURA NARVAEZ MORA","TECNICO DOCENTE",35,83101,1,7,16,"T03820",0,1619,2,null,null,null,40068,0]
[null,"GUANAJUATO","11EBS0027E",100,"NEAC740715LD9","NEAC740715HGTGRR02","CRISTOBAL NEGRETE ARIAS","TECNICO DOCENTE",35,83101,1,7,20,"T03820",0,1990,2,null,null,null,41040,0]
[null,"GUANAJUATO","11EBS0027E",100,"NEGM641224M74","NEGM641224MGTGVR06","MARTINA NEGRETE GOVEA","TECNICO DOCENTE",35,83101,1,7,13,"T03820",0,2894,2,null,null,null,34050,0]
[null,"GUANAJUATO","11EBS0027E",100,"NEPR690831KW1","NEPR690831HGTGDM08","RAMON GUILLERMO NEGRETE PADRON","TECNICO DOCENTE",35,83101,1,7,13,"T03820",0,264,2,null,null,null,37656,0]
[null,"GUANAJUATO","11EBS0027E",100,"NIJV910312FZ6","NIJV910312HDFTSC07","VICTOR DAVID NIETO JASSO","JEFE DE DEPARTAMENTO",40,83101,1,5,12,"CF01059",0,133,5,null,null,null,52836,0]
[null,"GUANAJUATO","11EBS0027E",100,"OEAJ730613983","OEAJ730613HDFBGN02","JUAN CARLOS OBREGON AGUINACO","TECNICO DOCENTE",35,83101,1,7,15,"T03820",0,1614,2,null,null,null,10754,0]
[null,"GUANAJUATO","11EBS0027E",100,"OEGL8003134Z8","OEGL800313MGTRMR09","LAURA AMERICA ORTEGA GAMIÑO","COORD. DE SERVICIOS ESP.",35,83101,1,9,51,"CF33849",0,2701,2,null,null,null,46860,0]
[null,"GUANAJUATO","11EBS0027E",100,"OELM6606116J8","OELM660611MGTRRR05","MARTINA ORNELAS LARA","TECNICO MEDIO",35,83101,1,7,13,"T03803",0,114,2,null,null,null,4488,0]
[null,"GUANAJUATO","11EBS0027E",100,"OEMJ730208CX6","OEMM730208HGTJDR00","J. MERCED OJEDA MEDINA","TECNICO DOCENTE",35,83101,1,7,13,"T03820",0,299,2,null,null,null,37884,0]
[null,"GUANAJUATO","11EBS0027E",100,"OESD9012116A0","OESD901211MGTRVL05","DOLORES GUADALUPE ORTEGA SAAVEDRA","TECNICO MEDIO",35,83101,1,7,14,"T03803",0,42,2,null,null,null,26328,0]
[null,"GUANAJUATO","11EBS0027E",100,"OIAH870824AG4","OIAH870824HGTVLG02","HUGO ADRIAN OVIEDO ALVARADO","TECNICO DOCENTE",35,83101,1,7,18,"T03820",0,14,2,null,null,null,26885,0]
[null,"GUANAJUATO","11EBS0027E",100,"OOPM650124AG1","OOPM650124HGTRRG05","MIGUEL OROZCO PEREZ","TECNICO DOCENTE",35,83101,1,7,16,"T03820",0,413,2,null,null,null,42060,0]
[null,"GUANAJUATO","11EBS0027E",100,"PACL700401SI9","PACL700401MGTRHR04","LAURA PRADO CHAVEZ","ANALISTA ADMINISTRATIVO",35,83101,1,7,13,"A01806",0,388,2,null,null,null,36450,0]
[null,"GUANAJUATO","11EBS0027E",100,"PACM931219CM1","PACM931219MDGLBY03","MAYLEN NOEMI PLASCENCIA CABRERA","SECRETARIA \"C\"",35,83101,1,7,41,"A03804",0,602,2,null,null,null,26919,0]
[null,"GUANAJUATO","11EBS0027E",100,"PACP681127IL7","PACP681127MGTRHT00","PATRICIA PRADO CHAVEZ","SECRETARIA \"C\"",35,83101,1,7,27,"A03804",0,25,2,null,null,null,41205,0]
[null,"GUANAJUATO","11EBS0027E",100,"PAEB921210T37","PAEB921210HCHLNR04","BRIAN KEDWIN PALOMINO ENRIQUEZ","SECRETARIA EJECUTIVA \"B\"",35,83101,1,9,52,"CF04807",0,34,2,null,null,null,24750,0]
[null,"GUANAJUATO","11EBS0027E",100,"PAGG860302DX9","PAGG860302MDFDRB08","GABRIELA PADILLA GUERRERO","ESPECIALISTA EN PROYECTOS TECNICOS",35,83101,1,7,33,"T03810",0,369,2,null,null,null,30039,0]
[null,"GUANAJUATO","11EBS0027E",100,"PAGT5911092P8","PAGT591109HGTLRD01","TEODORO PALMERIN GARCIA","TECNICO DOCENTE",35,83101,1,7,16,"T03820",0,2211,2,null,null,null,42555,0]
[null,"GUANAJUATO","11EBS0027E",100,"PAQF701109SJ2","PAQF701109HGTRNL00","FILEMON PAREDON QUINTERO","TECNICO DOCENTE",35,83101,1,7,19,"T03820",0,2780,2,null,null,null,40611,0]
[null,"GUANAJUATO","11EBS0027E",100,"PECA660503AR0","PECA660503MGTRBN07","ANTONIA PEREZ CABELLO","ESPECIALISTA EN PROYECTOS TECNICOS",35,83101,1,7,20,"T03810",0,129,2,null,null,null,34724,0]
[null,"GUANAJUATO","11EBS0027E",100,"PECC830605V49","PECC830605MNEXSN04","CINTHYA PEÑALOZA CISNEROS","JEFE DE OFICINA",35,83101,1,7,42,"A01807",0,156,2,null,null,null,33105,0]
[null,"GUANAJUATO","11EBS0027E",100,"PEDM7406101Q5","PEDM740610MDFRMR01","MARGARITA PERALTA DOMINGUEZ","TECNICO DOCENTE",35,83101,1,7,14,"T03820",0,2562,2,null,null,null,38880,0]
[null,"GUANAJUATO","11EBS0027E",100,"PEEM590530399","PEEM590530HDFRSN06","MANUEL ANGEL PEREZ ESCAMILLA","TECNICO DOCENTE",35,83101,1,7,29,"T03820",0,3292,2,null,null,null,42060,0]
[null,"GUANAJUATO","11EBS0027E",100,"PEGH8706085G5","PEGH870608HGTDNM01","JOSE HUMBERTO PEDROZA GONZALEZ","JEFE DE OFICINA",35,83101,1,2,4,"A01807",0,297,2,null,null,null,18532,0]
[null,"GUANAJUATO","11EBS0027E",100,"PEGL800121UG2","PEGL800121MGTRNR07","LAURA PALOMA PEREZ GONZALEZ","JEFE DE OFICINA",35,83101,1,7,15,"A01807",0,326,2,null,null,null,23165,0]
[null,"GUANAJUATO","11EBS0027E",100,"PEJR701210KIA","PEJR701210HSLRRB08","RUBEN PEREZ JUAREZ","JEFE DE DEPARTAMENTO",40,83101,1,9,52,"CF01059",0,52,5,null,null,null,51640,0]
[null,"GUANAJUATO","11EBS0027E",100,"PELL620125LZ0","PELL620125MVZRLR03","MARIA DE LOURDES PEREZ LLANOS","TECNICO DOCENTE",35,83101,1,7,15,"T03820",0,1096,2,null,null,null,38082,0]
[null,"GUANAJUATO","11EBS0027E",100,"PERK9310249I6","PERK931024MGTRCR03","KARLA FERNANDA PEREZ ROCHA","TECNICO DOCENTE",35,83101,1,7,15,"T03820",0,2665,2,null,null,null,26885,0]
[null,"GUANAJUATO","11EBS0027E",100,"PETL870430KW3","PETL870430MMNRPZ02","LUZ MARIA PEREZ TAPIA","ADMINISTRATIVO ESPECIALIZADO",35,83101,1,9,53,"A01803",0,30,2,null,null,null,26328,0]
[null,"GUANAJUATO","11EBS0027E",100,"PIEA861225MB2","PIEA861225MGTCSL06","ALMA ROSA PICHARDO ESTRADA","TECNICO DOCENTE",35,83101,1,7,30,"T03820",0,703,2,null,null,null,10754,0]
[null,"GUANAJUATO","11EBS0027E",100,"PITJ930828Q89","PITJ930828HGTCRN07","JONATHAN EDUARDO PICON TORRES","ESPECIALISTA EN PROYECTOS TECNICOS",35,83101,1,8,44,"T03810",0,28,2,null,null,null,26919,0]
[null,"GUANAJUATO","11EBS0027E",100,"POLH650106FW2","POLH650106HDFZPG03","HUGO POZADA LOPEZ","COORDINADOR DE ZONA",40,83101,1,1,54,"CF36014",0,82,5,null,null,null,63048,0]
[null,"GUANAJUATO","11EBS0027E",100,"QUCL890311NE9","QUCL890311HGTNNS07","LUIS ALBERTO QUINTINO CINTORA","TECNICO DOCENTE",35,83101,1,7,25,"T03820",0,942,2,null,null,null,32262,0]
[null,"GUANAJUATO","11EBS0027E",100,"QULC671003EH8","QULC671003MDFRPL03","CLAUDIA REYNA QUIROZ LOPEZ","TECNICO DOCENTE",35,83101,1,7,16,"T03820",0,2177,2,null,null,null,40238,0]
[null,"GUANAJUATO","11EBS0027E",100,"RAAG660220BC0","RAAG660220MGTMVD07","MA. GUADALUPE RUTH RAMOS AVILA","TECNICO DOCENTE",35,83101,1,7,35,"T03820",0,327,2,null,null,null,46672,0]
[null,"GUANAJUATO","11EBS0027E",100,"RACR700730AH9","RACR700730MGTZNB06","REBECA RAZO CANO","TECNICO DOCENTE",35,83101,1,7,20,"T03820",0,2702,2,null,null,null,13290,0]
[null,"GUANAJUATO","11EBS0027E",100,"RADL770820MV0","RADL770820HGTMZS07","LUIS ALEJANDRO RAMIREZ DIAZ","ANALISTA ADMINISTRATIVO",35,83101,1,9,52,"A01806",0,420,2,null,null,null,8934,0]
[null,"GUANAJUATO","11EBS0027E",100,"RAGM9005156P3","RAGM900515MGTMJN01","MONICA SAMANTHA RAMOS GOUJON","COORD. DE SERVICIOS ESP.",35,83101,1,2,4,"CF33849",0,373,2,null,null,null,34068,0]
[null,"GUANAJUATO","11EBS0027E",100,"RAJC810331LAA","RAJC810331MGTMRL02","CLAUDIA JACQUELINE RAMIREZ JARAMILLO","TECNICO MEDIO",35,83101,1,7,27,"T03803",0,10,2,null,null,null,40717,0]
[null,"GUANAJUATO","11EBS0027E",100,"RAJR920212P12","RAJR920212HGTMRB07","ROBERTO RAMIREZ JUAREZ","TECNICO DOCENTE",35,83101,1,7,18,"T03820",0,2174,2,null,null,null,26885,0]
[null,"GUANAJUATO","11EBS0027E",100,"RALE870501NL5","RALE870501MGTMYL02","MARIA ELENA RAMOS LOYOLA","TECNICO DOCENTE",35,83101,1,7,30,"T03820",0,118,2,null,null,null,32262,0]
[null,"GUANAJUATO","11EBS0027E",100,"RAMD681211IP3","RAMD681211HMCMRN05","DANIEL RAMIREZ MARTINEZ","TECNICO DOCENTE",35,83101,1,7,18,"T03820",0,1567,2,null,null,null,41304,0]
[null,"GUANAJUATO","11EBS0027E",100,"RAML6801057F2","RAML680105MMNMCN00","LINDA RAMIREZ MACEDO","TECNICO DOCENTE",35,83101,1,7,13,"T03820",0,468,2,null,null,null,37884,0]
[null,"GUANAJUATO","11EBS0027E",100,"RAOM680518SX1","RAOM680518MMNNCR06","MARIBEL RANGEL OCHOA","JEFE DE OFICINA",35,83101,1,5,12,"A01807",0,174,2,null,null,null,36250,0]
[null,"GUANAJUATO","11EBS0027E",100,"RARC7011229A3","RARC701122MGTNDR00","MA. CARLOTA PATRICIA RANGEL RODRIGUEZ","TECNICO DOCENTE",35,83101,1,7,14,"T03820",0,1926,2,null,null,null,39672,0]
[null,"GUANAJUATO","11EBS0027E",100,"RARC7301176A2","RARC730117MGTMVR07","MA. CARINA ALEJANDRA RAMIREZ RIVAS","TECNICO DOCENTE",35,83101,1,7,14,"T03820",0,2815,2,null,null,null,37128,0]
[null,"GUANAJUATO","11EBS0027E",100,"RASE881027V79","RASE881027MGTMNL08","ELIA PATRICIA RAMIREZ SANCHEZ","ESPECIALISTA EN PROYECTOS TECNICOS",35,83101,1,7,13,"T03810",0,466,2,null,null,null,8776,0]
[null,"GUANAJUATO","11EBS0027E",100,"RATR611023E56","RATR611023MGTMRS03","ROSA MAGDALENA RAMIREZ TRONCOSO","TECNICO DOCENTE",35,83101,1,7,41,"T03820",0,66,2,null,null,null,43050,0]
[null,"GUANAJUATO","11EBS0027E",100,"REFE870611H65","REFE870611HGTYNL02","ELI JUAN RUBEN REYES FUENTES","TECNICO SUPERIOR",35,83101,1,2,4,"T03823",0,681,2,null,null,null,31352,0]
[null,"GUANAJUATO","11EBS0027E",100,"REGJ781111QG6","REGJ781111HGTYRN09","JUAN MANUEL REYES GUERRERO","JEFE DE DEPARTAMENTO",40,83101,1,7,41,"CF01059",0,361,5,null,null,null,74658,0]
[null,"GUANAJUATO","11EBS0027E",100,"REPC540808QI9","REPC540808MGTNRN06","MARIA CONCEPCION RENTERIA PEREZ","TECNICO DOCENTE",35,83101,1,5,12,"T03820",0,1339,2,null,null,null,45117,0]
[null,"GUANAJUATO","11EBS0027E",100,"RERR850915EW0","RERR850915HGTGDY04","JOSE REYES REGALADO RODRIGUEZ","TECNICO DOCENTE",35,83101,1,7,15,"T03820",0,77,2,null,null,null,32262,0]
[null,"GUANAJUATO","11EBS0027E",100,"RICR7705149U3","RICR770514HGTVRB05","ROBERTO CARLOS RIVERA CORONILLA","TECNICO DOCENTE",35,83101,1,7,18,"T03820",0,2934,2,null,null,null,40512,0]
[null,"GUANAJUATO","11EBS0027E",100,"RILM750601TH0","RILM750601MOCSSG04","MAGDALENA RIOS LUIS","TECNICO DOCENTE",35,83101,1,7,17,"T03820",0,531,2,null,null,null,32262,0]
[null,"GUANAJUATO","11EBS0027E",100,"RIRJ650926ED3","RIRJ650926HGTCMX07","J.JESUS RICO RAMIREZ","ANALISTA ADMINISTRATIVO",35,83101,1,8,44,"A01806",0,115,2,null,null,null,32349,0]
[null,"GUANAJUATO","11EBS0027E",100,"RIRS751216TU4","RIRS751216MDFSMN07","SONIA RIOS RAMOS","TECNICO DOCENTE",35,83101,1,7,35,"T03820",0,2558,2,null,null,null,37656,0]
[null,"GUANAJUATO","11EBS0027E",100,"RIRZ9005014I8","RIRZ900501MMCCJZ06","ZAZIL RICO ROJAS","TECNICO MEDIO",35,83101,1,7,29,"T03803",0,22,2,null,null,null,26919,0]
[null,"GUANAJUATO","11EBS0027E",100,"ROAS750805HA3","ROAS750805HGTDRR01","SERGIO RODRIGUEZ ARANDA","JEFE DE OFICINA",35,83101,1,2,4,"A01807",0,469,2,null,null,null,18532,0]
[null,"GUANAJUATO","11EBS0027E",100,"ROBC900904U49","ROBC900904MDFCZT03","CITLALLIN MARGARITA ROCHA BAEZA","COORD. DE SERVICIOS ESP.",35,83101,1,2,4,"CF33849",0,296,2,null,null,null,42896,0]
[null,"GUANAJUATO","11EBS0027E",100,"ROGA8911109P7","ROGA891110MMNJRN09","MARIA DE LOS ANGELES ROJAS GARCIA","COORD. DE SERVICIOS ESP.",35,83101,1,5,12,"CF33849",0,90,2,null,null,null,34068,0]
[null,"GUANAJUATO","11EBS0027E",100,"ROHG921225D70","ROHG921225MGTDRL00","GLORIA LORENA BEATRIZ RODRIGUEZ HERNANDEZ","SECRETARIA \"C\"",35,83101,1,7,42,"A03804",0,3741,2,null,null,null,4388,0]
[null,"GUANAJUATO","11EBS0027E",100,"ROJJ671130GY1","ROJJ671130HGTDMS06","JOSE RODRIGUEZ JIMENEZ","TECNICO DOCENTE",35,83101,1,7,17,"T03820",0,1322,2,null,null,null,39474,0]
[null,"GUANAJUATO","11EBS0027E",100,"ROLA760606566","ROLA760606HGTJPN03","JOSE ANTONIO ROJAS LOPEZ","TECNICO DOCENTE",35,83101,1,7,19,"T03820",0,1162,2,null,null,null,39540,0]
[null,"GUANAJUATO","11EBS0027E",100,"ROPE881009G46","ROPE881009MGTDRV05","EVELIN GUADALUPE RODRIGUEZ PEREZ","TECNICO DOCENTE",35,83101,1,7,14,"T03820",0,1431,2,null,null,null,32262,0]
[null,"GUANAJUATO","11EBS0027E",100,"ROPP680417AU8","ROPP680417MGTDRT05","PATRICIA RODRIGUEZ PEREZ","TECNICO DOCENTE",35,83101,1,7,13,"T03820",0,2715,2,null,null,null,40102,0]
[null,"GUANAJUATO","11EBS0027E",100,"RORC700828A28","RORC700828MGTMML06","CLAUDIA IMELDA ROMERO RAMOS","TECNICO DOCENTE",35,83101,1,7,15,"T03820",0,459,2,null,null,null,39078,0]
[null,"GUANAJUATO","11EBS0027E",100,"RORD790510T10","RORD790510MGTMML09","DULCE MARIA ROMERO RAMIREZ","TECNICO DOCENTE",35,83101,1,7,13,"T03820",0,276,2,null,null,null,32262,0]
[null,"GUANAJUATO","11EBS0027E",100,"ROSJ600516BL3","ROSJ600516MGTBNN05","JUANA ROBLES SANTANA","TECNICO DOCENTE",35,83101,1,7,14,"T03820",0,1952,2,null,null,null,40305,0]
[null,"GUANAJUATO","11EBS0027E",100,"ROSR7704116C6","ROSR770411MGTDLS01","MARIA DEL ROSARIO RODRIGUEZ SALGADO","TECNICO DOCENTE",35,83101,1,7,27,"T03820",0,1104,2,null,null,null,46672,0]
[null,"GUANAJUATO","11EBS0027E",100,"ROVK831026QX5","ROVK831026MGTSZR01","MARIA KARINA ROSAS VAZQUEZ","TECNICO DOCENTE",35,83101,1,7,28,"T03820",0,2880,2,null,null,null,32262,0]
[null,"GUANAJUATO","11EBS0027E",100,"ROVR580704ND4","ROVR580704HVZXLB09","ROBERTO ROA VELAZQUEZ","COORDINADOR DE ZONA",40,83101,1,7,24,"CF36014",0,472,5,null,null,null,68832,0]
[null,"GUANAJUATO","11EBS0027E",100,"SAAP650303N74","SAAP650303MGTNLT02","PATRICIA SANCHEZ ALVARADO","ESPECIALISTA EN PROYECTOS TECNICOS",35,83101,1,7,27,"T03810",0,286,2,null,null,null,33927,0]
[null,"GUANAJUATO","11EBS0027E",100,"SACA4609287F8","SACA460928MGTNRL03","MA. ALEJANDRINA CARMEN SANCHEZ CARRASCO","ESPECIALISTA EN PROYECTOS TECNICOS",35,83101,1,7,16,"T03810",0,214,2,null,null,null,34281,0]
[null,"GUANAJUATO","11EBS0027E",100,"SACM760716KV0","SACM760716MJCNSN08","MONICA DEL CARMEN SANDOVAL CASTELLON","ANALISTA ADMINISTRATIVO",35,83101,1,8,44,"A01806",0,8,2,null,null,null,38294,0]
[null,"GUANAJUATO","11EBS0027E",100,"SAES9003201Z8","SAES900320MGTLSL08","SELMA ALEJANDRA SALDAÑA ESTRADA","JEFE DE OFICINA",35,83101,1,8,44,"A01807",0,501,2,null,null,null,23165,0]
[null,"GUANAJUATO","11EBS0027E",100,"SAME750520NR8","SAME750520MGTNJR05","ERIKA SANCHEZ MEJIA","TECNICO DOCENTE",35,83101,1,7,41,"T03820",0,192,2,null,null,null,34542,0]
[null,"GUANAJUATO","11EBS0027E",100,"SAMM750910419","SAMM750910MGTCRR00","MERCEDES ELENA SAUCEDO MORENO","TECNICO DOCENTE",35,83101,1,7,24,"T03820",0,54,2,null,null,null,39309,0]
[null,"GUANAJUATO","11EBS0027E",100,"SAPA740111LK4","SAPA740111HOCNCB03","ABDON SANDOVAL PACHECO","COORDINADOR DE ZONA",40,83101,1,7,42,"CF36014",0,2222,5,null,null,null,45436,0]
[null,"GUANAJUATO","11EBS0027E",100,"SEER810904RN6","SEER810904HGTRSF07","RAFAEL SERRATO ESPINOSA","JEFE DE OFICINA",35,83101,1,7,25,"A01807",0,191,2,null,null,null,33788,0]
[null,"GUANAJUATO","11EBS0027E",100,"SEGE921103JEA","SEGE921103MMNRRS05","ESTEFANIA SERRATO GARCIA","TECNICO MEDIO",35,83101,1,7,35,"T03803",0,29,2,null,null,null,26919,0]
[null,"GUANAJUATO","11EBS0027E",100,"SIHC930621FS8","SIHC930621MGTLRR01","CARMEN LAURA SILVA HERNANDEZ","ADMINISTRATIVO ESPECIALIZADO",35,83101,1,9,51,"A01803",0,41,2,null,null,null,21940,0]
[null,"GUANAJUATO","11EBS0027E",100,"SOBF761123PU9","SOBF761123HGTLRR07","FRANCISCO SOLORZANO BERNAL","TECNICO DOCENTE",35,83101,1,7,15,"T03820",0,4411,2,null,null,null,32262,0]
[null,"GUANAJUATO","11EBS0027E",100,"SOSM750119S26","SOSM750119MGTRTR02","MARTHA SORIA SOTO","ANALISTA ADMINISTRATIVO",35,83101,1,7,19,"A01806",0,3701,2,null,null,null,34163,0]
[null,"GUANAJUATO","11EBS0027E",100,"TAML5306213J5","TAML530621HGTPRS02","JOSE LUIS TAPIA MARTINEZ","SECRETARIA \"C\"",35,83101,1,9,52,"A03804",0,315,2,null,null,null,31179,0]
[null,"GUANAJUATO","11EBS0027E",100,"TEMY831012PC7","TEMY831012MGTRDD05","YADIRA ELISA TERAN MEDINA","OFICIAL DE SERVICIOS Y MANTEN.",35,83101,1,7,16,"S01803",0,150,2,null,null,null,32301,0]
[null,"GUANAJUATO","11EBS0027E",100,"TESR910120NP3","TESR910120MGTRLS09","MARIA DEL ROSARIO TERAN SALAZAR","TECNICO DOCENTE",35,83101,1,7,19,"T03820",0,2029,2,null,null,null,10754,0]
[null,"GUANAJUATO","11EBS0027E",100,"TOAN630405S63","TOXA630405HGTLXN01","JOSE ANTONIO TOLENTINO ","TECNICO DOCENTE",35,83101,1,7,17,"T03820",0,295,2,null,null,null,39708,0]
[null,"GUANAJUATO","11EBS0027E",100,"TOFF601228BV5","TOFF601228HGTRGR04","FRANCISCO JAVIER TORRES FIGUEROA","TECNICO DOCENTE",35,83101,1,7,27,"T03820",0,892,2,null,null,null,32262,0]
[null,"GUANAJUATO","11EBS0027E",100,"TOFM860110TE7","TOFM860110MGTRNR00","MARTHA EDITH TORRES FUENTES","TECNICO DOCENTE",35,83101,1,7,42,"T03820",0,972,2,null,null,null,31204,0]
[null,"GUANAJUATO","11EBS0027E",100,"TOMG850829D80","TOMG850829HGTRRD08","JOSE GUADALUPE DE LA TORRE MARQUEZ","OFICIAL DE SERVICIOS Y MANTEN.",35,83101,1,7,27,"S01803",0,146,2,null,null,null,32121,0]
[null,"GUANAJUATO","11EBS0027E",100,"TONL701209CT8","TONL701209MGTRCR09","LAURA MA GUADALUPE TORRES NACHE","COORD. DE SERVICIOS ESP.",35,83101,1,7,27,"CF33849",0,532,2,null,null,null,60447,0]
[null,"GUANAJUATO","11EBS0027E",100,"TOSH760727J54","TOSH760727HGTRNC04","HECTOR DANIEL TORRES SAENEZ","TECNICO DOCENTE",35,83101,1,7,13,"T03820",0,119,2,null,null,null,37128,0]
[null,"GUANAJUATO","11EBS0027E",100,"UORV800303CD1","UORV800303MGTLNR08","VERONICA ULLOA RANGEL","SECRETARIA \"C\"",35,83101,1,1,3,"A03804",0,91,2,null,null,null,29551,0]
[null,"GUANAJUATO","11EBS0027E",100,"VAGL591217DU7","VAGL591217MGTRRL06","LILIA VARGAS GARCIDUEÑAS","TECNICO DOCENTE",35,83101,1,7,15,"T03820",0,69,2,null,null,null,43050,0]
[null,"GUANAJUATO","11EBS0027E",100,"VALF830903IU4","VALF830903HGTLNR07","FRANCISCO JAVIER VALDEZ LANDIN","TECNICO DOCENTE",35,83101,1,7,13,"T03820",0,766,2,null,null,null,32988,0]
[null,"GUANAJUATO","11EBS0027E",100,"VAMM8611122V7","VAMM861112MGTZCY00","MAYRA VAZQUEZ MACARENA","ESPECIALISTA EN PROYECTOS TECNICOS",35,83101,1,7,28,"T03810",0,144,2,null,null,null,26919,0]
[null,"GUANAJUATO","11EBS0027E",100,"VAPM701212VE4","VAPG701212MGTLRD04","MA. GUADALUPE VALADEZ PEREZ","TECNICO MEDIO",35,83101,1,7,41,"T03803",0,344,2,null,null,null,26919,0]
[null,"GUANAJUATO","11EBS0027E",100,"VAPR690730J94","VAPR690730MGTZNS03","ROSA LAURA VAZQUEZ PONCE","JEFE DE OFICINA",35,83101,1,7,19,"A01807",0,261,2,null,null,null,37761,0]
[null,"GUANAJUATO","11EBS0027E",100,"VAQE630516EZ8","VAQE630516MGTRVS07","ESTHELA VARGAS QUEVEDO","JEFE DE OFICINA",35,83101,1,7,41,"A01807",0,2231,2,null,null,null,36405,0]
[null,"GUANAJUATO","11EBS0027E",100,"VAQG581212JV2","VAQG581212HGTLJD08","J. GUADALUPE VALENCIA QUIJAS","TECNICO DOCENTE",35,83101,1,7,41,"T03820",0,511,2,null,null,null,39312,0]
[null,"GUANAJUATO","11EBS0027E",100,"VARA570811AR0","VARA570811MVZLDN06","ANA YOLANDA VALERIO RODRIGUEZ","TECNICO DOCENTE",35,83101,1,7,27,"T03820",0,2812,2,null,null,null,37755,0]
[null,"GUANAJUATO","11EBS0027E",100,"VARA71012288A","VARA710122MGTRMN01","MARIA DE LOS ANGELES VARGAS RAMIREZ","TECNICO DOCENTE",35,83101,1,7,17,"T03820",0,1655,2,null,null,null,41064,0]
[null,"GUANAJUATO","11EBS0027E",100,"VARJ8610196J7","VARJ861019HGTZMV06","JAVIER ALEJANDRO VAZQUEZ RAMIREZ","SECRETARIA \"C\"",35,83101,1,1,3,"A03804",0,81,2,null,null,null,26328,0]
[null,"GUANAJUATO","11EBS0027E",100,"VARL750211VB2","VARL750211MGTRMR07","MARIA LOURDES VARGAS RAMIREZ","JEFE DE OFICINA",35,83101,1,7,17,"A01807",0,345,2,null,null,null,35409,0]
[null,"GUANAJUATO","11EBS0027E",100,"VATL701230M12","VATL701230MGTLRZ04","LUZ MARIA VALLE TORRES","ESPECIALISTA EN PROYECTOS TECNICOS",35,83101,1,7,15,"T03810",0,2482,2,null,null,null,26722,0]
[null,"GUANAJUATO","11EBS0027E",100,"VECE760116MWA","VECE760116HCSLSD09","EDIES VELASCO CASANOVA","COORDINADOR DE ZONA",40,83101,1,7,33,"CF36014",0,46,5,null,null,null,45436,0]
[null,"GUANAJUATO","11EBS0027E",100,"VEPE671201NI6","VEPE671201MGTGRG04","MARIA EUGENIA VEGA PAREDES","TECNICO DOCENTE",35,83101,1,7,33,"T03820",0,1632,2,null,null,null,39276,0]
[null,"GUANAJUATO","11EBS0027E",100,"VERT861015NB6","VERT861015MGTRMR01","TERESA VERDE RAMIREZ","TECNICO DOCENTE",35,83101,1,7,30,"T03820",0,915,2,null,null,null,32442,0]
[null,"GUANAJUATO","11EBS0027E",100,"VEVS760824QM4","VEVS760824MGTNLL09","SILVINA ELIZABETH VENEGAS VILLALOBOS","TECNICO DOCENTE",35,83101,1,7,42,"T03820",0,2447,2,null,null,null,32262,0]
[null,"GUANAJUATO","11EBS0027E",100,"VIGO710314HSA","VIGO710314HGTLNS05","OSCAR JACOBO VILLICAÑA GONZALEZ","TECNICO DOCENTE",35,83101,1,7,41,"T03820",0,1185,2,null,null,null,36528,0]
[null,"GUANAJUATO","11EBS0027E",100,"VILR670220CZ3","VILR670220MGTLNM04","RAMONA VILLANUEVA LUNA","TECNICO DOCENTE",35,83101,1,7,43,"T03820",0,2191,2,null,null,null,42852,0]
[null,"GUANAJUATO","11EBS0027E",100,"VIMG771213D20","VIMG771213MGTLNB08","GABRIELA VILLANUEVA MENDOZA","TECNICO DOCENTE",35,83101,1,7,33,"T03820",0,570,2,null,null,null,37736,0]
[null,"GUANAJUATO","11EBS0027E",100,"VINF7009219V8","VINF700921HGTLXR06","FRANCISCO ALFONSO VILCHES NUÑEZ","TECNICO DOCENTE",35,83101,1,7,27,"T03820",0,705,2,null,null,null,41658,0]
[null,"GUANAJUATO","11EBS0027E",100,"VIPI821117493","VIPI821117MGTLLR07","IRMA VILLELA PALOMO","TECNICO DOCENTE",35,83101,1,7,29,"T03820",0,149,2,null,null,null,10754,0]
[null,"GUANAJUATO","11EBS0027E",100,"VIRM731126CL3","VIRM731126MGTLMN06","MARIA MONICA VILLANUEVA RAMIREZ","ANALISTA ADMINISTRATIVO",35,83101,1,7,35,"A01806",0,51,2,null,null,null,34748,0]
[null,"GUANAJUATO","11EBS0027E",100,"YEPV780203IU0","YEPV780203MGTBVR00","VERONICA ADRIANA YEBRA PAVON","TECNICO DOCENTE",35,83101,1,7,41,"T03820",0,1985,2,null,null,null,53668,0]
[null,"GUANAJUATO","11EBS0027E",100,"ZAGB700228KX3","ZAGB700228MGTVMT03","BEATRIZ ZAVALA GOMEZ","TECNICO DOCENTE",35,83101,1,7,25,"T03820",0,180,2,null,null,null,39474,0]
[null,"GUANAJUATO","11EBS0027E",100,"ZAGJ830623IG5","ZAGJ830623MGTVLN06","JUANA ZAVALA GALLEGOS","ANALISTA ADMINISTRATIVO",35,83101,1,7,14,"A01806",0,490,2,null,null,null,31962,0]
[null,"GUANAJUATO","11EBS0027E",100,"ZAMH6907077M4","ZAMH690707MGTVRR00","MARIA HERLINDA ZAVALA MARTINEZ","TECNICO DOCENTE",35,83101,1,7,27,"T03820",0,923,2,null,null,null,37524,0]
[null,"GUANAJUATO","11EBS0027E",100,"ZAZJ9610201D4","ZAZJ961020HQTRRN09","JONATAN REMBERTO ZARAZUA ZARAZUA","SECRETARIA \"C\"",35,83101,1,7,30,"A03804",0,137,2,null,null,null,26722,0]
[null,"Total Personas : ",337,null,null,null,null,null,null,null,null,null,null,"Total Plazas : ",null,323,null,null,"Total Pto. Federal",null,{"$f":"SUBTOTAL(109,Tabla12[Percepciones pagadas en el Periodo de Comisión con Presupuesto Federal*])","v":12080792}]
[]
[null,null,null,null,null,null,null,null,null,null,null,null,null,null,null,null,null,null,"Total Ppto. Otras Fuentes:",null,null,{"$f":"SUM(V16:V354)","v":0}]
[]
[null,"*Total de Percepciones reportadas por la Entidad Federativa como pagadas al trabajador durante la comisión."]
[null,"Fuente : Información proporcionada por las Entidades Federativas"]

{"sheet":"II D) 2","index":6,"n_rows":124,"n_cols":19,"rows_kept":124,"cut":false,"hidden":false,"merged":[[8,1,8,9],[11,0,12,0],[11,1,12,1],[11,5,12,5],[11,2,12,2],[11,3,12,3],[11,4,12,4],[11,16,12,16],[11,15,12,15],[11,17,12,17],[11,18,12,18],[11,6,11,12],[11,13,12,13],[11,14,12,14]]}
[]
[]
[]
[]
[]
[]
[]
[null,"Formato: Movimientos de Plazas"]
[null,{"$f":"IF('Caratula Resumen'!D22=\"Elige el Periodo…\",\"\",'Caratula Resumen'!D22)","v":"Fondo de Aportaciones para la Educación Tecnológica y de Adultos/Instituto Nacional para la Educación de los Adultos (FAETA/INEA)"},null,null,null,null,null,null,null,null,null,null,null,null,null,null,null,{"$f":"'A Y  II D3'!X10","v":"1er. Trimestre 2017"}]
[]
[]
[null,"Entidad Federativa","RFC","CURP","Nombre","Origen Presupuestal\n de la plazas","Clave Presupuestal",null,null,null,null,null,null,"Clave de nivel de puesto","Clave de nivel de sueldo","Zona Económica","Tipo de movimiento","Quincena Inicial","Quincena Final"]
[null,null,null,null,null,null,"Partida Presupuestal","Código de Pago","Clave de Unidad","Clave de Sub Unidad","Clave de Categoría","Horas Semana Mes ","Número de Plaza"]
[]
[null,"Entidad Federativa","RFC","CURP","Nombbre","Origen Presupuestal\n de la plazas","Partida Presupuestal","Código de Pago","Clave de Unidad","Clave de Sub Unidad","Clave de Categoría","Horas semana mes","Número de plaza","Clave de nivel de puesto","Clave de nivel de sueldo","Zona Económica","Tipo de movimiento","Quincena Inicial","Quincena Final"]
[null,"GUANAJUATO","RATR611023E56","RATR611023MGTMRS03","ROSA MAGDALENA RAMIREZ TRONCOSO",1,"831011741T0382000.000066",83101,7,41,"T03820",0,66,82,7,"B",2,201702,201702]
[null,"GUANAJUATO","RATR611023E56","RATR611023MGTMRS03","ROSA MAGDALENA RAMIREZ TRONCOSO",1,"831011741T0382000.000066",83101,7,41,"T03820",0,66,82,7,"B",1,201702,201702]
[null,"GUANAJUATO","MEGG6409203P0","MEGG640920HGTDLR04","GERARDO MEDINA GALVAN",1,"83101124A0180700.0002171",83101,2,4,"A01807",0,2171,81,5,"B",3,201702,201702]
[null,"GUANAJUATO","TAML5306213J5","TAML530621HGTPRS02","JOSE LUIS TAPIA MARTINEZ",1,"831011952A0380400.000315",83101,9,52,"A03804",0,315,43,2,"B",3,201702,201702]
[null,"GUANAJUATO","PEAR630107AT2","PEAR630107HMCXRY08","JOSE REY PEﾑA ARRIAGA",1,"831011844A0180600.0000115",83101,8,44,"A01806",0,115,70,3,"B",2,201702,201702]
[null,"GUANAJUATO","HEAE670513TV7","HEAE670513HGTRGD08","EDUARDO HERNANDEZ AGUADO",1,"831011725A0180600.000552",83101,7,25,"A01806",0,552,70,3,"B",2,201702,201702]
[null,"GUANAJUATO","POLH650106FW2","POLH650106HDFZPG03","HUGO POZADA LOPEZ",1,"831011154CF3601400.0000052",83101,1,54,"CF36014",0,52,92,"OA1","A",3,201702,201702]
[null,"GUANAJUATO","REFE870611H65","REFE870611HGTYNL02","ELI JUAN RUBEN REYES FUENTES",1,"83101124T0382300.0000681",83101,2,4,"T03823",0,681,85,7,"B",3,201702,201702]
[null,"GUANAJUATO","BEGL8709056T2","BEGL870905HGTCRS09","LUIS ALFONSO BECERRA GARCIA",1,"831011512CF3601400.000044",83101,5,12,"CF36014",0,44,92,"OA1","A",3,201702,201702]
[null,"GUANAJUATO","PAEB921210T37","PAEB921210HCHLNR04","BRIAN KEDWIN PALOMINO ENRIQUEZ",1,"831011952CF0480700.000034",83101,9,52,"CF04807",0,34,61,6,"B",1,201702,201702]
[null,"GUANAJUATO","SACL750731556","SACL750731MGTNRN08","LINDA ROSA SANCHEZ CARPIO",1,"831011733T0382000.000570",83101,7,33,"T03820",0,570,82,7,"B",1,201702,201702]
[null,"GUANAJUATO","SACL750731556","SACL750731MGTNRN08","LINDA ROSA SANCHEZ CARPIO",1,"831011733T0382000.000570",83101,7,33,"T03820",0,570,82,7,"B",2,201702,201702]
[null,"GUANAJUATO","PERK9310249I6","PERK931024MGTRCR03","KARLA FERNANDA PEREZ ROCHA",1,"831011715T0382000.002665",83101,7,15,"T03820",0,2665,82,7,"B",1,201702,201702]
[null,"GUANAJUATO","OIAH870824AG4","OIAH870824HGTVLG02","HUGO ADRIAN OVIEDO ALVARADO",1,"831011718T0382000.000014",83101,7,18,"T03820",0,14,82,7,"B",1,201702,201702]
[null,"GUANAJUATO","RAJR920212P12","RAJR920212HGTMRB07","ROBERTO RAMIREZ JUAREZ",1,"831011718T0382000.002174",83101,7,18,"T03820",0,2174,82,7,"B",1,201702,201702]
[null,"GUANAJUATO","SAES9003201Z8","SAES900320MGTLSL08","SELMA ALEJANDRA SALDAﾑA ESTRADA",1,"831011844A0180700.000501",83101,8,44,"A01807",0,501,81,5,"B",1,201702,201702]
[null,"GUANAJUATO","PEGL800121UG2","PEGL800121MGTRNR07","LAURA PALOMA PEREZ GONZALEZ",1,"831011715A0180700.000326",83101,7,15,"A01807",0,326,81,5,"B",1,201702,201702]
[null,"GUANAJUATO","SIHC930621FS8","SIHC930621MGTLRR01","CARMEN LAURA SILVA HERNANDEZ",1,"831011951A0180300.000041",83101,9,51,"A01803",0,41,29,2,"B",1,201702,201702]
[null,"GUANAJUATO","AIMF9209181C4","AIMF920918MJCVCL02","FLOR SOFIA AVILA MACIAS",1,"83101124A0180600.0000153",83101,2,4,"A01806",0,153,70,3,"B",1,201702,201702]
[null,"GUANAJUATO","JAAM880824146","JAAM880824MCLRRR06","MARISOL IBETH JARA ARRIAGA",1,"83101124A0180600.0001951",83101,2,4,"A01806",0,1951,70,3,"B",1,201702,201702]
[null,"GUANAJUATO","CAPA8005264B4","CAPA800526MGTMRN08","ANA RUTH CAMACHO PRADO",1,"83101124A0180600.000252",83101,2,4,"A01806",0,252,70,3,"B",1,201702,201702]
[null,"GUANAJUATO","GAEL7112229A0","GAEL711222MGTLSL08","LILIANA ESTHERLINA GALLARDO ESCOBEDO",1,"831011512CF3601400.0002701",83101,5,12,"CF36014",0,2701,95,"OA1","A",1,201702,201702]
[null,"GUANAJUATO","GAEL7112229A0","GAEL711222MGTLSL08","LILIANA ESTHERLINA GALLARDO ESCOBEDO",1,"831011512CF3601400.0000021",83101,5,12,"CF36014",0,21,95,"OA1","A",3,201702,201702]
[null,"GUANAJUATO","VAQE630516EZ8","VAQE630516MGTRVS07","ESTHELA VARGAS QUEVEDO",1,"831011741A0180700.0002231",83101,7,41,"A01807",0,2231,81,5,"B",3,201703,201703]
[null,"GUANAJUATO","RATR611023E56","RATR611023MGTMRS03","ROSA MAGDALENA RAMIREZ TRONCOSO",1,"831011741T0382000.000066",83101,7,41,"T03820",0,66,82,7,"B",2,201703,201703]
[null,"GUANAJUATO","RATR611023E56","RATR611023MGTMRS03","ROSA MAGDALENA RAMIREZ TRONCOSO",1,"831011741T0382000.000066",83101,7,41,"T03820",0,66,82,7,"B",1,201703,201703]
[null,"GUANAJUATO","RATR611023E56","RATR611023MGTMRS03","ROSA MAGDALENA RAMIREZ TRONCOSO",1,"831011741T0382000.000066",83101,7,41,"T03820",0,66,82,7,"B",3,201703,201703]
[null,"GUANAJUATO","AILP690120TW9","AILP690120MSPRNT09","PATRICIA DE JESUS ARCIGA LEON",1,"831011729A0180700.000169",83101,7,29,"A01807",0,169,81,5,"B",3,201703,201703]
[null,"GUANAJUATO","GOAA581209FLA","GOAA581209MGTNGL08","ALICIA GONZALEZ AGUIRRE",1,"831011741T0381000.000201",83101,7,41,"T03810",0,201,39,2,"B",3,201703,201703]
[null,"GUANAJUATO","FOQP690616QU0","FOQP690616MGTLVT01","PETRA FLORES QUEVEDO",1,"831011741T0382000.000470",83101,7,41,"T03820",0,470,82,7,"B",3,201703,201703]
[null,"GUANAJUATO","FEET711003EB8","FEET711003MGTLSR05","TERESA FELIX ESTRELLA",1,"831011741A0180600.000283",83101,7,41,"A01806",0,283,70,3,"B",3,201703,201703]
[null,"GUANAJUATO","MADT730323NL2","MADT730323MGTTVR17","TERESITA DE JESUS MATA DAVALOS",1,"831011742T0381000.000501",83101,7,42,"T03810",0,501,39,2,"B",2,201703,201703]
[null,"GUANAJUATO","HEPC690801P80","HEPC690801MGTRRR08","MA. DEL CARMEN HERNANDEZ PEREZ",1,"831011727T0382000.001221",83101,7,27,"T03820",0,1221,82,7,"B",3,201703,201703]
[null,"GUANAJUATO","HERG571023MS0","HERG571023MGTRPD07","MA. GUADALUPE JUDITH HERNANDEZ RIPALDA",1,"83101112CF3384900.000400",83101,1,2,"CF33849",0,400,88,8,"B",3,201703,201703]
[null,"GUANAJUATO","COOM721217SVA","COOM721217MGTNLN02","MA. MANUELA CONTRERAS OLMOS",1,"831011741T0382000.000207",83101,7,41,"T03820",0,207,82,7,"B",3,201703,201703]
[null,"GUANAJUATO","GARM751031J11","GARM751031HGTRMS07","MOISES GRANADOS RAMOS",1,"831011844CF3384900.000188",83101,8,44,"CF33849",0,188,88,8,"B",3,201703,201703]
[null,"GUANAJUATO","HEMM781102T78","HEMM781102MGTRNR07","MARISELA HERNANDEZ MONTOYA",1,"831011716T0382000.001530",83101,7,16,"T03820",0,1530,82,7,"B",3,201703,201703]
[null,"GUANAJUATO","COOS660919CRA","COOS660919MGTNLS08","SUSANA ISABEL CONTRERAS OLMOS",1,"831011741T0380300.0001631",83101,7,41,"T03803",0,1631,47,2,"B",3,201703,201703]
[null,"GUANAJUATO","HEEE731209HI1","HEEE731209MGTRSS09","ESMERALDA HERNANDEZ ESCOGIDO",1,"831011953CF3384900.000230",83101,9,53,"CF33849",0,230,88,8,"B",3,201703,201703]
[null,"GUANAJUATO","SACM760716KV0","SACM760716MJCNSN08","MONICA DEL CARMEN SANDOVAL CASTELLON",1,"831011844A0180600.000501",83101,8,44,"A01806",0,501,70,3,"B",3,201703,201703]
[null,"GUANAJUATO","AEPB811216AUA","AEPB811216MGTRLL03","BLANCA BERENICE ARREGUIN PALMA",1,"83101124CF3384900.000154",83101,2,4,"CF33849",0,154,88,8,"B",3,201703,201703]
[null,"GUANAJUATO","REGJ781111QG6","REGJ781111HGTYRN09","JUAN MANUEL REYES GUERRERO",1,"831011741CF0105900.0000361",83101,7,41,"CF01059",0,361,93,"OA1","A",3,201703,201703]
[null,"GUANAJUATO","OEGL8003134Z8","OEGL800313MGTRMR09","LAURA AMERICA ORTEGA GAMIﾑO",1,"831011951CF3384900.0002701",83101,9,51,"CF33849",0,2701,88,8,"B",3,201703,201703]
[null,"GUANAJUATO","TAMP860314464","TAMP860314HGTFZL09","JOSE PAUL TAFOYA MEZA",1,"831011720CF3601400.000310",83101,7,20,"CF36014",0,310,92,"OA1","A",2,201703,201703]
[null,"GUANAJUATO","CAAB610110HC5","CAAB610110MGTRRR07","BERTHA ANGELICA CARPIO ARAGON",1,"831011713T0382000.002463",83101,7,13,"T03820",0,2463,82,7,"B",2,201703,201703]
[null,"GUANAJUATO","MOMR770326563","MOMR770326HGTRRB08","ROBERTO CARLOS MORALES MURO",1,"831011952CF2186500.00013",83101,9,52,"CF21865",0,13,1,"QB","B",2,201703,201703]
[null,"GUANAJUATO","LAOJ8212131K9","LAOJ821213HGTRLS09","JESUS SAMUEL LARA OLMOS",1,"831011741T0382000.001573",83101,7,41,"T03820",0,1573,82,7,"B",3,201703,201703]
[null,"GUANAJUATO","CALM860815G43","CALM860815MJCHNY02","MAYRA CAROLINA CHAVEZ DE LEﾓN",1,"83101126CF3384900.000191",83101,2,6,"CF33849",0,191,88,8,"B",3,201703,201703]
[null,"GUANAJUATO","CALM860815G43","CALM860815MJCHNY02","MAYRA CAROLINA CHAVEZ DE LEﾓN",1,"83101126CF3384900.00013",83101,2,6,"CF33849",0,13,88,8,"B",3,201703,201703]
[null,"GUANAJUATO","CEGF8505052A9","CEGF850505HGTLTR01","FERNANDO CELEDON GUTIERREZ",1,"831011844CF0105900.0000361",83101,8,44,"CF01059",0,361,93,"OA1","A",2,201703,201703]
[null,"GUANAJUATO","JIAR5906097A6","JIAR590609HVZMNB07","ROBERTO JIMENEZ DEL ANGEL",1,"83101126CF1407000.000032",83101,2,6,"CF14070",0,32,97,"MB2","A",3,201703,201703]
[null,"GUANAJUATO","CAOD910826S90","CAOD910826MSPNRL03","DULCE VIRIDIANA CANO ORTA",1,"831011729T0381000.0000201",83101,7,29,"T03810",0,201,39,2,"B",2,201703,201703]
[null,"GUANAJUATO","POLH650106FW2","POLH650106HDFZPG03","HUGO POZADA LOPEZ",1,"831011154CF3601400.000082",83101,1,54,"CF36014",0,82,92,"OA1","A",3,201703,201703]
[null,"GUANAJUATO","COJP700317TZ9","COJP700317HMNRMD06","PEDRO CORTES JIMENEZ",1,"83101124CF3384900.000411",83101,2,4,"CF33849",0,411,88,8,"B",3,201703,201703]
[null,"GUANAJUATO","PARL850303S64","PARL850303MGTDVN02","LEONOR PADILLA RIVERA",1,"83101124CF3601400.000046",83101,2,4,"CF36014",0,46,92,"OA1","B",2,201703,201703]
[null,"GUANAJUATO","JAAX8707291Z3","JAAX870729MCLRRC03","XOCHITL YUVICELA JARA ARRIAGA",1,"831011741T0380300.0000511",83101,7,41,"T03803",0,511,47,2,"B",3,201703,201703]
[null,"GUANAJUATO","NIJV910312FZ6","NIJV910312HDFTSC07","VICTOR DAVID NIETO JASSO",1,"831011512CF0105900.000133",83101,5,12,"CF01059",0,133,93,"OA1","A",3,201703,201703]
[null,"GUANAJUATO","RARA580417NI3","RARA580417HGTMMR07","ARMANDO RAMIREZ RAMIREZ",1,"831011727T0382000.000017",83101,7,27,"T03820",0,17,82,7,"B",2,201703,201703]
[null,"GUANAJUATO","GORM961124VB9","GORM961124MGTNZC03","MICHEL YARED GONZALEZ RAZO",1,"831011720T0382000.000617",83101,7,20,"T03820",0,617,82,7,"B",2,201703,201703]
[null,"GUANAJUATO","MESE811002373","MEXS811002MGTJXL00","MARIA SELEM MEJIA ",1,"831011718T0382000.000699",83101,7,18,"T03820",0,699,82,7,"B",2,201703,201703]
[null,"GUANAJUATO","PAEB921210T37","PAEB921210HCHLNR04","BRIAN KEDWIN PALOMINO ENRIQUEZ",1,"831011952CF0480700.000034",83101,9,52,"CF04807",0,34,61,6,"B",3,201703,201703]
[null,"GUANAJUATO","OOVA830727PF3","OOVA830727MGTCZR06","ARLET OCHOA VAZQUEZ",1,"831011725CF3601400.000048",83101,7,25,"CF36014",0,48,92,"OA1","A",2,201703,201703]
[null,"GUANAJUATO","SAES9003201Z8","SAES900320MGTLSL08","SELMA ALEJANDRA SALDAﾑA ESTRADA",1,"831011844A0180700.000501",83101,8,44,"A01807",0,501,81,5,"B",3,201703,201703]
[null,"GUANAJUATO","MACB900101238","MACB900101MGTRRR07","BRENDA ARACELI MARTINEZ CRUZ",1,"83101124T0382300.000101",83101,2,4,"T03823",0,101,85,7,"B",1,201703,201703]
[null,"GUANAJUATO","PEJR701210KIA","PEJR701210HSLRRB08","RUBEN PEREZ JUAREZ",1,"831011952CF0105900.0000052",83101,9,52,"CF01059",0,52,93,"OA1","A",1,201703,201703]
[null,"GUANAJUATO","SAPA740111LK4","SAPA740111HOCNCB03","ABDON SANDOVAL PACHECO",1,"831011742CF3601400.0002222",83101,7,42,"CF36014",0,2222,92,"OA1","A",1,201703,201703]
[null,"GUANAJUATO","VECE760116MWA","VECE760116HCSLSD09","EDIES VELASCO CASANOVA",1,"831011733CF3601400.000046",83101,7,33,"CF36014",0,46,92,"OA1","B",1,201703,201703]
[null,"GUANAJUATO","GUVJ850624HM6","GUVJ850624HGTZYN02","JUAN MIGUEL GUZMAN VIEYRA",1,"831011725CF3601400.000048",83101,7,25,"CF36014",0,48,92,"OA1","A",1,201703,201703]
[null,"GUANAJUATO","DITJ760122R33","DITJ760122HGTZRN01","JUAN GABRIEL DIAZ TORRES",1,"831011720CF3601400.000310",83101,7,20,"CF36014",0,310,92,"OA1","A",1,201703,201703]
[null,"GUANAJUATO","CIRJ660404UI3","CIRJ660404HGTFMN03","JUAN SIMITRIO CIFUENTES RAMIREZ",1,"831011951CF3384900.000193",83101,9,51,"CF33849",0,193,88,8,"B",1,201703,201703]
[null,"GUANAJUATO","GAVR910621UJ2","GAVR910621HGTRLL01","RAUL ALEJANDRO GRANADOS VALLE",1,"831011735T0382000.001999",83101,7,35,"T03820",0,1999,82,7,"B",1,201703,201703]
[null,"GUANAJUATO","PEGH8706085G5","PEGH870608HGTDNM01","JOSE HUMBERTO PEDROZA GONZALEZ",1,"83101124A0180700.000297",83101,2,4,"A01807",0,297,81,5,"B",1,201703,201703]
[null,"GUANAJUATO","ROAS750805HA3","ROAS750805HGTDRR01","SERGIO RODRIGUEZ ARANDA",1,"83101124A0180700.000469",83101,2,4,"A01807",0,469,81,5,"B",1,201703,201703]
[null,"GUANAJUATO","MEGG6409203P0","MEGG640920HGTDLR04","GERARDO MEDINA GALVAN",1,"83101124A0180700.000410",83101,2,4,"A01807",0,410,81,5,"B",3,201704,201704]
[null,"GUANAJUATO","CAOE780824GY2","CAOE780824MGTSRM07","EMILIA CASTELLANO ORTEGA",1,"831011742T0380300.0003742",83101,7,42,"T03803",0,3742,47,2,"B",2,201704,201704]
[null,"GUANAJUATO","CAAB610110HC5","CAAB610110MGTRRR07","BERTHA ANGELICA CARPIO ARAGON",1,"831011713T0382000.002463",83101,7,13,"T03820",0,2463,82,7,"B",1,201704,201704]
[null,"GUANAJUATO","NIJV910312FZ6","NIJV910312HDFTSC07","VICTOR DAVID NIETO JASSO",1,"831011512CF0105900.000133",83101,5,12,"CF01059",0,133,93,"OA1","A",3,201704,201704]
[null,"GUANAJUATO","MEAG811214399","MEAG811214MGTNLD05","GUADALUPE MARGARITA MENDEZ ALCACIO",1,"83101126CF3384900.0000521",83101,2,6,"CF33849",0,521,88,8,"B",2,201704,201704]
[null,"GUANAJUATO","GAEL7112229A0","GAEL711222MGTLSL08","LILIANA ESTHERLINA GALLARDO ESCOBEDO",1,"831011512CF3601400.0000021",83101,5,12,"CF36014",0,21,95,"OA1","A",2,201704,201704]
[null,"GUANAJUATO","HUSA860811CJ2","HUSA860811MGTRRN07","MARIA DE LOS ANGELES HURTADO SUAREZ",1,"831011730A0380400.000371",83101,7,30,"A03804",0,371,43,2,"B",1,201704,201704]
[null,"GUANAJUATO","FOLI910518MEA","FOLI910518HGTLPS09","ISRAEL FLORES LOPEZ",1,"83101124T0382300.000138",83101,2,4,"T03823",0,138,85,7,"B",1,201704,201704]
[null,"GUANAJUATO","HEEI750809EB5","HEEI750809HGTRSS09","ISIDORO DE SEVILLA HERNANDEZ ESCOGIDO",1,"83101124A0180700.000457",83101,2,4,"A01807",0,457,81,5,"B",1,201704,201704]
[null,"GUANAJUATO","VIMG771213D20","VIMG771213MGTLNB08","GABRIELA VILLANUEVA MENDOZA",1,"831011733T0382000.000570",83101,7,33,"T03820",0,570,82,7,"B",3,201705,201705]
[null,"GUANAJUATO","EASG700512IU9","EASG700512MCMSNR00","GRACIELA ESCAMILLA SANCHEZ",1,"831011742A0180700.000526",83101,7,42,"A01807",0,526,81,5,"B",3,201705,201705]
[null,"GUANAJUATO","RACR700730AH9","RACR700730MGTZNB06","REBECA RAZO CANO",1,"831011720T0382000.0002702",83101,7,20,"T03820",0,2702,82,7,"B",1,201705,201705]
[null,"GUANAJUATO","CUFC8809064X4","CUFC880906MOCRNY08","CYNTHIA CRUZ FUENTES",1,"831011713A0380400.000171",83101,7,13,"A03804",0,171,43,2,"B",3,201705,201705]
[null,"GUANAJUATO","VIPI821117493","VIPI821117MGTLLR07","IRMA VILLELA PALOMO",1,"831011729T0382000.000149",83101,7,29,"T03820",0,149,82,7,"B",1,201705,201705]
[null,"GUANAJUATO","TESR910120NP3","TESR910120MGTRLS09","MARIA DEL ROSARIO TERAN SALAZAR",1,"831011719T0382000.002029",83101,7,19,"T03820",0,2029,82,7,"B",1,201705,201705]
[null,"GUANAJUATO","OEAJ730613983","OEAJ730613HDFBGN02","JUAN CARLOS OBREGON AGUINACO",1,"831011715T0382000.001614",83101,7,15,"T03820",0,1614,82,7,"B",1,201705,201705]
[null,"GUANAJUATO","PIEA861225MB2","PIEA861225MGTCSL06","ALMA ROSA PICHARDO ESTRADA",1,"831011730T0382000.000703",83101,7,30,"T03820",0,703,82,7,"B",1,201705,201705]
[null,"GUANAJUATO","RADL770820MV0","RADL770820HGTMZS07","LUIS ALEJANDRO RAMIREZ DIAZ",1,"831011952A0180600.000420",83101,9,52,"A01806",0,420,70,3,"B",1,201705,201705]
[null,"GUANAJUATO","RASE881027V79","RASE881027MGTMNL08","ELIA PATRICIA RAMIREZ SANCHEZ",1,"831011713T0381000.000466",83101,7,13,"T03810",0,466,39,2,"B",1,201705,201705]
[null,"GUANAJUATO","GOLC950116TN4","GOLC950116HGTMPR09","CARLOS ADEMIR EUSEBIO GOMEZ LOPEZ",1,"831011952A0380400.0002171",83101,9,52,"A03804",0,2171,43,2,"B",1,201705,201705]
[null,"GUANAJUATO","HESJ680622CM5","HESJ680622HGTRLS06","JOSE DE JESUS HERNANDEZ SALAZAR",1,"831011512CF3601400.0000021",83101,5,12,"CF36014",0,21,95,"OA1","A",1,201705,201705]
[null,"GUANAJUATO","RIRJ650926ED3","RIRJ650926HGTCMX07","J.JESUS RICO RAMIREZ",1,"831011844A0180600.0000115",83101,8,44,"A01806",0,115,70,3,"B",3,201706,201706]
[null,"GUANAJUATO","MOTE6904283LA","MOTE690428MGTRRL09","ELVIRA MORALES TORRES",1,"831011724T0382000.001715",83101,7,24,"T03820",0,1715,82,7,"B",2,201706,201706]
[null,"GUANAJUATO","JAAA741109NM2","JAAA741109MGTSGL04","ALMA PATRICIA JASSO AGUILERA",1,"831011715T0382000.001779",83101,7,15,"T03820",0,1779,82,7,"B",3,201706,201706]
[null,"GUANAJUATO","GOAR790919E90","GOAR790919MGTNLS24","ROSA MARIA GONZALEZ ALEJOS",1,"831011724T0382000.000067",83101,7,24,"T03820",0,67,82,7,"B",1,201706,201706]
[null,"GUANAJUATO","MOHC8308189E4","MOHC830818MGTRRL03","CLAUDIA GABRIELA MORENO HERNANDEZ",1,"831011727T0382000.000017",83101,7,27,"T03820",0,17,82,7,"B",1,201706,201706]
[null,"GUANAJUATO","ROHG921225D70","ROHG921225MGTDRL00","GLORIA LORENA BEATRIZ RODRIGUEZ HERNANDEZ",1,"831011742A0380400.0003741",83101,7,42,"A03804",0,3741,43,2,"B",1,201706,201706]
[null,"GUANAJUATO","HEMF950111UT8","HEMF950111HGTRRR04","FRANCISCO ANTONIO HERNANDEZ MARTINEZ",1,"831011742T0380300.0003742",83101,7,42,"T03803",0,3742,47,2,"B",1,201706,201706]
[null,"GUANAJUATO","GUND770803A3A","GUND770803HGTTTN01","DANIEL ADRIAN GUTIERREZ NIETO",1,"831011844A0380400.0003291",83101,8,44,"A03804",0,3291,43,2,"B",1,201706,201706]
[null,"GUANAJUATO","FAOI930617PD8","FAOI930617HGTRRS09","JOSE ISAAC FRAUSTO ORTEGA",1,"831011713A0180600.0000091",83101,7,13,"A01806",0,91,70,3,"B",1,201706,201706]
[null,"GUANAJUATO","OELM6606116J8","OELM660611MGTRRR05","MARTINA ORNELAS LARA",1,"831011713T0380300.0000114",83101,7,13,"T03803",0,114,47,2,"B",1,201706,201706]
[null,"Total Personas : ",104,null,null,null,null,null,null,null,"Total Plazas : ",null,104]
[]
[]
[]
[null,"Fuente : Información proporcionada por las Entidades Federativas"]

{"sheet":"II D) 4","index":7,"n_rows":27,"n_cols":17,"rows_kept":27,"cut":false,"hidden":false,"merged":[[23,13,23,14],[12,0,13,0],[12,6,13,6],[12,7,12,13],[12,14,12,15],[12,2,13,2],[12,1,13,1],[12,16,13,16],[12,5,13,5],[12,4,13,4],[12,3,13,3],[9,1,9,9]]}
[]
[]
[]
[]
[]
[]
[]
[]
[null,"Formato: Trabajadores Jubilados en el Periodo"]
[null,{"$f":"IF('Caratula Resumen'!D22=\"Elige el Periodo…\",\"\",'Caratula Resumen'!D22)","v":"Fondo de Aportaciones para la Educación Tecnológica y de Adultos/Instituto Nacional para la Educación de los Adultos (FAETA/INEA)"},null,null,null,null,null,null,null,null,null,null,null,null,null,{"$f":"'A Y  II D3'!X10","v":"1er. Trimestre 2017"}]
[]
[]
[null,"Entidad Federativa","R.F.C.","CURP","NOMBRE","Clave CT","Última(s) ó Penultima(s) Plaza(s) Ocupada(s)\n(*)","Clave Presupuestal de la Jubilación",null,null,null,null,null,null,"Periodo ocupado",null,"Quincena de inicio de jubilación"]
[null,null,null,null,null,null,null,"Partida Presupuestal","Código de Pago","Clave de Unidad","Clave de Sub Unidad","Clave de Categoría","Horas Semana Mes ","Número de Plaza","Inicio","Conclusión"]
[]
[null,"Entidad Federativa","R.F.C.","CURP","NOMBRE","Clave Centro de Trabajo","Última(s) ó Penultima(s) Plaza(s) Ocupada(s)\n(*)","Partida Presupuestal","Código de Pago","Clave de Unidad","Clave de Sub Unidad","Clave de Categoría","Horas Semana Mes ","Número de Plaza","Periodo ocupado\nInicio","Periodo ocupado\nConclusión","Quincena de inicio de jubilación"]
[]
[]
[]
[]
[]
[null,"Total Personas : ",null,null,null,null,null,null,null,null,null,"Total Plazas : "]
[]
[]
[]
[null,"Fuente : Información proporcionada por las Entidades Federativas"]
[null,"(*) Si  el trabajador se jubila con más de una clave presupuestal, por cada plaza se debe llenar un registro hasta que se haya informado acerca de todas las plazas del trabajador."]

{"sheet":"II D) 4 A","index":8,"n_rows":27,"n_cols":18,"rows_kept":27,"cut":false,"hidden":false,"merged":[[21,13,21,14],[9,1,9,7],[23,13,23,14],[12,17,13,17],[12,1,13,1],[12,2,13,2],[12,3,13,3],[12,4,13,4],[12,5,13,5],[12,6,12,12],[12,13,12,14],[12,15,13,15],[12,16,13,16]]}
[]
[]
[]
[]
[]
[]
[]
[]
[null,"Formato: Trabajadores que Tramitaron Licencia Prejubilatoria en el Periodo"]
[null,{"$f":"IF('Caratula Resumen'!D22=\"Elige el Periodo…\",\"\",'Caratula Resumen'!D22)","v":"Fondo de Aportaciones para la Educación Tecnológica y de Adultos/Instituto Nacional para la Educación de los Adultos (FAETA/INEA)"},null,null,null,null,null,null,null,null,null,null,null,null,null,null,null,{"$f":"'A Y  II D3'!X10","v":"1er. Trimestre 2017"}]
[]
[]
[null,"Entidad Federativa","R.F.C.","CURP","NOMBRE","Clave integrada","Clave Presupuestal",null,null,null,null,null,null,"Periodo Licencia",null,"Percepciones pagadas con Presupuesto Federal en el  Periodo reportado*","Percepciones pagadas con Presupuesto de otra Fuente en el  Periodo reportado*","Clave CT Origen"]
[null,null,null,null,null,null,"Partida Presupuestal","Código de Pago","Clave de Unidad","Clave de Sub Unidad","Clave de Categoría","Horas Semana Mes ","Número de Plaza","Inicio","Conclusión"]
[]
[null,"Entidad Federativa","R.F.C.","CURP","NOMBRE","Clave integrada","Partida Presupuestal","Código de Pago","Clave de Unidad","Clave de Sub Unidad","Clave de Categoría","Horas Semana Mes ","Número de Plaza","Periodo Licencia\nInicio","Periodo Licencia\nConclusión","Percepciones pagadas con Presupuesto Federal en el  Periodo reportado*","Percepciones pagadas con Presupuesto de otra Fuente en el  Periodo reportado*","Clave CT Origen"]
[]
[]
[]
[]
[]
[null,"Total Personas : ",null,null,null,null,null,null,null,null,"Total Plazas : ",null,null,"Total Pto. Federal"]
[]
[null,null,null,null,null,null,null,null,null,null,null,null,null,"Total Ppto. Otras Fuentes"]
[]
[null,"*Total de Percepciones reportadas por la Entidad Federativa como pagadas en el periodo "]
[null,"Fuente : Información proporcionada por las Entidades Federativas"]

{"sheet":"II D) 6","index":9,"n_rows":69,"n_cols":13,"rows_kept":69,"cut":false,"hidden":false,"merged":[[10,1,10,6],[13,12,14,12],[13,9,13,10],[13,11,14,11],[13,1,14,1],[13,2,14,2],[13,3,14,3],[13,4,14,4],[13,5,14,5],[13,6,14,6],[13,7,13,8]]}
[]
[]
[]
[]
[]
[]
[]
[]
[]
[null,"Formato: Trabajadores Contratados por Honorarios en el Periodo"]
[null,{"$f":"IF('Caratula Resumen'!D22=\"Elige el Periodo…\",\"\",'Caratula Resumen'!D22)","v":"Fondo de Aportaciones para la Educación Tecnológica y de Adultos/Instituto Nacional para la Educación de los Adultos (FAETA/INEA)"},null,null,null,null,null,null,null,null,null,null,{"$f":"'A Y  II D3'!X10","v":"1er. Trimestre 2017"}]
[]
[]
[null,"Entidad Federativa","Clave Centro de Trabajo","R.F.C.","CURP","Nombre","Identificador del Contrato","Equivalencia",null,"Periodo de Contratación",null,"Función","Percepciones pagadas dentro del periodo reportado"]
[null,null,null,null,null,null,null,"Clave de Categoría","Horas Semana Mes ","Inicio","Conclusión"]
[]
[null,"Entidad Federativa","Clave Centro de Trabajo","R.F.C.","CURP","Nombre","Identificador del Contrato","Clave de Categoría","Horas Semana Mes ","Periodo de Contratación\nInicio","Periodo de Contratación\nConclusión","Función","Percepciones pagadas dentro del periodo reportado"]
[null,"GUANAJUATO","11EBS6627E","RUGR860730MY2","RUGR860730HASZRB01","JOSE ROBERTO RUIZ GARCIA",0,0,0,201705,201705,"Auxiliar en el dise de las politicas y metodologias en la administraci",18000]
[null,"GUANAJUATO","11EBS6627E","PEVH7510155C2","PEVH751015HGTRLG07","HUGO PEREZ VELA",0,0,0,201705,201705,"Fungir como representante legal de la A C ",15000]
[null,"GUANAJUATO","11EBS6627E","FUAA790908JW1","FUAA790908MGTNGD01","ADRIANA FUENTES AGUILAR",0,0,0,201705,201705,"Coordinar y dar seguimiento al programa denominado Beca Impare",13000]
[null,"GUANAJUATO","11EBS6627E","MOHL801211NA5","MOHL801211HGTRRS00","LUIS ARTUTO MORENO HERNADEZ",0,0,0,201705,201705,"Realizar inventarios de los bienes en las distintas unidades admnistrativas del INAEBA",7000]
[null,"GUANAJUATO","11EBS6627E","GOLC950116TN4","GOLC950116HGTMPR09","CARLOS ADEMIR EUSEBIO GOMEZ LOPEZ",0,0,0,201705,201705,"Realizar inventarios de los bienes en las distintas unidades admnistrativas del INAEBA",3500]
[null,"GUANAJUATO","11EBS6627E","OOMM7203247E6","OOMM720324HBCSRR04","MARCO ANTONIO OSORIO MORENO",0,0,0,201705,201705,"Realizar inventarios de los bienes en las distintas unidades admnistrativas del INAEBA",7000]
[null,"GUANAJUATO","11EBS6627E","POFJ801212PH1","POFJ801212HDFSLL09","JOEL POSADA FLORES",0,0,0,201705,201705,"Generar un plan de trabajo para cumplir el objetivo de la meta.",22500]
[null,"GUANAJUATO","11EBS6627E","BIAA730817BQ1","BIAA730817HGTRLR02","ARMANDO BRISEﾑO ALONSO",0,0,0,201705,201705,"Planear y estructurar  los materiales educativos",15000]
[null,"GUANAJUATO","11EBS6627E","PAAA771008SHA","PAAA771008HGTRRN00","ANGEL ISRAEL ARAMIS PRATZ ARANDA",0,0,0,201705,201705,"Preparar el modelo virtual de INAEBA con las condiciones tecnologicas necesarias para generar un  impacto muy favorable en los usuarios y hacer los modulos en su totalidad propuestas mas interesantes y motivadoras",15000]
[null,"GUANAJUATO","11EBS6627E","CERD780901S86","CERD780901HCLBSN07","DANIEL CEBALLOS RIOS",0,0,0,201705,201705,"Guiar en el proceso de aprendizaje a cada uno de los usuarios asignados en la plataforma virtual por cada modulo",15000]
[null,"GUANAJUATO","11EBS6627E","MAPF8612025K9","MAPK861202MGTRNT09","FATIMA GIBRANA MARTINEZ PUENTE",0,0,0,201705,201705,"Elaborar un plan de trabajo respecto a las estrategias de dise e imagen a desarrollar e implementar para los procesos de Diplomado Cultura Digital MEVyT en Linea Talleres de Lectura y Escritura Rutas de aprendizaje Uso de las TICs banco de tutores",15000]
[null,"GUANAJUATO","11EBS6627E","MEGR800907M89","MEGR800907MGTNPC03","ROCIO MENDOZA GUAPO",0,0,0,201705,201705," Contribuir al proceso de ensenza",27000]
[null,"GUANAJUATO","11EBS6627E","FAFE8804016R0","FAFE880401MGTBLL05","ELIZABETH FABIAN FALCON",0,0,0,201705,201705,"Valida con asesor los educandos registrados en el proyecto y reporta al coordinador del proyecto",18000]
[null,"GUANAJUATO","11EBS6627E","ROGJ791231I24","ROGJ791231HGTBRN08","JUAN FRANCISCO ROBLES GRANADOS",0,0,0,201705,201705,"Valida con asesor los educandos registrados en el proyecto y reporta al coordinador del proyecto",18000]
[null,"GUANAJUATO","11EBS6627E","CAPI830829HW7","CAPI830829HCMNV16","IVAN CAMACHO PONCE",0,0,0,201705,201705,"Valida con asesor los educandos registrados en el proyecto y reporta al coordinador del proyecto",12000]
[null,"GUANAJUATO","11EBS6627E","GOSR910123H36","GORS910123HGTNNC05","RICADO GONZALEZ SANCHEZ",0,0,0,201705,201705,"Coordinar y supervisar la planeacion para el logro del las metas del proyecto",12333.33]
[null,"GUANAJUATO","11EBS6627E","LOOE880124182","LOOE880124MGTPRL01","MARIA ELENA LOPEZ ORNELAS",0,0,0,201705,201705," Recabar la documentacion necesaria de los candidatos a presentar PEC",20000]
[null,"GUANAJUATO","11EBS6627E","PETL810503G72","PETL810503MGTRRZ04","LUZ MARIA PEREZ TORRES",0,0,0,201705,201705,"Aplicar examenes a educandos en sedes urbanas y rurales segun la calendarizacion previamente asignada",7500]
[null,"GUANAJUATO","11EBS6627E","SOHJ8607157DA","SOHJ860715HGTLRN00","JUAN MANUEL SOLIS HERNANDEZ",0,0,0,201705,201705,"Cumplir con la programaci diaria de trabajo establecida previamente",8000]
[null,"GUANAJUATO","11EBS6627E","EAEH811117MY0","EAEH781117HMNSSC06","JOSE HECTOR ESTRADA ESPINOSA",0,0,0,201705,201705,"Aplicar examenes a educandos en sedes urbanas y rurales segun la calendarizacion previamente asignada",2500]
[null,"GUANAJUATO","11EBS6627E","ZAMJ901213MZ1","ZAMJ901213HGTVRN09","JAUN CARLOS ZAVALA MORENO",0,0,0,201705,201705,"Cumplir con la programacion diaria de trabajo establecida previamente",4000]
[null,"GUANAJUATO","11EBS6627E","GOGA8202147K2","GOGA820214MGTMNL02","GOMEZ GONZALEZ ALMA DELIA",0,0,0,201705,201705,"Aplicar examenes a educandos en sedes urbanas y rurales segun la calendarizacion previamente asignada",5000]
[null,"GUANAJUATO","11EBS6627E","RUGR860730MY2","RUGR860730HASZRB01","JOSE ROBERTO RUIZ GARCIA",0,0,0,201706,201706,"Auxiliar en el dise de las politicas y metodologias en la administracion",6000]
[null,"GUANAJUATO","11EBS6627E","PEVH7510155C2","PEVH751015HGTRLG07","HUGO PEREZ VELA",0,0,0,201706,201706,"Fungir como representante legal de la A C ",5000]
[null,"GUANAJUATO","11EBS6627E","FUAA790908JW1","FUAA790908MGTNGD01","ADRIANA FUENTES AGUILAR",0,0,0,201706,201706,"Coordinar y dar seguimiento al programa denominado Beca Impare",6500]
[null,"GUANAJUATO","11EBS6627E","MOHL801211NA5","MOHL801211HGTRRS00","LUIS ARTUTO MORENO HERNADEZ",0,0,0,201706,201706,"Realizar inventarios de los bienes en las distintas unidades admnistrativas del INAEBA",3500]
[null,"GUANAJUATO","11EBS6627E","OOMM7203247E6","OOMM720324HBCSRR04","MARCO ANTONIO OSORIO MORENO",0,0,0,201706,201706,"Realizar inventarios de los bienes en las distintas unidades admnistrativas del INAEBA",3500]
[null,"GUANAJUATO","11EBS6627E","POFJ801212PH1","POFJ801212HDFSLL09","JOEL POSADA FLORES",0,0,0,201706,201706,"Generar un plan de trabajo para cumplir el objetivo de la meta",7500]
[null,"GUANAJUATO","11EBS6627E","BIAA730817BQ1","BIAA730817HGTRLR02","ARMANDO BRISEﾑO ALONSO",0,0,0,201706,201706,"Planear y estructurar  los materiales educativos acorde a las necesidades de los usuarios",5000]
[null,"GUANAJUATO","11EBS6627E","PAAA771008SHA","PAAA771008HGTRRN00","ANGEL ISRAEL ARAMIS PRATZ ARANDA",0,0,0,201706,201706,"Preparar el modelo virtual de INAEBA con las condiciones tecnologicas necesarias para generar un  impacto muy favorable en los usuarios y hacer los modulos en su totalidad propuestas mas interesantes y motivadoras",5000]
[null,"GUANAJUATO","11EBS6627E","CERD780901S86","CERD780901HCLBSN07","DANIEL CEBALLOS RIOS",0,0,0,201706,201706,"Guiar en el proceso de aprendizaje a cada uno de los usuarios asignados en la plataforma virtual por cada modulo",5000]
[null,"GUANAJUATO","11EBS6627E","MAPF8612025K9","MAPK861202MGTRNT09","FATIMA GIBRNA MARTINEZ UENTE",0,0,0,201706,201706,"Elaborar un plan de trabajo respecto a las estrategias de dise e imagen a desarrollar e implementar para los procesos de Diplomado Cultura Digital MEVyT en Linea Talleres de Lectura y Escritura Rutas de aprendizaje Uso de las TICs banco de tutores",5000]
[null,"GUANAJUATO","11EBS6627E","MEGR800907M89","MEGR800907MGTNPC03","ROCIO MENDOZA GUAPO",0,0,0,201706,201706," Contribuir al proceso de ensenza",9000]
[null,"GUANAJUATO","11EBS6627E","FAFE8804016R0","FAFE880401MGTBLL05","ELIZABETH FABIAN FALCON",0,0,0,201706,201706,"Valida con asesor los educandos registrados en el proyecto y reporta al coordinador del proyecto",6000]
[null,"GUANAJUATO","11EBS6627E","ROGJ791231I24","ROGJ791231HGTBRN08","JUAN FRANCISCO ROBLES GRANADOS",0,0,0,201706,201706,"Valida con asesor los educandos registrados en el proyecto y reporta al coordinador del proyecto",6000]
[null,"GUANAJUATO","11EBS6627E","GOSR910123H36","GORS910123HGTNNC05","RICADO GONZALEZ SANCHEZ",0,0,0,201706,201706,"Coordinar y supervisar la planeacion para el logro del las metas del proyecto",3666.67]
[null,"GUANAJUATO","11EBS6627E","LOOE880124182","LOOE880124MGTPRL01","MARIA ELENA LOPEZ ORNELAS",0,0,0,201706,201706," Recabar la documentaci necesaria de los candidatos a presentar PEC",5000]
[null,"GUANAJUATO","11EBS6627E","JIMR801206159","JIMR801206HGTMJB03","ROBERTO ULISES JIMENEZ MEJIA",0,0,0,201706,201706,"Coordninar el proyecto de Impulso Integral a Jovenes en situacion de vulnerabilidad",20000]
[null,"GUANAJUATO","11EBS6627E","GOGA8202147K2","GOGA820214MGTMNL02","GOMEZ GONZALEZ ALMA DELIA",0,0,0,201706,201706,"Aplicar examenes a educandos en sedes urbanas y rurales segun la calendarizacion previamente asignada",2500]
[null,"GUANAJUATO","11EBS6627E","LOHA9309096G6","LOHA930909HGTPRN01","JOSE ANTONIO LOPEZ HERNANDEZ",0,0,0,201706,201706,"Aplicar examenes a educandos en sedes urbanas y rurales segun la calendarizacion previamente asignada",5000]
[null,"GUANAJUATO","11EBS6627E","PETL810503G72","PETL810503MGTRRZ04","LUZ MARIA PEREZ TORRES",0,0,0,201706,201706,"Aplicar examenes a educandos en sedes urbanas y rurales segun la calendarizacion previamente asignada",2500]
[null,"GUANAJUATO","11EBS6627E","SOHJ8607157DA","SOHJ860715HGTLRN00","JUAN MANUEL SOLIS HERNANDEZ",0,0,0,201706,201706,"Cumplir con la programacion diaria de trabajo establecida previamente",4000]
[null,"GUANAJUATO","11EBS6627E","EAEH811117MY0","EAEH781117HMNSSC06","JOSE HECTOR ESTRADA ESPINOSA",0,0,0,201706,201706,"Aplicar examenes a educandos en sedes urbanas y rurales segun la calendarizacion previamente asignada",2500]
[null,"GUANAJUATO","11EBS6627E","SOAD871212TA1","SOAD871212HQTTLG06","DIEGO RODRIGO SOTO ALVAREZ",0,0,0,201706,201706,"Valida con asesor los educandos registrados en el proyecto y reporta al coordinador del proyecto",12000]
[null,"GUANAJUATO","11EBS6627E","ZAMJ901213MZ1","ZAMJ901213HGTVRN09","JAUN CARLOS ZAVALA MORENO",0,0,0,201706,201706,"Cumplir con la programacion diaria de trabajo establecida previamente",4000]
[null,"GUANAJUATO","11EBS6627E","MAEP680215KK3","MAEP68025MDFRST02","PATRICIA GENOVEVA MARTINEZ ESPINOSA",0,0,0,201706,201706,"Generar un plan de trabajo para cumplir el objetivo de la meta",18000]
[null,"Total Entidad Federativa Personas : ",null,null,null,null,null,null,null,null,null,"Subtotal Monto Pagado en el Periodo:"]
[]
[]
[null,null,null,null,null,null,null,null,null,"Total   Percepciones :"]
[]
[null,"Fuente : Información proporcionada por las Entidades Federativas"]

{"sheet":"II D) 7 1","index":10,"n_rows":39,"n_cols":19,"rows_kept":39,"cut":false,"hidden":false,"merged":[[35,16,35,17],[12,18,13,18],[12,13,13,13],[12,14,13,14],[12,15,13,15],[12,16,13,16],[8,17,8,18],[9,1,9,9],[12,6,13,6],[12,7,12,9],[12,10,13,10],[12,11,13,11],[12,12,13,12],[12,1,13,1],[12,2,13,2],[12,3,13,3],[12,4,13,4],[12,5,13,5],[12,17,13,17]]}
[]
[]
[]
[]
[]
[]
[]
[]
[null,"Formato: Analítico de Categorías / Plazas Autorizadas con su Tabulador",null,null,null,null,null,null,null,null,null,null,null,null,null,null,"Entidad Federativa:",{"$f":"IF('Caratula Resumen'!D21=\"Elige el Periodo…\",\"\",'Caratula Resumen'!D21)","v":" GUANAJUATO "}]
[null,{"$f":"IF('Caratula Resumen'!D22=\"Elige el Periodo…\",\"\",'Caratula Resumen'!D22)","v":"Fondo de Aportaciones para la Educación Tecnológica y de Adultos/Instituto Nacional para la Educación de los Adultos (FAETA/INEA)"},null,null,null,null,null,null,null,null,null,null,null,null,null,null,null,null,{"$f":"'A Y  II D3'!X10","v":"1er. Trimestre 2017"}]
[]
[]
[null,"Clave Tipo educativo","Clave Nivel educativo","Clave Subnivel educativo","Descripción Nivel / Subnivel","Tipo Financiamiento","Partida Presupuestal","CATEGORIA",null,null,"Zona Económica","Nivel Puesto","Nivel Sueldo","Tipo Contratación","Monto mensual\npor plaza jornada","Monto mensual\nPor Plaza HSM","Número de Plazas Jornada","Número de Plazas HSM","Monto total autorizado"]
[null,null,null,null,null,null,null,"Tipo de Categoría"," Categoría","Descripción"]
[]
[null,"Clave Tipo educativo","Clave Nivel educativo","Clave Subnivel educativo","Descripción Nivel / Subnivel","Tipo Financiamiento","Partida Presupestal","Tipo de Categoría"," Categoría","Descripción","Zona Económica","Nivel Puesto","Nivel Sueldo","Tipo Contratación","Monto mensual\npor plaza jornada","Monto mensual\nPor Plaza HSM","Número de Plazas Jornada","Número de Plazas HSM","Monto total autorizado"]
[null,6,61,64,"PRIMARIA, SECUNDARIA Y CAPACITACION PARA EL TRABAJO","FAETA",83101,5,"CF36014","COORDINADOR DE ZONA","A",92,"OA1","P",4190.88,0,11,0,46099.68]
[null,6,61,64,"PRIMARIA, SECUNDARIA Y CAPACITACION PARA EL TRABAJO","FAETA",83101,5,"CF01059","JEFE DE DEPARTAMENTO","A",93,"OA1","P",5164.5,0,5,0,25822.5]
[null,6,61,64,"PRIMARIA, SECUNDARIA Y CAPACITACION PARA EL TRABAJO","FAETA",83101,5,"CF36014","COORDINADOR REGIONAL","A",95,"OA1","P",5164.5,0,1,0,5164.5]
[null,6,61,64,"PRIMARIA, SECUNDARIA Y CAPACITACION PARA EL TRABAJO","FAETA",83101,5,"CF14070","DIRECTOR DELEGADO","A",97,"MB2","P",14611.06,0,1,0,14611.06]
[null,6,61,64,"PRIMARIA, SECUNDARIA Y CAPACITACION PARA EL TRABAJO","FAETA",83101,5,"S01803","OFICIAL DE SERVICIOS Y MTTO","B",21,2,"P",5911.53,0,4,0,23646.12]
[null,6,61,64,"PRIMARIA, SECUNDARIA Y CAPACITACION PARA EL TRABAJO","FAETA",83101,2,"A01803","ADMINISTRATIVO ESPECIALIZADO","B",29,2,"P",5911.53,0,5,0,29557.65]
[null,6,61,64,"PRIMARIA, SECUNDARIA Y CAPACITACION PARA EL TRABAJO","FAETA",83101,2,"T03810","ESPECIALISTA EN PROYECTOS TEC","B",39,2,"P",5911.53,0,25,0,147788.25]
[null,6,61,64,"PRIMARIA, SECUNDARIA Y CAPACITACION PARA EL TRABAJO","FAETA",83101,2,"A03804","SECRETARIA C","B",43,2,"P",5911.53,0,27,0,159611.31]
[null,6,61,64,"PRIMARIA, SECUNDARIA Y CAPACITACION PARA EL TRABAJO","FAETA",83101,2,"T03803","TECNICO MEDIO","B",47,2,"P",5911.53,0,24,0,141876.72]
[null,6,61,64,"PRIMARIA, SECUNDARIA Y CAPACITACION PARA EL TRABAJO","FAETA",83101,2,"CF04807","SECRETARIA EJECUTIVA B","B",61,6,"P",6510.6,0,1,0,6510.6]
[null,6,61,64,"PRIMARIA, SECUNDARIA Y CAPACITACION PARA EL TRABAJO","FAETA",83101,2,"A01806","ANALISTA ADMINISTRATIVO","B",70,3,"P",6069.29,0,18,0,109247.22]
[null,6,61,64,"PRIMARIA, SECUNDARIA Y CAPACITACION PARA EL TRABAJO","FAETA",83101,2,"CF34810","ANALISTA ADMINISTRATIVO","B",70,3,"P",6069.29,0,1,0,6069.29]
[null,6,61,64,"PRIMARIA, SECUNDARIA Y CAPACITACION PARA EL TRABAJO","FAETA",83101,2,"A01807","JEFE DE OFICINA","B",81,5,"P",6400.25,0,25,0,160006.25]
[null,6,61,64,"PRIMARIA, SECUNDARIA Y CAPACITACION PARA EL TRABAJO","FAETA",83101,2,"T03820","TECNICO DOCENTE","B",82,7,"P",6620.94,0,169,0,1118938.8600000001]
[null,6,61,64,"PRIMARIA, SECUNDARIA Y CAPACITACION PARA EL TRABAJO","FAETA",83101,2,"CF12804","ANALISTA PROGRAMADOR B","B",83,6,"P",6510.6,0,1,0,6510.6]
[null,6,61,64,"PRIMARIA, SECUNDARIA Y CAPACITACION PARA EL TRABAJO","FAETA",83101,2,"T03823","TECNICO SUPERIOR","B",85,7,"P",6620.94,0,3,0,19862.82]
[null,6,61,64,"PRIMARIA, SECUNDARIA Y CAPACITACION PARA EL TRABAJO","FAETA",83101,2,"CF12814","ESPECIALISTA EN TELEINFORMATICA","B",86,7,"P",6620.94,0,1,0,6620.94]
[null,6,61,64,"PRIMARIA, SECUNDARIA Y CAPACITACION PARA EL TRABAJO","FAETA",83101,2,"CF33849","COORDINADOR DE UNIDAD DE SE","B",88,8,"P",6699.65,0,12,0,80395.8]
[null,6,61,64,"PRIMARIA, SECUNDARIA Y CAPACITACION PARA EL TRABAJO","FAETA",83101,2,"CF36014","COORDINADOR DE ZONA","B",92,"OA1","P",4328.8500000000004,0,3,0,12986.55]
[null,null,null,null,null,null,null,null,null,null,null,null,null,"Total Jornada:",{"$f":"SUBTOTAL(109,Tabla15[Monto mensual\npor plaza jornada])","v":121139.94},null,"Total Autorizado:",null,{"$f":"SUBTOTAL(109,Tabla15[Monto total autorizado])","v":2121326.7200000002}]
[null,null,null,null,null,null,null,null,null,null,null,null,null,"Total HSM",null,{"$f":"SUM(O41)","v":0}]
[]
[null,"Fuente : Información proporcionada por las Entidades Federativas"]

{"sheet":"II D) 7 2 ","index":11,"n_rows":251,"n_cols":18,"rows_kept":251,"cut":false,"hidden":false,"merged":[[14,8,15,8],[14,9,14,13],[14,14,14,16],[10,16,10,17],[11,1,11,9],[14,1,15,1],[14,2,15,2],[14,3,15,3],[14,17,15,17],[14,6,15,6],[14,7,15,7],[14,4,15,4],[14,5,15,5]]}
[]
[]
[]
[]
[]
[]
[]
[]
[]
[]
[null,"Formato: Catálogo de Categorías y Tabuladores",null,null,null,null,null,null,null,null,null,null,null,null,null,"Entidad Federativa:",{"$f":"IF('Caratula Resumen'!D21=\"Elige el Periodo…\",\"\",'Caratula Resumen'!D21)","v":" GUANAJUATO "}]
[null,{"$f":"IF('Caratula Resumen'!D22=\"Elige el Periodo…\",\"\",'Caratula Resumen'!D22)","v":"Fondo de Aportaciones para la Educación Tecnológica y de Adultos/Instituto Nacional para la Educación de los Adultos (FAETA/INEA)"},null,null,null,null,null,null,null,null,null,null,null,null,null,null,null,{"$f":"'A Y  II D3'!X10","v":"1er. Trimestre 2017"}]
[]
[]
[null,"Identificador origen presupuestal de la plaza","Clave de categoría","Descripción de la categoría","Tipo de contratación","Tipo de categoría","Clave de concepto de pago","Clave de nivel de puesto","Clave de nivel de sueldo","Sueldo asignado por zona económica",null,null,null,null,"Datos adicionales de horas",null,null,"Fecha de actualización"]
[null,null,null,null,null,null,null,null,null,"Inicio de vigencia del sueldo","Fin de vigencia del sueldo","Monto Mensual Jornada ó de HSM\nZona A","Monto Mensual Jornada ó de HSM\nZona B","Monto Mensual Jornada ó de HSM\nZona C","Horas \nde compatibilidad","Horas de servicio (HSM)","Horas de docencia"]
[]
[null,"Identificador origen presupuestal de la plaza","Clave de categoría","Descripción de la categoría","Tipo de contratación","Tipo de categoría","Clave de concepto de pago","Clave de nivel de puesto","Clave de nivel de sueldo","Inicio de vigencia del sueldo","Fin de vigencia del sueldo","Monto Mensual Jornada ó de HSM\nZona A","Monto Mensual Jornada ó de HSM\nZona B","Monto Mensual Jornada ó de HSM\nZona C","Horas \nde compatibilidad","Horas de servicio (HSM)","Horas de docencia","Fecha de actualización"]
[null,1,"S01803","OFICIAL DE SERVICIOS Y MANTEN.","P",2,1,21,2,201207,999999,0,0,5911.54,35,35,0,20170327]
[null,1,"S01803","OFICIAL DE SERVICIOS Y MANTEN.","P",2,4,21,2,201207,999999,0,0,100,35,35,0,20170327]
[null,1,"S01803","OFICIAL DE SERVICIOS Y MANTEN.","P",2,9,21,2,201207,999999,0,0,565,35,35,0,20170327]
[null,1,"S01803","OFICIAL DE SERVICIOS Y MANTEN.","P",2,11,21,2,201207,999999,0,0,465,35,35,0,20170327]
[null,1,"S01803","OFICIAL DE SERVICIOS Y MANTEN.","P",2,14,21,2,201207,999999,0,0,435,35,35,0,20170327]
[null,1,"S01803","OFICIAL DE SERVICIOS Y MANTEN.","P",2,15,21,2,201207,999999,0,0,394.1,35,35,0,20170327]
[null,1,"S01803","OFICIAL DE SERVICIOS Y MANTEN.","P",2,20,21,2,201207,999999,0,0,1400,35,35,0,20170327]
[null,1,"S01803","OFICIAL DE SERVICIOS Y MANTEN.","P",2,50,21,2,201207,999999,0,0,254.7,35,35,0,20170327]
[null,1,"S01803","OFICIAL DE SERVICIOS Y MANTEN.","P",2,63,21,2,201207,999999,0,0,679.82,35,35,0,20170327]
[null,1,"S01803","OFICIAL DE SERVICIOS Y MANTEN.","P",2,68,21,2,201207,999999,0,0,758,35,35,0,20170327]
[null,1,"S01803","OFICIAL DE SERVICIOS Y MANTEN.","P",2,13,21,2,201207,999999,0,0,60,35,35,0,20170327]
[null,1,"A01803","ADMINISTRATIVO ESPECIALIZADO","P",2,1,29,2,201207,999999,0,0,5911.54,35,35,0,20170327]
[null,1,"A01803","ADMINISTRATIVO ESPECIALIZADO","P",2,9,29,2,201207,999999,0,0,565,35,35,0,20170327]
[null,1,"A01803","ADMINISTRATIVO ESPECIALIZADO","P",2,11,29,2,201207,999999,0,0,465,35,35,0,20170327]
[null,1,"A01803","ADMINISTRATIVO ESPECIALIZADO","P",2,14,29,2,201207,999999,0,0,435,35,35,0,20170327]
[null,1,"A01803","ADMINISTRATIVO ESPECIALIZADO","P",2,20,29,2,201207,999999,0,0,1400,35,35,0,20170327]
[null,1,"A01803","ADMINISTRATIVO ESPECIALIZADO","P",2,15,29,2,201207,999999,0,0,394.1,35,35,0,20170327]
[null,1,"T03810","ESPECIALISTA EN PROYECTOS TECNICOS","P",2,1,39,2,201207,999999,0,0,5911.54,35,35,0,20170327]
[null,1,"T03810","ESPECIALISTA EN PROYECTOS TECNICOS","P",2,4,39,2,201207,999999,0,0,200,35,35,0,20170327]
[null,1,"T03810","ESPECIALISTA EN PROYECTOS TECNICOS","P",2,9,39,2,201207,999999,0,0,565,35,35,0,20170327]
[null,1,"T03810","ESPECIALISTA EN PROYECTOS TECNICOS","P",2,11,39,2,201207,999999,0,0,465,35,35,0,20170327]
[null,1,"T03810","ESPECIALISTA EN PROYECTOS TECNICOS","P",2,13,39,2,201207,999999,0,0,80,35,35,0,20170327]
[null,1,"T03810","ESPECIALISTA EN PROYECTOS TECNICOS","P",2,14,39,2,201207,999999,0,0,435,35,35,0,20170327]
[null,1,"T03810","ESPECIALISTA EN PROYECTOS TECNICOS","P",2,20,39,2,201207,999999,0,0,1400,35,35,0,20170327]
[null,1,"T03810","ESPECIALISTA EN PROYECTOS TECNICOS","P",2,50,39,2,201207,999999,0,0,1100.54,35,35,0,20170327]
[null,1,"T03810","ESPECIALISTA EN PROYECTOS TECNICOS","P",2,63,39,2,201207,999999,0,0,679.82,35,35,0,20170327]
[null,1,"T03810","ESPECIALISTA EN PROYECTOS TECNICOS","P",2,68,39,2,201207,999999,0,0,758,35,35,0,20170327]
[null,1,"T03810","ESPECIALISTA EN PROYECTOS TECNICOS","P",2,15,39,2,201207,999999,0,0,394.1,35,35,0,20170327]
[null,1,"T03810","ESPECIALISTA EN PROYECTOS TECNICOS","P",2,99,39,2,201207,999999,0,0,3790.04,35,35,0,20170327]
[null,1,"T03810","ESPECIALISTA EN PROYECTOS TECNICOS","P",2,17,39,2,201207,999999,0,0,360.18,35,35,0,20170327]
[null,1,"T03810","ESPECIALISTA EN PROYECTOS TECNICOS","P",2,98,39,2,201207,999999,0,0,3399.14,35,35,0,20170327]
[null,1,"A03804","SECRETARIA \"C\"","P",2,1,43,2,201207,999999,0,0,5911.54,35,35,0,20170327]
[null,1,"A03804","SECRETARIA \"C\"","P",2,4,43,2,201207,999999,0,0,175,35,35,0,20170327]
[null,1,"A03804","SECRETARIA \"C\"","P",2,9,43,2,201207,999999,0,0,565,35,35,0,20170327]
[null,1,"A03804","SECRETARIA \"C\"","P",2,11,43,2,201207,999999,0,0,465,35,35,0,20170327]
[null,1,"A03804","SECRETARIA \"C\"","P",2,14,43,2,201207,999999,0,0,435,35,35,0,20170327]
[null,1,"A03804","SECRETARIA \"C\"","P",2,15,43,2,201207,999999,0,0,394.1,35,35,0,20170327]
[null,1,"A03804","SECRETARIA \"C\"","P",2,20,43,2,201207,999999,0,0,1400,35,35,0,20170327]
[null,1,"A03804","SECRETARIA \"C\"","P",2,50,43,2,201207,999999,0,0,770.84,35,35,0,20170327]
[null,1,"A03804","SECRETARIA \"C\"","P",2,63,43,2,201207,999999,0,0,679.82,35,35,0,20170327]
[null,1,"A03804","SECRETARIA \"C\"","P",2,68,43,2,201207,999999,0,0,758,35,35,0,20170327]
[null,1,"A03804","SECRETARIA \"C\"","P",2,17,43,2,201207,999999,0,0,360.18,35,35,0,20170327]
[null,1,"A03804","SECRETARIA \"C\"","P",2,13,43,2,201207,999999,0,0,60,35,35,0,20170327]
[null,1,"A03804","SECRETARIA \"C\"","P",2,21,43,2,201207,999999,0,0,2600,35,35,0,20170327]
[null,1,"A03804","SECRETARIA \"C\"","P",2,55,43,2,201207,999999,0,0,30000,35,35,0,20170327]
[null,1,"T03803","TECNICO MEDIO","P",2,1,47,2,201207,999999,0,0,5911.54,35,35,0,20170327]
[null,1,"T03803","TECNICO MEDIO","P",2,4,47,2,201207,999999,0,0,225,35,35,0,20170327]
[null,1,"T03803","TECNICO MEDIO","P",2,9,47,2,201207,999999,0,0,565,35,35,0,20170327]
[null,1,"T03803","TECNICO MEDIO","P",2,11,47,2,201207,999999,0,0,465,35,35,0,20170327]
[null,1,"T03803","TECNICO MEDIO","P",2,14,47,2,201207,999999,0,0,435,35,35,0,20170327]
[null,1,"T03803","TECNICO MEDIO","P",2,20,47,2,201207,999999,0,0,1400,35,35,0,20170327]
[null,1,"T03803","TECNICO MEDIO","P",2,50,47,2,201207,999999,0,0,1134.6600000000001,35,35,0,20170327]
[null,1,"T03803","TECNICO MEDIO","P",2,63,47,2,201207,999999,0,0,679.82,35,35,0,20170327]
[null,1,"T03803","TECNICO MEDIO","P",2,68,47,2,201207,999999,0,0,758,35,35,0,20170327]
[null,1,"T03803","TECNICO MEDIO","P",2,15,47,2,201207,999999,0,0,394.1,35,35,0,20170327]
[null,1,"T03803","TECNICO MEDIO","P",2,13,47,2,201207,999999,0,0,80,35,35,0,20170327]
[null,1,"CF04807","SECRETARIA EJECUTIVA \"B\"","P",2,1,61,6,201207,999999,0,0,6510.6,35,35,0,20170327]
[null,1,"CF04807","SECRETARIA EJECUTIVA \"B\"","P",2,2,61,6,201207,999999,0,0,465,35,35,0,20170327]
[null,1,"CF04807","SECRETARIA EJECUTIVA \"B\"","P",2,3,61,6,201207,999999,0,0,524.55999999999995,35,35,0,20170327]
[null,1,"CF04807","SECRETARIA EJECUTIVA \"B\"","P",2,9,61,6,201207,999999,0,0,565,35,35,0,20170327]
[null,1,"CF04807","SECRETARIA EJECUTIVA \"B\"","P",2,12,61,6,201207,999999,0,0,435,35,35,0,20170327]
[null,1,"CF04807","SECRETARIA EJECUTIVA \"B\"","P",2,20,61,6,201207,999999,0,0,1400,35,35,0,20170327]
[null,1,"A01806","ANALISTA ADMINISTRATIVO","P",2,1,70,3,201207,999999,0,0,6069.3,35,35,0,20170327]
[null,1,"A01806","ANALISTA ADMINISTRATIVO","P",2,4,70,3,201207,999999,0,0,200,35,35,0,20170327]
[null,1,"A01806","ANALISTA ADMINISTRATIVO","P",2,9,70,3,201207,999999,0,0,565,35,35,0,20170327]
[null,1,"A01806","ANALISTA ADMINISTRATIVO","P",2,11,70,3,201207,999999,0,0,465,35,35,0,20170327]
[null,1,"A01806","ANALISTA ADMINISTRATIVO","P",2,14,70,3,201207,999999,0,0,435,35,35,0,20170327]
[null,1,"A01806","ANALISTA ADMINISTRATIVO","P",2,15,70,3,201207,999999,0,0,404.62,35,35,0,20170327]
[null,1,"A01806","ANALISTA ADMINISTRATIVO","P",2,20,70,3,201207,999999,0,0,1400,35,35,0,20170327]
[null,1,"A01806","ANALISTA ADMINISTRATIVO","P",2,50,70,3,201207,999999,0,0,1135.24,35,35,0,20170327]
[null,1,"A01806","ANALISTA ADMINISTRATIVO","P",2,63,70,3,201207,999999,0,0,697.96,35,35,0,20170327]
[null,1,"A01806","ANALISTA ADMINISTRATIVO","P",2,68,70,3,201207,999999,0,0,778.24,35,35,0,20170327]
[null,1,"A01806","ANALISTA ADMINISTRATIVO","P",2,13,70,3,201207,999999,0,0,80,35,35,0,20170327]
[null,1,"A01806","ANALISTA ADMINISTRATIVO","P",2,2,70,3,201207,999999,0,0,465,35,35,0,20170327]
[null,1,"A01806","ANALISTA ADMINISTRATIVO","P",2,12,70,3,201207,999999,0,0,435,35,35,0,20170327]
[null,1,"CF34810","ANALISTA ADMINISTRATIVO","P",2,1,70,3,201207,999999,0,0,6069.3,35,35,0,20170327]
[null,1,"CF34810","ANALISTA ADMINISTRATIVO","P",2,4,70,3,201207,999999,0,0,200,35,35,0,20170327]
[null,1,"CF34810","ANALISTA ADMINISTRATIVO","P",2,9,70,3,201207,999999,0,0,565,35,35,0,20170327]
[null,1,"CF34810","ANALISTA ADMINISTRATIVO","P",2,11,70,3,201207,999999,0,0,465,35,35,0,20170327]
[null,1,"CF34810","ANALISTA ADMINISTRATIVO","P",2,14,70,3,201207,999999,0,0,435,35,35,0,20170327]
[null,1,"CF34810","ANALISTA ADMINISTRATIVO","P",2,15,70,3,201207,999999,0,0,404.62,35,35,0,20170327]
[null,1,"CF34810","ANALISTA ADMINISTRATIVO","P",2,20,70,3,201207,999999,0,0,1400,35,35,0,20170327]
[null,1,"CF34810","ANALISTA ADMINISTRATIVO","P",2,50,70,3,201207,999999,0,0,1135.24,35,35,0,20170327]
[null,1,"CF34810","ANALISTA ADMINISTRATIVO","P",2,63,70,3,201207,999999,0,0,697.96,35,35,0,20170327]
[null,1,"CF34810","ANALISTA ADMINISTRATIVO","P",2,68,70,3,201207,999999,0,0,778.24,35,35,0,20170327]
[null,1,"CF34810","ANALISTA ADMINISTRATIVO","P",2,13,70,3,201207,999999,0,0,80,35,35,0,20170327]
[null,1,"CF34810","ANALISTA ADMINISTRATIVO","P",2,2,70,3,201207,999999,0,0,465,35,35,0,20170327]
[null,1,"CF34810","ANALISTA ADMINISTRATIVO","P",2,12,70,3,201207,999999,0,0,435,35,35,0,20170327]
[null,1,"A01807","JEFE DE OFICINA","P",2,1,81,5,201207,999999,0,0,6400.26,35,35,0,20170327]
[null,1,"A01807","JEFE DE OFICINA","P",2,4,81,5,201207,999999,0,0,175,35,35,0,20170327]
[null,1,"A01807","JEFE DE OFICINA","P",2,9,81,5,201207,999999,0,0,565,35,35,0,20170327]
[null,1,"A01807","JEFE DE OFICINA","P",2,11,81,5,201207,999999,0,0,465,35,35,0,20170327]
[null,1,"A01807","JEFE DE OFICINA","P",2,14,81,5,201207,999999,0,0,435,35,35,0,20170327]
[null,1,"A01807","JEFE DE OFICINA","P",2,15,81,5,201207,999999,0,0,426.68,35,35,0,20170327]
[null,1,"A01807","JEFE DE OFICINA","P",2,20,81,5,201207,999999,0,0,1400,35,35,0,20170327]
[null,1,"A01807","JEFE DE OFICINA","P",2,50,81,5,201207,999999,0,0,913.04,35,35,0,20170327]
[null,1,"A01807","JEFE DE OFICINA","P",2,63,81,5,201207,999999,0,0,736.02,35,35,0,20170327]
[null,1,"A01807","JEFE DE OFICINA","P",2,68,81,5,201207,999999,0,0,820.68,35,35,0,20170327]
[null,1,"A01807","JEFE DE OFICINA","P",2,13,81,5,201207,999999,0,0,60,35,35,0,20170327]
[null,1,"A01807","JEFE DE OFICINA","P",2,21,81,5,201207,999999,0,0,2200,35,35,0,20170327]
[null,1,"T03820","TECNICO DOCENTE","P",2,1,82,7,201207,999999,0,0,6620.94,35,35,0,20170327]
[null,1,"T03820","TECNICO DOCENTE","P",2,3,82,7,201207,999999,0,0,1267.46,35,35,0,20170327]
[null,1,"T03820","TECNICO DOCENTE","P",2,4,82,7,201207,999999,0,0,175,35,35,0,20170327]
[null,1,"T03820","TECNICO DOCENTE","P",2,9,82,7,201207,999999,0,0,565,35,35,0,20170327]
[null,1,"T03820","TECNICO DOCENTE","P",2,11,82,7,201207,999999,0,0,465,35,35,0,20170327]
[null,1,"T03820","TECNICO DOCENTE","P",2,14,82,7,201207,999999,0,0,435,35,35,0,20170327]
[null,1,"T03820","TECNICO DOCENTE","P",2,20,82,7,201207,999999,0,0,1400,35,35,0,20170327]
[null,1,"T03820","TECNICO DOCENTE","P",2,50,82,7,201207,999999,0,0,950.56,35,35,0,20170327]
[null,1,"T03820","TECNICO DOCENTE","P",2,63,82,7,201207,999999,0,0,761.4,35,35,0,20170327]
[null,1,"T03820","TECNICO DOCENTE","P",2,13,82,7,201207,999999,0,0,80,35,35,0,20170327]
[null,1,"T03820","TECNICO DOCENTE","P",2,68,82,7,201207,999999,0,0,848.96,35,35,0,20170327]
[null,1,"T03820","TECNICO DOCENTE","P",2,114,82,7,201207,999999,0,0,535.04,35,35,0,20170327]
[null,1,"T03820","TECNICO DOCENTE","P",2,115,82,7,201207,999999,0,0,2675.18,35,35,0,20170327]
[null,1,"T03820","TECNICO DOCENTE","P",2,62,82,7,201207,999999,0,0,14000,35,35,0,20170327]
[null,1,"T03820","TECNICO DOCENTE","P",2,15,82,7,201207,999999,0,0,441.4,35,35,0,20170327]
[null,1,"T03820","TECNICO DOCENTE","P",2,55,82,7,201207,999999,0,0,38000,35,35,0,20170327]
[null,1,"T03820","TECNICO DOCENTE","P",2,17,82,7,201207,999999,0,0,360.18,35,35,0,20170327]
[null,1,"T03820","TECNICO DOCENTE","P",2,99,82,7,201207,999999,0,0,4244.8599999999997,35,35,0,20170327]
[null,1,"CF12804","ANALISTA PROGRAMADOR \"B\"","P",2,1,83,6,201207,999999,0,0,6510.6,35,35,0,20170327]
[null,1,"CF12804","ANALISTA PROGRAMADOR \"B\"","P",2,2,83,6,201207,999999,0,0,465,35,35,0,20170327]
[null,1,"CF12804","ANALISTA PROGRAMADOR \"B\"","P",2,3,83,6,201207,999999,0,0,524.55999999999995,35,35,0,20170327]
[null,1,"CF12804","ANALISTA PROGRAMADOR \"B\"","P",2,9,83,6,201207,999999,0,0,565,35,35,0,20170327]
[null,1,"CF12804","ANALISTA PROGRAMADOR \"B\"","P",2,12,83,6,201207,999999,0,0,435,35,35,0,20170327]
[null,1,"CF12804","ANALISTA PROGRAMADOR \"B\"","P",2,20,83,6,201207,999999,0,0,1400,35,35,0,20170327]
[null,1,"T03823","TECNICO SUPERIOR","P",2,1,85,7,201207,999999,0,0,6620.94,35,35,0,20170327]
[null,1,"T03823","TECNICO SUPERIOR","P",2,3,85,7,201207,999999,0,0,1267.46,35,35,0,20170327]
[null,1,"T03823","TECNICO SUPERIOR","P",2,9,85,7,201207,999999,0,0,565,35,35,0,20170327]
[null,1,"T03823","TECNICO SUPERIOR","P",2,11,85,7,201207,999999,0,0,465,35,35,0,20170327]
[null,1,"T03823","TECNICO SUPERIOR","P",2,14,85,7,201207,999999,0,0,435,35,35,0,20170327]
[null,1,"T03823","TECNICO SUPERIOR","P",2,20,85,7,201207,999999,0,0,1400,35,35,0,20170327]
[null,1,"CF12814","ESP. EN TELEINFORMATICA","P",2,1,86,7,201207,999999,0,0,6620.94,35,35,0,20170327]
[null,1,"CF12814","ESP. EN TELEINFORMATICA","P",2,2,86,7,201207,999999,0,0,465,35,35,0,20170327]
[null,1,"CF12814","ESP. EN TELEINFORMATICA","P",2,3,86,7,201207,999999,0,0,1267.46,35,35,0,20170327]
[null,1,"CF12814","ESP. EN TELEINFORMATICA","P",2,9,86,7,201207,999999,0,0,565,35,35,0,20170327]
[null,1,"CF12814","ESP. EN TELEINFORMATICA","P",2,12,86,7,201207,999999,0,0,435,35,35,0,20170327]
[null,1,"CF12814","ESP. EN TELEINFORMATICA","P",2,20,86,7,201207,999999,0,0,1400,35,35,0,20170327]
[null,1,"CF33849","COORD. DE SERVICIOS ESP.","P",2,1,88,8,201207,999999,0,0,6699.66,35,35,0,20170327]
[null,1,"CF33849","COORD. DE SERVICIOS ESP.","P",2,2,88,8,201207,999999,0,0,465,35,35,0,20170327]
[null,1,"CF33849","COORD. DE SERVICIOS ESP.","P",2,3,88,8,201207,999999,0,0,1791.86,35,35,0,20170327]
[null,1,"CF33849","COORD. DE SERVICIOS ESP.","P",2,9,88,8,201207,999999,0,0,565,35,35,0,20170327]
[null,1,"CF33849","COORD. DE SERVICIOS ESP.","P",2,12,88,8,201207,999999,0,0,435,35,35,0,20170327]
[null,1,"CF33849","COORD. DE SERVICIOS ESP.","P",2,20,88,8,201207,999999,0,0,1400,35,35,0,20170327]
[null,1,"CF33849","COORD. DE SERVICIOS ESP.","P",2,106,88,8,201207,999999,0,0,200,35,35,0,20170327]
[null,1,"CF33849","COORD. DE SERVICIOS ESP.","P",2,201,88,8,201207,999999,0,0,3.94,35,35,0,20170327]
[null,1,"CF33849","COORD. DE SERVICIOS ESP.","P",2,203,88,8,201207,999999,0,0,4259.34,35,35,0,20170327]
[null,1,"CF33849","COORD. DE SERVICIOS ESP.","P",2,409,88,8,201207,999999,0,0,1695,35,35,0,20170327]
[null,1,"CF36014","COORDINADOR DE ZONA","P",5,1,"OA1",92,201207,999999,0,0,4190.88,40,40,0,20170327]
[null,1,"CF36014","COORDINADOR DE ZONA","P",5,8,"OA1",92,201207,999999,0,0,17962.419999999998,40,40,0,20170327]
[null,1,"CF36014","COORDINADOR DE ZONA","P",5,9,"OA1",92,201207,999999,0,0,565,40,40,0,20170327]
[null,1,"CF36014","COORDINADOR DE ZONA","P",5,106,"OA1",92,201207,999999,0,0,200,40,40,0,20170327]
[null,1,"CF36014","COORDINADOR DE ZONA","P",5,1,"OA1",92,201207,999999,0,0,4328.8599999999997,40,40,0,20170327]
[null,1,"CF36014","COORDINADOR DE ZONA","P",5,8,"OA1",92,201207,999999,0,0,12717.4,40,40,0,20170327]
[null,1,"CF36014","COORDINADOR DE ZONA","P",5,9,"OA1",92,201207,999999,0,0,565,40,40,0,20170327]
[null,1,"CF36014","COORDINADOR DE ZONA","P",5,106,"OA1",92,201207,999999,0,0,175,40,40,0,20170327]
[null,1,"CF36014","COORDINADOR DE ZONA","P",5,208,"OA1",92,201207,999999,0,0,5107.0600000000004,40,40,0,20170327]
[null,1,"CF36014","COORDINADOR DE ZONA","P",5,1,"OA1",92,201207,999999,0,0,4190.88,40,40,0,20170327]
[null,1,"CF36014","COORDINADOR DE ZONA","P",5,8,"OA1",92,201207,999999,0,0,17962.419999999998,40,40,0,20170327]
[null,1,"CF36014","COORDINADOR DE ZONA","P",5,9,"OA1",92,201207,999999,0,0,565,40,40,0,20170327]
[null,1,"CF36014","COORDINADOR DE ZONA","P",5,106,"OA1",92,201207,999999,0,0,225,40,40,0,20170327]
[null,1,"CF36014","COORDINADOR DE ZONA","P",5,1,"OA1",92,201207,999999,0,0,4190.88,40,40,0,20170327]
[null,1,"CF36014","COORDINADOR DE ZONA","P",5,8,"OA1",92,201207,999999,0,0,12855.36,40,40,0,20170327]
[null,1,"CF36014","COORDINADOR DE ZONA","P",5,9,"OA1",92,201207,999999,0,0,565,40,40,0,20170327]
[null,1,"CF36014","COORDINADOR DE ZONA","P",5,208,"OA1",92,201207,999999,0,0,5107.0600000000004,40,40,0,20170327]
[null,1,"CF36014","COORDINADOR DE ZONA","P",5,1,"OA1",92,201207,999999,0,0,4190.88,40,40,0,20170327]
[null,1,"CF36014","COORDINADOR DE ZONA","P",5,8,"OA1",92,201207,999999,0,0,12855.36,40,40,0,20170327]
[null,1,"CF36014","COORDINADOR DE ZONA","P",5,9,"OA1",92,201207,999999,0,0,565,40,40,0,20170327]
[null,1,"CF36014","COORDINADOR DE ZONA","P",5,208,"OA1",92,201207,999999,0,0,5107.0600000000004,40,40,0,20170327]
[null,1,"CF36014","COORDINADOR DE ZONA","P",5,1,"OA1",92,201207,999999,0,0,4190.88,40,40,0,20170327]
[null,1,"CF36014","COORDINADOR DE ZONA","P",5,8,"OA1",92,201207,999999,0,0,12855.36,40,40,0,20170327]
[null,1,"CF36014","COORDINADOR DE ZONA","P",5,9,"OA1",92,201207,999999,0,0,565,40,40,0,20170327]
[null,1,"CF36014","COORDINADOR DE ZONA","P",5,208,"OA1",92,201207,999999,0,0,5107.0600000000004,40,40,0,20170327]
[null,1,"CF36014","COORDINADOR DE ZONA","P",5,1,"OA1",92,201207,999999,0,0,4190.88,40,40,0,20170327]
[null,1,"CF36014","COORDINADOR DE ZONA","P",5,8,"OA1",92,201207,999999,0,0,12855.36,40,40,0,20170327]
[null,1,"CF36014","COORDINADOR DE ZONA","P",5,9,"OA1",92,201207,999999,0,0,565,40,40,0,20170327]
[null,1,"CF36014","COORDINADOR DE ZONA","P",5,1,"OA1",92,201207,999999,0,0,4190.88,40,40,0,20170327]
[null,1,"CF36014","COORDINADOR DE ZONA","P",5,8,"OA1",92,201207,999999,0,0,12855.36,40,40,0,20170327]
[null,1,"CF36014","COORDINADOR DE ZONA","P",5,9,"OA1",92,201207,999999,0,0,565,40,40,0,20170327]
[null,1,"CF36014","COORDINADOR DE ZONA","P",5,208,"OA1",92,201207,999999,0,0,5107.0600000000004,40,40,0,20170327]
[null,1,"CF36014","COORDINADOR DE ZONA","P",5,1,"OA1",92,201207,999999,0,0,4328.8599999999997,40,40,0,20170327]
[null,1,"CF36014","COORDINADOR DE ZONA","P",5,8,"OA1",92,201207,999999,0,0,12717.4,40,40,0,20170327]
[null,1,"CF36014","COORDINADOR DE ZONA","P",5,9,"OA1",92,201207,999999,0,0,565,40,40,0,20170327]
[null,1,"CF36014","COORDINADOR DE ZONA","P",5,208,"OA1",92,201207,999999,0,0,5107.0600000000004,40,40,0,20170327]
[null,1,"CF36014","COORDINADOR DE ZONA","P",5,1,"OA1",92,201207,999999,0,0,4190.88,40,40,0,20170327]
[null,1,"CF36014","COORDINADOR DE ZONA","P",5,8,"OA1",92,201207,999999,0,0,12855.36,40,40,0,20170327]
[null,1,"CF36014","COORDINADOR DE ZONA","P",5,9,"OA1",92,201207,999999,0,0,565,40,40,0,20170327]
[null,1,"CF36014","COORDINADOR DE ZONA","P",5,1,"OA1",92,201207,999999,0,0,4190.88,40,40,0,20170327]
[null,1,"CF36014","COORDINADOR DE ZONA","P",5,8,"OA1",92,201207,999999,0,0,12855.36,40,40,0,20170327]
[null,1,"CF36014","COORDINADOR DE ZONA","P",5,9,"OA1",92,201207,999999,0,0,565,40,40,0,20170327]
[null,1,"CF36014","COORDINADOR DE ZONA","P",5,208,"OA1",92,201207,999999,0,0,5107.0600000000004,40,40,0,20170327]
[null,1,"CF36014","COORDINADOR DE ZONA","P",5,1,"OA1",92,201207,999999,0,0,4190.88,40,40,0,20170327]
[null,1,"CF36014","COORDINADOR DE ZONA","P",5,8,"OA1",92,201207,999999,0,0,12855.36,40,40,0,20170327]
[null,1,"CF36014","COORDINADOR DE ZONA","P",5,9,"OA1",92,201207,999999,0,0,565,40,40,0,20170327]
[null,1,"CF36014","COORDINADOR DE ZONA","P",5,208,"OA1",92,201207,999999,0,0,5107.0600000000004,40,40,0,20170327]
[null,1,"CF36014","COORDINADOR DE ZONA","P",5,1,"OA1",92,201207,999999,0,0,4328.8599999999997,40,40,0,20170327]
[null,1,"CF36014","COORDINADOR DE ZONA","P",5,8,"OA1",92,201207,999999,0,0,12717.4,40,40,0,20170327]
[null,1,"CF36014","COORDINADOR DE ZONA","P",5,9,"OA1",92,201207,999999,0,0,565,40,40,0,20170327]
[null,1,"CF36014","COORDINADOR DE ZONA","P",5,208,"OA1",92,201207,999999,0,0,5107.0600000000004,40,40,0,20170327]
[null,1,"CF36014","COORDINADOR DE ZONA","P",5,1,"OA1",92,201207,999999,0,0,4190.88,40,40,0,20170327]
[null,1,"CF36014","COORDINADOR DE ZONA","P",5,8,"OA1",92,201207,999999,0,0,12855.36,40,40,0,20170327]
[null,1,"CF36014","COORDINADOR DE ZONA","P",5,9,"OA1",92,201207,999999,0,0,565,40,40,0,20170327]
[null,1,"CF36014","COORDINADOR DE ZONA","P",5,208,"OA1",92,201207,999999,0,0,5107.0600000000004,40,40,0,20170327]
[null,1,"CF01059","JEFE DE DEPARTAMENTO","P",5,1,"OA1",93,201207,999999,0,0,5164.5,40,40,0,20170327]
[null,1,"CF01059","JEFE DE DEPARTAMENTO","P",5,8,"OA1",93,201207,999999,0,0,11881.74,40,40,0,20170327]
[null,1,"CF01059","JEFE DE DEPARTAMENTO","P",5,9,"OA1",93,201207,999999,0,0,565,40,40,0,20170327]
[null,1,"CF01059","JEFE DE DEPARTAMENTO","P",5,106,"OA1",93,201207,999999,0,0,100,40,40,0,20170327]
[null,1,"CF01059","JEFE DE DEPARTAMENTO","P",5,208,"OA1",93,201207,999999,0,0,8208.5,40,40,0,20170327]
[null,1,"CF01059","JEFE DE DEPARTAMENTO","P",5,1,"OA1",93,201207,999999,0,0,5164.5,40,40,0,20170327]
[null,1,"CF01059","JEFE DE DEPARTAMENTO","P",5,8,"OA1",93,201207,999999,0,0,11881.74,40,40,0,20170327]
[null,1,"CF01059","JEFE DE DEPARTAMENTO","P",5,9,"OA1",93,201207,999999,0,0,565,40,40,0,20170327]
[null,1,"CF01059","JEFE DE DEPARTAMENTO","P",5,208,"OA1",93,201207,999999,0,0,8208.5,40,40,0,20170327]
[null,1,"CF01059","JEFE DE DEPARTAMENTO","P",5,1,"OA1",93,201207,999999,0,0,5164.5,40,40,0,20170327]
[null,1,"CF01059","JEFE DE DEPARTAMENTO","P",5,8,"OA1",93,201207,999999,0,0,11881.74,40,40,0,20170327]
[null,1,"CF01059","JEFE DE DEPARTAMENTO","P",5,9,"OA1",93,201207,999999,0,0,565,40,40,0,20170327]
[null,1,"CF01059","JEFE DE DEPARTAMENTO","P",5,1,"OA1",93,201207,999999,0,0,5164.5,40,40,0,20170327]
[null,1,"CF01059","JEFE DE DEPARTAMENTO","P",5,8,"OA1",93,201207,999999,0,0,11881.74,40,40,0,20170327]
[null,1,"CF01059","JEFE DE DEPARTAMENTO","P",5,9,"OA1",93,201207,999999,0,0,565,40,40,0,20170327]
[null,1,"CF01059","JEFE DE DEPARTAMENTO","P",5,208,"OA1",93,201207,999999,0,0,8208.5,40,40,0,20170327]
[null,1,"CF01059","JEFE DE DEPARTAMENTO","P",5,1,"OA1",93,201207,999999,0,0,5164.5,40,40,0,20170327]
[null,1,"CF01059","JEFE DE DEPARTAMENTO","P",5,8,"OA1",93,201207,999999,0,0,11881.74,40,40,0,20170327]
[null,1,"CF01059","JEFE DE DEPARTAMENTO","P",5,9,"OA1",93,201207,999999,0,0,565,40,40,0,20170327]
[null,1,"CF01059","JEFE DE DEPARTAMENTO","P",5,208,"OA1",93,201207,999999,0,0,8208.5,40,40,0,20170327]
[null,1,"CF36014","COORDINADOR REGIONAL","P",5,1,"OA1",95,201207,999999,0,0,5164.5,40,40,0,20170327]
[null,1,"CF36014","COORDINADOR REGIONAL","P",5,8,"OA1",95,201207,999999,0,0,11881.74,40,40,0,20170327]
[null,1,"CF36014","COORDINADOR REGIONAL","P",5,9,"OA1",95,201207,999999,0,0,565,40,40,0,20170327]
[null,1,"CF36014","COORDINADOR REGIONAL","P",5,208,"OA1",95,201207,999999,0,0,11617.9,40,40,0,20170327]
[null,1,"CF14070","DELEGADO","P",5,1,"MB2",97,201207,999999,0,0,14611.06,40,40,0,20170327]
[null,1,"CF14070","DELEGADO","P",5,8,"MB2",97,201207,999999,0,0,51060.12,40,40,0,20170327]
[null,1,"CF14070","DELEGADO","P",5,9,"MB2",97,201207,999999,0,0,565,40,40,0,20170327]
[null,null,null,null,null,null,null,null,null,null,"Total Zona A:",{"$f":"SUBTOTAL(109,Tabla16[Monto Mensual Jornada ó de HSM\nZona A])","v":0}]
[null,null,null,null,null,null,null,null,null,null,null,"Total Zona B:",{"$f":"SUM(M19:M247)","v":0}]
[null,null,null,null,null,null,null,null,null,null,null,null,"Total Zona C:",{"$f":"SUM(N19:N248)","v":794757.72000000009}]
[]
[null,"Fuente : Información proporcionada por las Entidades Federativas"]

{"sheet":"II D) 7 3","index":12,"n_rows":253,"n_cols":11,"rows_kept":253,"cut":false,"hidden":false,"merged":[[9,1,9,7],[8,9,8,10]]}
[]
[]
[]
[]
[]
[]
[]
[]
[null,"Formato: Catálogo de Percepciones y Deducciones",null,null,null,null,null,null,"Entidad Federativa:",{"$f":"IF('Caratula Resumen'!D21=\"Elige el Periodo…\",\"\",'Caratula Resumen'!D21)","v":" GUANAJUATO "}]
[null,{"$f":"IF('Caratula Resumen'!D22=\"Elige el Periodo…\",\"\",'Caratula Resumen'!D22)","v":"Fondo de Aportaciones para la Educación Tecnológica y de Adultos/Instituto Nacional para la Educación de los Adultos (FAETA/INEA)"},null,null,null,null,null,null,null,null,{"$f":"'A Y  II D3'!X10","v":"1er. Trimestre 2017"}]
[]
[]
[null,"Identificador origen presupuestal de la plaza","Tipo de concepto de pago ","Origen de financiamiento del concepto de percepciones.","Porcentaje de participación federal por fuente de recursos","Grupo al que pertenece concepto de pago (Percepción y/o Deducción)","Clave de concepto de pago","Descripción del concepto de pago ","Partida presupuestal","Fecha del","Fecha  al"]
[]
[null,"Identificador origen presupuestal de la plaza","Tipo de concepto de pago ","Origen de financiamiento del concepto de percepciones.","Porcentaje de participación federal por fuente de recursos","Grupo al que pertenece concepto de pago (Percepción y/o Deducción)","Clave de concepto de pago","Descripción del concepto de pago ","Partida presupuestal","Fecha del","Fecha  al"]
[null,1,"P","F",100,"P2",1,"SUELDOS",83101,20170227,20170227]
[null,1,"P","F",100,"P2",2,"PREVISION SOCIAL MUL.CONF",83101,20170227,20170227]
[null,1,"P","F",100,"P2",3,"COMPENSACION GARANTIZADA",83101,20170227,20170227]
[null,1,"P","F",100,"P2",4,"COMP. POR ANTI.(QUINQ. B)",83101,20170227,20170227]
[null,1,"P","F",100,"P2",5,"PRIMA VACACIONAL",83101,20170227,20170227]
[null,1,"P","F",100,"P2",6,"AGUINALDO",83101,20170227,20170227]
[null,1,"P","F",100,"P2",7,"COMPENSACION SEDENA",83101,20170227,20170227]
[null,1,"P","F",100,"P2",8,"COMPENSACION GARANT.",83101,20170227,20170227]
[null,1,"P","F",100,"P2",9,"DESPENSA",83101,20170227,20170227]
[null,1,"P","F",100,"P2",10,"OTRAS PRESTACIONES",83101,20170227,20170227]
[null,1,"P","F",100,"P2",11,"PREVISION SOCIAL MULTIPLE",83101,20170227,20170227]
[null,1,"P","F",100,"P2",12,"AYUDA PARA SERVICIOS",83101,20170227,20170227]
[null,1,"P","F",100,"P2",13,"BECAS",83101,20170227,20170227]
[null,1,"P","F",100,"P2",14,"AYUDA PARA SERVICIOS B",83101,20170227,20170227]
[null,1,"P","F",100,"P2",15,"DIAS DE PUNTUALIDAD",83101,20170227,20170227]
[null,1,"P","F",100,"P2",16,"HORARIO DISCONTINUO",83101,20170227,20170227]
[null,1,"P","F",100,"P2",17,"AYUDA DE GUARDERIA",83101,20170227,20170227]
[null,1,"P","F",100,"P2",18,"DIAS ECONOMICOS",83101,20170227,20170227]
[null,1,"P","F",100,"P2",19,"CREDITO AL SALARIO",83101,20170227,20170227]
[null,1,"P","F",100,"P2",20,"CAPACITACION Y DESARROLLO",83101,20170227,20170227]
[null,1,"P","F",100,"P2",21,"AYUDA PARA ANTEOJOS",83101,20170227,20170227]
[null,1,"P","F",100,"P2",22,"CREDITO SALARIO ANUAL",83101,20170227,20170227]
[null,1,"P","F",100,"P2",23,"SALARIO RETROACTIVO",83101,20170227,20170227]
[null,1,"P","F",100,"P2",24,"HOMOLOGACION",83101,20170227,20170227]
[null,1,"P","F",100,"P2",25,"CANASTA MATERNAL",83101,20170227,20170227]
[null,1,"P","F",100,"P2",26,"REMANENTE ESTIMULO",83101,20170227,20170227]
[null,1,"P","F",100,"P2",27,"COMPENSACION",83101,20170227,20170227]
[null,1,"P","F",100,"P2",28,"DEVOLUCION FONAC",83101,20170227,20170227]
[null,1,"P","F",100,"P2",29,"AYUDA PARA ANTEOJOS",83101,20170227,20170227]
[null,1,"P","F",100,"P2",30,"PARTE EXCENTA AGUINALDO",83101,20170227,20170227]
[null,1,"P","F",100,"P2",31,"PARTE EXCENTA PRIMA VAC.",83101,20170227,20170227]
[null,1,"P","F",100,"P2",32,"RECOMPENSA",83101,20170227,20170227]
[null,1,"P","F",100,"P2",33,"AYUDA POR DEFUNCION",83101,20170227,20170227]
[null,1,"P","F",100,"P2",34,"HORAS EXTRAORDINARIAS",83101,20170227,20170227]
[null,1,"P","F",100,"P2",35,"CAPACITACION Y DESARROLLO",83101,20170227,20170227]
[null,1,"P","F",100,"P2",36,"DEVOLUCION CREDINOMINA",83101,20170227,20170227]
[null,1,"P","F",100,"P2",37,"DEVOLUCION I.S.R.",83101,20170227,20170227]
[null,1,"P","F",100,"P2",38,"HORAS EXT. EXCENTAS",83101,20170227,20170227]
[null,1,"P","F",100,"P2",39,"DESPENSA MANDOS MEDIOS",83101,20170227,20170227]
[null,1,"P","F",100,"P2",40,"DIF.PROFES. B1 2004",83101,20170227,20170227]
[null,1,"P","F",100,"P2",41,"DIF.PROFES.B2 2004",83101,20170227,20170227]
[null,1,"P","F",100,"P2",42,"DIF.PROFES. C 2004",83101,20170227,20170227]
[null,1,"P","F",100,"P2",43,"DIF.COMP. POR ANTIGUEDAD",83101,20170227,20170227]
[null,1,"P","F",100,"P2",44,"DIF.PROFES. B1 2005",83101,20170227,20170227]
[null,1,"P","F",100,"P2",45,"DEVOLUCION DESPENSA",83101,20170227,20170227]
[null,1,"P","F",100,"P2",46,"DIF.PROFES. B2 2005",83101,20170227,20170227]
[null,1,"P","F",100,"P2",47,"DIF.PROFES. C 2005",83101,20170227,20170227]
[null,1,"P","F",100,"P2",48,"DIF.PROFES. C 2007",83101,20170227,20170227]
[null,1,"P","F",100,"P2",49,"DIF.PRI.ANT.07",83101,20170227,20170227]
[null,1,"P","F",100,"P2",50,"COMPENSACION POR ANTIGUED",83101,20170227,20170227]
[null,1,"P","F",100,"P2",51,"APARATOS ORTOPEDICOS",83101,20170227,20170227]
[null,1,"P","F",100,"P2",52,"AYUDA TITULACION",83101,20170227,20170227]
[null,1,"P","F",100,"P2",53,"RETROACTIVO QUINQUENIO",83101,20170227,20170227]
[null,1,"P","F",100,"P2",54,"APARATOS ORTOPEDICOS",83101,20170227,20170227]
[null,1,"P","F",100,"P2",55,"AYUDA TITULACION",83101,20170227,20170227]
[null,1,"P","F",100,"P2",56,"DIF.PRF.B107",83101,20170227,20170227]
[null,1,"P","F",100,"P2",57,"DIF.PER.SOC.MUL.07",83101,20170227,20170227]
[null,1,"P","F",100,"P2",58,"DIF. DIAS ECONOMICOS",83101,20170227,20170227]
[null,1,"P","F",100,"P2",59,"AGUINALDO EXCENTO",83101,20170227,20170227]
[null,1,"P","F",100,"P2",60,"GRATIFICACIﾓN POR RENUNCI",83101,20170227,20170227]
[null,1,"P","F",100,"P2",61,"PRIMA L.F.T.",83101,20170227,20170227]
[null,1,"P","F",100,"P2",62,"10. 15 Y 20 AﾑOS",83101,20170227,20170227]
[null,1,"P","F",100,"P2",63,"PROFESIONALIZACION B",83101,20170227,20170227]
[null,1,"P","F",100,"P2",64,"DIFERENCIA PENSION ALIMEN",83101,20170227,20170227]
[null,1,"P","F",100,"P2",65,"PROFESIONALIZACION  B2",83101,20170227,20170227]
[null,1,"P","F",100,"P2",66,"COMP.C.C.T.10.15 Y20 AﾑOS",83101,20170227,20170227]
[null,1,"P","F",100,"P2",67,"AYUDA DEFUNCION",83101,20170227,20170227]
[null,1,"P","F",100,"P2",68,"PROFESIONALIZACION C",83101,20170227,20170227]
[null,1,"P","F",100,"P2",69,"RETRO. PROF B 2008",83101,20170227,20170227]
[null,1,"P","F",100,"P2",70,"ESTIMULO PRODUCTIVIDAD",83101,20170227,20170227]
[null,1,"P","F",100,"P2",71,"VIATICOS",83101,20170227,20170227]
[null,1,"P","F",100,"P2",72,"DEVOLUCION PRES C.P.",83101,20170227,20170227]
[null,1,"P","F",100,"P2",73,"DEVOLUCION SEG. COL. RET",83101,20170227,20170227]
[null,1,"P","F",100,"P2",74,"DEVOLUCION SEG. SEG AHISA",83101,20170227,20170227]
[null,1,"P","F",100,"P2",75,"RETRO. PROF C 2008",83101,20170227,20170227]
[null,1,"P","F",100,"P2",76,"RETRO. CAP Y DES CONF",83101,20170227,20170227]
[null,1,"P","F",100,"P2",77,"RETRO. PRE. SOC. MUL. CF",83101,20170227,20170227]
[null,1,"P","F",100,"P2",78,"PRMA VAC. DIA ADICIONAL",83101,20170227,20170227]
[null,1,"P","F",100,"P2",79,"DIF.COMP.POR ANTI. 2008",83101,20170227,20170227]
[null,1,"P","F",100,"P2",80,"CUOTA SINDICAL FONAC",83101,20170227,20170227]
[null,1,"P","F",100,"P2",81,"DIF.COMP. POR ANT. 2009",83101,20170227,20170227]
[null,1,"P","F",100,"P2",82,"DIF. PROFB2. 2008",83101,20170227,20170227]
[null,1,"P","F",100,"P2",83,"DIAS POR AJUSTE ANUAL",83101,20170227,20170227]
[null,1,"P","F",100,"P2",84,"DEVOL.  ADEUDO POR PRESTA",83101,20170227,20170227]
[null,1,"P","F",100,"P2",85,"RETRO. CAN. ADIC. CONFIAN",83101,20170227,20170227]
[null,1,"P","F",100,"P2",86,"RETROACTIVO PROFB1 2009",83101,20170227,20170227]
[null,1,"P","F",100,"P2",87,"RETROACTIVO PROF.C 2009",83101,20170227,20170227]
[null,1,"P","F",100,"P2",88,"RETRO. C Y D 2008",83101,20170227,20170227]
[null,1,"P","F",100,"P2",89,"RETRO. C.ADIC 2008",83101,20170227,20170227]
[null,1,"P","F",100,"P2",90,"IMPUESTO ANUAL",83101,20170227,20170227]
[null,1,"P","F",100,"P2",91,"CANTIDAD POR UNICA VEZ",83101,20170227,20170227]
[null,1,"P","F",100,"P2",92,"PUNTUALIDAD PERFECTA",83101,20170227,20170227]
[null,1,"P","F",100,"P2",93,"RETRO. PSM 2008",83101,20170227,20170227]
[null,1,"P","F",100,"P2",94,"RETRO. DESP 2008",83101,20170227,20170227]
[null,1,"P","F",100,"P2",95,"DEVOLUCION POTECIACION",83101,20170227,20170227]
[null,1,"P","F",100,"P2",96,"DIF.PROFES. B1 2009",83101,20170227,20170227]
[null,1,"P","F",100,"P2",97,"DIF.PROFES. C 2009",83101,20170227,20170227]
[null,1,"P","F",100,"P2",98,"RETROACTIVO PROFB1",83101,20170227,20170227]
[null,1,"P","F",100,"P2",99,"RETROACTIVO PROFC",83101,20170227,20170227]
[null,1,"P","F",100,"P2",100,"PAGO EX. UNICO FSTSE-SHCP",83101,20170227,20170227]
[null,1,"P","F",100,"P2",101,"VALES DE DESPENSA",83101,20170227,20170227]
[null,1,"P","F",100,"P2",102,"VALES PRODUCTIVIDAD",83101,20170227,20170227]
[null,1,"P","F",100,"P2",103,"VALES BONO SEXENAL",83101,20170227,20170227]
[null,1,"P","F",100,"P2",104,"DEV. DIAS ECONOMINCOS",83101,20170227,20170227]
[null,1,"P","F",100,"P2",105,"PRIMA VACACIONAL MM",83101,20170227,20170227]
[null,1,"P","F",100,"P2",106,"QUINQUENIO C Y MM",83101,20170227,20170227]
[null,1,"P","F",100,"P2",107,"AJUSTE POR FALTAS",83101,20170227,20170227]
[null,1,"P","F",100,"P2",108,"RETROACTIVO QUINC Y MM",83101,20170227,20170227]
[null,1,"P","F",100,"P2",109,"LIQUIDACIONES",83101,20170227,20170227]
[null,1,"P","F",100,"P2",110,"DEVOLUCION AHORRO SOLIDAR",83101,20170227,20170227]
[null,1,"P","F",100,"P2",111,"DIA DE REYES",83101,20170227,20170227]
[null,1,"P","F",100,"P2",112,"DIA DE PADRE",83101,20170227,20170227]
[null,1,"P","F",100,"P2",113,"UTILES ESCOLARES",83101,20170227,20170227]
[null,1,"P","F",100,"P2",114,"PROFESIONALIZACION D",83101,20170227,20170227]
[null,1,"P","F",100,"P2",115,"RETROACTIVO PROF. D",83101,20170227,20170227]
[null,1,"P","F",100,"P2",116,"DIA DE REYES",83101,20170227,20170227]
[null,1,"P","F",100,"P2",117,"NOTAS BUENAS",83101,20170227,20170227]
[null,1,"P","F",100,"P2",119,"SUBSIDIO PARA EL EMPLEO",83101,20170227,20170227]
[null,1,"P","F",100,"P2",120,"DIF.COM.GARN.2010 MM",83101,20170227,20170227]
[null,1,"P","F",100,"P2",121,"COMP.LENTES 2010 EXC",83101,20170227,20170227]
[null,1,"P","F",100,"P2",122,"COMP.LENTES 2010 GRAV",83101,20170227,20170227]
[null,1,"P","F",100,"P2",123,"DIFERENCIA DESPENSA 2010",83101,20170227,20170227]
[null,1,"P","F",100,"P2",124,"DIF PREV. SOLCIAL 2010",83101,20170227,20170227]
[null,1,"P","F",100,"P2",125,"DIF CANTIDAD ADIC. 2010",83101,20170227,20170227]
[null,1,"P","F",100,"P2",126,"DIF CANTIDAD ADIC. 2009",83101,20170227,20170227]
[null,1,"P","F",100,"P2",127,"DIF PREV. SOCIAL",83101,20170227,20170227]
[null,1,"P","F",100,"P2",128,"DIA DEL TRABAJOR DEL INEA",83101,20170227,20170227]
[null,1,"P","F",100,"P2",130,"VACACIONES",83101,20170227,20170227]
[null,1,"P","F",100,"P2",160,"GRATF. POR RENUNCIA GRAVA",83101,20170227,20170227]
[null,1,"P","F",100,"P2",161,"PRIMA L.F.T. GRAVADA",83101,20170227,20170227]
[null,1,"P","F",100,"P2",201,"SUELDO HOMOLOGADO",83101,20170227,20170227]
[null,1,"P","F",100,"P2",203,"COMP HOMOLOGADA CONFIANZA",83101,20170227,20170227]
[null,1,"P","F",100,"P2",206,"AGUINALDO COMP.",83101,20170227,20170227]
[null,1,"P","F",100,"P2",208,"COMP HOMOLOGADA MANDO",83101,20170227,20170227]
[null,1,"P","F",100,"P2",400,"DIF. AYUDA POR SERV. B",83101,20170227,20170227]
[null,1,"P","F",100,"P2",401,"DIFERENCIA DE SUELDO",83101,20170227,20170227]
[null,1,"P","F",100,"P2",402,"DIV.ABRIL2005MAYO2006 POT",83101,20170227,20170227]
[null,1,"P","F",100,"P2",403,"DIF. COMPENSACION GARANTI",83101,20170227,20170227]
[null,1,"P","F",100,"P2",404,"DIVIDENDOS POTEN 2007",83101,20170227,20170227]
[null,1,"P","F",100,"P2",405,"DIF. PRIMA VACACIONAL",83101,20170227,20170227]
[null,1,"P","F",100,"P2",408,"DIF.COMP. GARANT.",83101,20170227,20170227]
[null,1,"P","F",100,"P2",409,"DIF DESPENSA",83101,20170227,20170227]
[null,1,"P","F",100,"P2",414,"DIF AYUDA SERVICIOS",83101,20170227,20170227]
[null,1,"P","F",100,"P2",415,"DIF. DIAS DE PUNTUALIDAD",83101,20170227,20170227]
[null,1,"P","F",100,"P2",418,"DIF. DIAS ECONOMICOS",83101,20170227,20170227]
[null,1,"P","F",100,"P2",420,"DIF CAPACITACION Y DESARR",83101,20170227,20170227]
[null,1,"P","F",100,"P2",450,"DIF COMP. POR ANTIG.",83101,20170227,20170227]
[null,1,"P","F",100,"P2",455,"DEVOLUCION FALTA",83101,20170227,20170227]
[null,1,"P","F",100,"P2",463,"RETROAC. PROFESIONALIZA",83101,20170227,20170227]
[null,1,"P","F",100,"P2",464,"DIF. PROF B1",83101,20170227,20170227]
[null,1,"P","F",100,"P2",466,"CONTINGENCIA LABORAL",83101,20170227,20170227]
[null,1,"P","F",100,"P2",467,"DEV. POR AYUDA EN DEFUNC",83101,20170227,20170227]
[null,1,"D",null,100,"D2",500,"SUSPENSIONES",83101,20170227,20170227]
[null,1,"D",null,100,"D2",501,"FALTAS",83101,20170227,20170227]
[null,1,"D",null,100,"D2",502,"COMPENSACION GARANT.",83101,20170227,20170227]
[null,1,"D",null,100,"D2",503,"HORARIO DISCONTINUO",83101,20170227,20170227]
[null,1,"D",null,100,"D2",504,"DONATIVOS",83101,20170227,20170227]
[null,1,"D",null,100,"D2",505,"CUOTA SINDICAL RETIRO",83101,20170227,20170227]
[null,1,"D",null,100,"D2",506,"AHORRO SOLIDARIO",83101,20170227,20170227]
[null,1,"D",null,100,"D2",507,"DEV. PREST. CAJA DE AHORR",83101,20170227,20170227]
[null,1,"D",null,100,"D2",508,"DEV. GUARDERIA",83101,20170227,20170227]
[null,1,"D",null,100,"D2",509,"CUENTAS POR COBRAR",83101,20170227,20170227]
[null,1,"D",null,100,"D2",518,"DEV. DIAS ECONOMICOS",83101,20170227,20170227]
[null,1,"D",null,100,"D2",519,"DEV. QUINQUENIOS",83101,20170227,20170227]
[null,1,"D",null,100,"D2",520,"DEV. PRIM VAC",83101,20170227,20170227]
[null,1,"D",null,100,"D2",521,"DEV. DESPENSA",83101,20170227,20170227]
[null,1,"D",null,100,"D2",522,"DEV. AYUDA PARA SERV. B",83101,20170227,20170227]
[null,1,"D",null,100,"D2",523,"DEV. SUELDOS",83101,20170227,20170227]
[null,1,"D",null,100,"D2",524,"DEV. CAP. Y DES",83101,20170227,20170227]
[null,1,"D",null,100,"D2",525,"DEV. PREV. SOCIAL MULTIPL",83101,20170227,20170227]
[null,1,"D",null,100,"D2",526,"DEV. AYUDA PARA SERV.",83101,20170227,20170227]
[null,1,"D",null,100,"D2",529,"CREDITO DINAMO",83101,20170227,20170227]
[null,1,"D",null,100,"D2",530,"ISR",83101,20170227,20170227]
[null,1,"D",null,100,"D2",531,"DIFERENCIA ISR",83101,20170227,20170227]
[null,1,"D",null,100,"D2",532,"IMPUESTO ANUAL",83101,20170227,20170227]
[null,1,"D",null,100,"D2",533,"I.S.R.ESTIMULO 10 15 Y 20",83101,20170227,20170227]
[null,1,"D",null,100,"D2",534,"AJUSTE ESTIMULO 10 AﾑOS",83101,20170227,20170227]
[null,1,"D",null,100,"D2",535,"IMPUESTO AGUINALDO",83101,20170227,20170227]
[null,1,"D",null,100,"D2",536,"AJUSTE BONIFICACION",83101,20170227,20170227]
[null,1,"D",null,100,"D2",537,"CREDITO SALARIO ANUAL",83101,20170227,20170227]
[null,1,"D",null,100,"D2",538,"DEVOLUCION PUNTUALIDAD",83101,20170227,20170227]
[null,1,"D",null,100,"D2",539,"GASTOS FUNERARIOS",83101,20170227,20170227]
[null,1,"D",null,100,"D2",540,"SERV.MED/MAT.ISSSTE",83101,20170227,20170227]
[null,1,"D",null,100,"D2",541,"FONDO/PENSION ISSSTE",83101,20170227,20170227]
[null,1,"D",null,100,"D2",542,"PRESTAMO C.P. ISSSTE",83101,20170227,20170227]
[null,1,"D",null,100,"D2",543,"PRESTAMO COMPLEM. ISSSTE",83101,20170227,20170227]
[null,1,"D",null,100,"D2",544,"PRES. HIP. FOVISSSTE",83101,20170227,20170227]
[null,1,"D",null,100,"D2",545,"DIF. 8% ISSSTE",83101,20170227,20170227]
[null,1,"D",null,100,"D2",546,"DEVOLUCIONES VARIAS",83101,20170227,20170227]
[null,1,"D",null,100,"D2",547,"DEVOLUCION VIATICOS",83101,20170227,20170227]
[null,1,"D",null,100,"D2",548,"AYUDA CRUZ ROJA",83101,20170227,20170227]
[null,1,"D",null,100,"D2",549,"ADEUDO POR PRESTAMO",83101,20170227,20170227]
[null,1,"D",null,100,"D2",550,"CUOTA SINDICAL",83101,20170227,20170227]
[null,1,"D",null,100,"D2",551,"PENSION ALIMENTICIA",83101,20170227,20170227]
[null,1,"D",null,100,"D2",552,"DIFERENCIA ANTEOJOS",83101,20170227,20170227]
[null,1,"D",null,100,"D2",553,"DEVOLUCION ANTEOJOS",83101,20170227,20170227]
[null,1,"D",null,100,"D2",554,"DIF PENSION ALIMENTICIA",83101,20170227,20170227]
[null,1,"D",null,100,"D2",555,"DEV.CAN.ADIC.2010 T.S.T.D",83101,20170227,20170227]
[null,1,"D",null,100,"D2",556,"GTOS. FUNER. SAN RAFAEL",83101,20170227,20170227]
[null,1,"D",null,100,"D2",558,"AJUSTE POR AYUDA DE LENTE",83101,20170227,20170227]
[null,1,"D",null,100,"D2",560,"MULTISEGURO",83101,20170227,20170227]
[null,1,"D",null,100,"D2",561,"GPO.SEG. DIVERSOS",83101,20170227,20170227]
[null,1,"D",null,100,"D2",562,"SEG. VIDA IND AHISA",83101,20170227,20170227]
[null,1,"D",null,100,"D2",563,"SEGURO COL. DE RETIRO",83101,20170227,20170227]
[null,1,"D",null,100,"D2",564,"POT. SEGURO DE VIDA",83101,20170227,20170227]
[null,1,"D",null,100,"D2",565,"DEV. SEGURO CAP.",83101,20170227,20170227]
[null,1,"D",null,100,"D2",566,"CAJA DE AHORRO",83101,20170227,20170227]
[null,1,"D",null,100,"D2",567,"PRESTAMO CAJA DE AHORRO",83101,20170227,20170227]
[null,1,"D",null,100,"D2",569,"DEVOLUCION FONAC",83101,20170227,20170227]
[null,1,"D",null,100,"D2",570,"ANTICIPO DE SUELDO",83101,20170227,20170227]
[null,1,"D",null,100,"D2",571,"FONDO DE AHORRO CAP.",83101,20170227,20170227]
[null,1,"D",null,100,"D2",572,"CAJA DE AHORRO CUOTA",83101,20170227,20170227]
[null,1,"D",null,100,"D2",573,"PRESTAMO CAJA AHORROS",83101,20170227,20170227]
[null,1,"D",null,100,"D2",574,"FONACOT",83101,20170227,20170227]
[null,1,"D",null,100,"D2",575,"PAQUETE DEPORTIVO",83101,20170227,20170227]
[null,1,"D",null,100,"D2",576,"ANTICIPO ESTIMULO M.M.",83101,20170227,20170227]
[null,1,"D",null,100,"D2",577,"GASTOS MEDICOS MAYORES",83101,20170227,20170227]
[null,1,"D",null,100,"D2",578,"SEGUROS FOVISSSTE",83101,20170227,20170227]
[null,1,"D",null,100,"D2",579,"CREDITOS LIBERTAD",83101,20170227,20170227]
[null,1,"D",null,100,"D2",580,"CREDI-NOMINA ADIC.",83101,20170227,20170227]
[null,1,"D",null,100,"D2",581,"DEVOLUCION CREDINOMINA",83101,20170227,20170227]
[null,1,"D",null,100,"D2",582,"ACRENOMINA",83101,20170227,20170227]
[null,1,"D",null,100,"D2",583,"RETROACTIVO FONDO DE AHOR",83101,20170227,20170227]
[null,1,"D",null,100,"D2",584,"DIF. ACRENOMINA",83101,20170227,20170227]
[null,1,"D",null,100,"D2",585,"DEV. PRES. C.P.",83101,20170227,20170227]
[null,1,"D",null,100,"D2",586,"DEV. SEG.COL.RET.",83101,20170227,20170227]
[null,1,"D",null,100,"D2",587,"DEV. SEG. AHISA",83101,20170227,20170227]
[null,1,"D",null,100,"D2",588,"AYUDA DEFUNCION  A COMPAﾑ",83101,20170227,20170227]
[null,1,"D",null,100,"D2",589,"ADEUDO CAJA AHORRO",83101,20170227,20170227]
[null,1,"D",null,100,"D2",590,"DEV.DES MM 2010",83101,20170227,20170227]
[null,1,"D",null,100,"D2",591,"DEV. SUELDO MM 2010",83101,20170227,20170227]
[null,1,"D",null,100,"D2",594,"POT. SEGURO DE VIDA SURA",83101,20170227,20170227]
[null,1,"D",null,100,"D2",595,"ALIANZA LA MERCED",83101,20170227,20170227]
[null,1,"D",null,100,"D2",596,"OPTICA OPTIC COLOR",83101,20170227,20170227]
[null,1,"D",null,100,"D2",597,"OPTICA OPTIFOTO",83101,20170227,20170227]
[null,1,"D",null,100,"D2",600,"AJUSTE COMP. POR ANT.",83101,20170227,20170227]
[null,1,"D",null,100,"D2",801,"DIF. FALTAS",83101,20170227,20170227]
[null,"Fuente : Información proporcionada por las Entidades Federativas"]

{"sheet":"E)","index":13,"n_rows":26,"n_cols":8,"rows_kept":26,"cut":false,"hidden":false,"merged":[[9,1,9,5],[12,1,14,1],[12,2,14,2],[13,7,14,7],[12,3,14,3],[12,4,14,4],[12,5,12,7],[13,5,14,5],[13,6,14,6]]}
[]
[]
[]
[]
[]
[]
[]
[]
[null,"Formato: Trabajadores que Cobran con RFC / CURP con Formato Incorrecto"]
[null,{"$f":"IF('Caratula Resumen'!D22=\"Elige el Periodo…\",\"\",'Caratula Resumen'!D22)","v":"Fondo de Aportaciones para la Educación Tecnológica y de Adultos/Instituto Nacional para la Educación de los Adultos (FAETA/INEA)"},null,null,null,null,null,{"$f":"'A Y  II D3'!X10","v":"1er. Trimestre 2017"}]
[]
[]
[null,"Entidad Federativa","RFC","CURP","NOMBRE TRABAJADOR","Motivo"]
[null,null,null,null,null,"Sin RFC o erroneo","RFC Sin Homoclave","Sin CURP o Erronea"]
[]
[]
[null,"Entidad Federativa","RFC","CURP","NOMBRE TRABAJADOR","Sin RFC o erroneo","RFC Sin Homoclave","Sin CURP o Erronea"]
[]
[]
[]
[]
[]
[null,"Total Personas : ",null,null,"Total Sin RFC o Erroneo:"]
[null,null,null,null,null,"Total RFC Sin Homoclave:"]
[null,null,null,null,null,null,"Total Sin CURP o Erroneo:"]
[null,"Fuente : Información proporcionada por las Entidades Federativas"]

{"sheet":"F) 1","index":14,"n_rows":26,"n_cols":19,"rows_kept":26,"cut":false,"hidden":false,"merged":[[9,1,9,6],[12,15,13,15],[12,16,13,16],[12,17,12,18],[12,1,13,1],[12,2,13,2],[12,3,13,3],[12,4,13,4],[12,5,13,5],[12,6,13,6],[12,7,13,7],[12,8,12,14]]}
[]
[]
[]
[]
[]
[]
[]
[]
[null,"Formato: Trabajadores con Doble Asignación Salarial en Municipios no Colindantes Geográficamente"]
[null,{"$f":"IF('Caratula Resumen'!D22=\"Elige el Periodo…\",\"\",'Caratula Resumen'!D22)","v":"Fondo de Aportaciones para la Educación Tecnológica y de Adultos/Instituto Nacional para la Educación de los Adultos (FAETA/INEA)"},null,null,null,null,null,null,null,null,null,null,null,null,null,null,null,{"$f":"'A Y  II D3'!X10","v":"1er. Trimestre 2017"}]
[]
[]
[null,"Entidad Federativa","Municipio","Localidad","RFC","CURP","Nombre del Trabajador","Clave integrada","Clave Presupuestal",null,null,null,null,null,null,"Clave CT","Nombre CT","Periodo en el CT"]
[null,null,null,null,null,null,null,null,"Partida Presupuestal","Código de Pago","Clave de Unidad","Clave de Sub Unidad","Clave de Categoría","Horas Semana Mes ","Número de Plaza",null,null,"Desde","Hasta"]
[]
[null,"Entidad Federativa","Municipio","Localidad","RFC","CURP","Nombre del Trabajador","Clave integrada","Partida Presupuestal","Código de Pago","Clave de Unidad","Clave de Sub Unidad","Clave de Categoría","Horas semana mes","Número de Plaza","Clave CT","Nombre CT","Periodo en el CT\nDesde","Periodo en el CTH\nasta"]
[]
[]
[]
[]
[]
[null,"Total Personas : ",null,null,null,null,null,null,null,null,null,null,"Total Plazas : "]
[]
[]
[null,"Fuente : Información proporcionada por las Entidades Federativas"]
[null,"Importante: Listar Sólo los Municipios no Colindantes"]

{"sheet":"F) 2","index":15,"n_rows":22,"n_cols":20,"rows_kept":22,"cut":false,"hidden":false,"merged":[[13,3,14,3],[13,4,14,4],[13,5,14,5],[10,1,10,9],[13,19,14,19],[13,18,14,18],[13,6,13,12],[13,13,14,13],[13,14,14,14],[13,15,14,15],[13,16,13,17],[13,1,14,1],[13,2,14,2]]}
[]
[]
[]
[]
[]
[]
[]
[]
[]
[null,"Formato: Trabajadores Ocupando Plazas que Superan el Número de Horas de Compatibilidad Autorizadas"]
[null,{"$f":"IF('Caratula Resumen'!D22=\"Elige el Periodo…\",\"\",'Caratula Resumen'!D22)","v":"Fondo de Aportaciones para la Educación Tecnológica y de Adultos/Instituto Nacional para la Educación de los Adultos (FAETA/INEA)"},null,null,null,null,null,null,null,null,null,null,null,null,null,null,null,{"$f":"'A Y  II D3'!X10","v":"1er. Trimestre 2017"}]
[]
[]
[null,"Entidad Federativa","RFC","CURP","Nombre","Clave integrada","Clave Presupuestal",null,null,null,null,null,null,"CT","Nombre CT","Turno CT","Periodo",null,"Total de Horas en el CT","Horas de compatibilidad de la categoría"]
[null,null,null,null,null,null,"Partida Presupuestal","Código de Pago","Clave de Unidad","Clave de Sub Unidad","Clave de Categoría","Horas Semana Mes ","Número de Plaza",null,null,null,"Desde","Hasta"]
[]
[null,"Entidad Federativa","RFC","CURP","Nombre","Clave integrada","Partida Presupuestal","Código de Pago","Clave de Unidad","Clave de Sub Unidad","Clave de Categoría","Horas semana mes","Número de plaza","CT","Nombre CT","Turno CT","Periodo\nDesde","Periodo\nHasta","Total de Horas en el CT","Horas de compatibilidad de la categoría"]
[null,"GUANAJAUTO","GOGR650725KF1","GOGR650725HGTNRB02","ROBERTO GONZALEZ GARCIA","831011721T0382000.0",83101,1,7,41,"T03820",0,235,0,0,100,0,0,0,0]
[null,"Total Personas : ",1,null,null,null,null,null,null,null,"Total Plazas : ",null,1]
[]
[]
[null,"Fuente : Información proporcionada por las Entidades Federativas"]

{"sheet":"G)","index":16,"n_rows":27,"n_cols":20,"rows_kept":27,"cut":false,"hidden":false,"merged":[[13,19,14,19],[13,13,14,13],[13,14,14,14],[13,15,13,16],[13,17,14,17],[13,18,14,18],[10,1,10,8],[12,5,12,11],[13,1,14,1],[13,2,14,2],[13,3,14,3],[13,4,14,4],[13,5,14,5],[13,6,13,12]]}
[]
[]
[]
[]
[]
[]
[]
[]
[]
[null,"Formato: Trabajadores Cuyo Salario Básico Supere los Ingresos Promedio de un Docente en la Categoría más Alta del Tabulador Salarial Correspondiente a Cada Entidad"]
[null,{"$f":"IF('Caratula Resumen'!D22=\"Elige el Periodo…\",\"\",'Caratula Resumen'!D22)","v":"Fondo de Aportaciones para la Educación Tecnológica y de Adultos/Instituto Nacional para la Educación de los Adultos (FAETA/INEA)"},null,null,null,null,null,null,null,null,null,null,null,null,null,null,null,null,{"$f":"'A Y  II D3'!X10","v":"1er. Trimestre 2017"}]
[]
[]
[null,"Entidad Federativa","R.F.C.","CURP","Nombre","Clave integrada","Clave Presupuestal Integrada y Categoria aparte",null,null,null,null,null,null,"Clave CT Origen","Nombre CT","Periodo",null,"Monto de Remuneraciones Mensuales ","Monto de referencia","Diferencia\n(R-S)"]
[null,null,null,null,null,null,"Partida Presupuestal","Código de Pago","Clave de Unidad","Clave de Sub Unidad","Clave de Categoría","Horas Semana Mes ","Número de Plaza",null,null,"Desde","Hasta"]
[]
[null,"Entidad Federativa","R.F.C.","CURP","Nombre","Clave integrada","Partida Presupuestal","Código de Pago","Clave de Unidad","Clave de Sub Unidad","Clave de Categoría","Horas Semana Mes ","No. de plaza","CT","Nombre CT","Periodo\nDesde","Periodo\nHasta","Monto de Remuneraciones Mensuales ","Monto de referencia","Diferencia\n(R-S)"]
[]
[]
[]
[]
[]
[null,"Total Personas : ",null,null,null,null,null,null,null,null,null,null,null,null,"Total Remuneraciones Mensuales:"]
[]
[null,null,null,null,null,null,null,null,null,null,null,null,null,null,null,null,null,"Total Diferencia:"]
[]
[null,"Fuente : Información proporcionada por las Entidades Federativas"]

{"sheet":"Listas","index":17,"n_rows":42,"n_cols":8,"rows_kept":42,"cut":false,"hidden":true,"merged":[]}
[]
[]
[]
[null,"Elige un Fondo…"]
[null,"Fondo de Aportaciones para la Educación Básica y Normal (FAEB)"]
[null,"Fondo de Aportaciones para la Educación Tecnológica y de Adultos/Colegio Nacional de Educación Profesional Técnica (FAETA/CONALEP)"]
[null,"Fondo de Aportaciones para la Educación Tecnológica y de Adultos/Instituto Nacional para la Educación de los Adultos (FAETA/INEA)"]
[]
[]
[null,null,null,null,null,null,null,"Elige la Entidad Federativa…"]
[null,"Elige el Periodo…",null,null,null,null,null,"AGUASCALIENTES"]
[null,"1er. Trimestre",null,null,null,null,null,"BAJA CALIFORNIA"]
[null,"2do. Trimestre",null,null,null,null,null,"BAJA CALIFORNIA SUR"]
[null,"3er. Trimestre",null,null,null,null,null,"CAMPECHE"]
[null,"4to. Trimestre",null,null,null,null,null,"COAHUILA "]
[null,null,null,"Elige el Año…",null,null,null,"COLIMA "]
[null,null,null,2013,null,null,null,"CHIAPAS "]
[null,null,null,2014,null,null,null,"CHIHUAHUA "]
[null,null,null,2015,null,null,null,"DISTRITO FEDERAL"]
[null,null,null,2016,null,null,null," DURANGO "]
[null,null,null,2017,null,null,null," GUANAJUATO "]
[null,null,null,2018,null,null,null," GUERRERO "]
[null,null,null,null,null,null,null," HIDALGO"]
[null,null,null,null,null,null,null," JALISCO "]
[null,null,null,null,null,null,null," MEXICO "]
[null,null,null,null,null,null,null," MICHOACAN "]
[null,null,null,null,null,null,null," MORELOS "]
[null,null,null,null,null,null,null," NAYARIT "]
[null,null,null,null,null,null,null," NUEVO LEON"]
[null,null,null,null,null,null,null," OAXACA "]
[null,null,null,null,null,null,null," PUEBLA "]
[null,null,null,null,null,null,null," QUERETARO "]
[null,null,null,null,null,null,null," QUINTANA ROO"]
[null,null,null,null,null,null,null," SAN LUIS"]
[null,null,null,null,null,null,null," SINALOA "]
[null,null,null,null,null,null,null," SONORA "]
[null,null,null,null,null,null,null," TABASCO "]
[null,null,null,null,null,null,null," TAMAULIPAS "]
[null,null,null,null,null,null,null," TLAXCALA "]
[null,null,null,null,null,null,null," VERACRUZ"]
[null,null,null,null,null,null,null," YUCATÁN "]
[null,null,null,null,null,null,null," ZACATECAS "]