{"text_format":"1","workbook":"xlsx","n_sheets":18,"sheets":["Caratula Resumen","A Y  II D3","A Y II D4","B)","II B) Y 1","II C y 1_","II D) 2","II D) 4","II D) 4 A","II D) 6","II D) 7 1","II D) 7 2 ","II D) 7 3","E)","F) 1","F) 2","G)","Listas"],"not_rendered":{"charts":0,"images":18,"macros":1,"external_links":0,"defined_names":17,"comments":16,"pivot_tables":0},"unopened":[],"bounds":{"document_bytes":16777216,"sheet_cells":100000,"rows_first":2000,"rows_last":500,"rows_between":2000,"halvings":0,"cell_chars":16384,"cell_head_chars":4096},"cells_cut":0,"cells_raw":0,"read":"whole","date_system":"1900"}

{"sheet":"Caratula Resumen","index":0,"n_rows":73,"n_cols":18,"rows_kept":73,"cut":false,"hidden":false,"merged":[[69,2,69,5],[71,2,71,5],[72,2,72,5],[73,2,73,5],[20,3,20,14],[21,3,21,14],[22,3,22,14],[49,3,49,6],[62,2,62,5],[63,2,63,5],[65,2,65,5],[66,2,66,5],[68,2,68,5],[43,3,43,6],[44,3,44,6],[45,3,45,6],[46,3,46,6],[47,3,47,6],[48,3,48,6],[37,3,37,6],[38,3,38,6],[39,3,39,6],[40,3,40,6],[41,3,41,6],[42,3,42,6],[36,3,36,6],[10,3,10,18],[11,3,11,18],[12,3,12,18],[34,3,34,6],[35,3,35,6]]}
[]
[]
[]
[]
[]
[]
[]
[]
[]
[]
[]
[null,null,null,"FORMATOS ENTREGADOS PARA DAR CUMPLIMIENTO AL ARTICULO 73 DE \"LA LEY GENERAL DE CONTABILIDAD GUBERNAMENTAL\""]
[]
[]
[]
[]
[]
[]
[]
[]
[null,null,"Entidad Federativa :"," GUANAJUATO "]
[null,null,"Fondo :","Fondo de Aportaciones para la Educación Tecnológica y de Adultos/Instituto Nacional para la Educación de los Adultos (FAETA/INEA)"]
[null,null,"Periodo :","2do. Trimestre"]
[]
[]
[]
[]
[]
[]
[]
[]
[null,null,null,null,null,null,null,"TOTAL REGISTROS ",null,"Num. de Paginas",null,"TOTAL PERSONAS",null,"TOTAL PLAZAS",null,"Total Pto. Federal",null,"Total Ppto. Otras Fuentes"]
[]
[]
[null,1,"A Y II D3","Personal Comisionado",null,null,null,0,null,1,null,0,null,0,null,0,null,0]
[null,2,"A Y II D4","Personal con Licencia",null,null,null,10,null,1,null,10,null,3,null,0,null,0]
[null,3,"B)   ","Registro Federal de Contribuyentes de Trabajadores con Pagos Retroactivos con un Periodo Mayor a 45 días",null,null,null,0,null,1,null,0,null,0,null,"N/A",null,"N/A"]
[null,4,"II B) Y 1","Plaza / Función",null,null,null,270,null,6,null,270,null,"N/A",null,"N/A",null,"N/A"]
[null,5,"II C y 1_","Personal Federalizado por Registro Federal de Contribuyentes",null,null,null,330,null,8,null,330,null,330,null,{"$f":"SUBTOTAL(109,Tabla12[Percepciones pagadas en el Periodo de Comisión con Presupuesto Federal*])","v":12066977},null,0]
[null,6,"II D) 2","Movimientos de Plazas",null,null,null,263,null,10,null,263,null,263,null,"N/A",null,"N/A"]
[null,7,"II D) 4","Trabajadores Jubilados en el Periodo",null,null,null,0,null,0,null,0,null,0,null,"N/A",null,"N/A"]
[null,8,"II D) 4 A","Trabajadores que Tramitaron Licencia Prejubilatoria en el Periodo",null,null,null,0,null,0,null,0,null,0,null,0,null,0]
[null,9,"II D) 6","Trabajadores Contratados por Honorarios en el Periodo",null,null,null,0,null,0,null,0,null,"N/A",null,"N/A",null,"N/A"]
[null,10,"II D) 7 1 ","Analítico de Categorías / Plazas Autorizadas con su Tabulador",null,null,null,19,null,1,null,"N/A",null,"N/A",null,"N/A",null,"N/A"]
[null,11,"II D) 7 2 ","Catálogo de Categorías y Tabuladores",null,null,null,204,null,6,null,"N/A",null,"N/A",null,"N/A",null,"N/A"]
[null,12,"II D) 7 3 ","Catálogo de Percepciones y Deducciones",null,null,null,227,null,7,null,"N/A",null,"N/A",null,"N/A",null,"N/A"]
[null,13,"E)","Trabajadores que Cobran con RFC / CURP con Formato Incorrecto",null,null,null,0,null,0,null,0,null,"N/A",null,"N/A",null,"N/A"]
[null,14,"F) 1","Trabajadores con Doble Asignación Salarial en Municipios no Colindantes Geográficamente",null,null,null,0,null,0,null,0,null,"N/A",null,"N/A",null,"N/A"]
[null,15,"F) 2","Trabajadores Ocupando Plazas que Superan el Número de Horas de Compatibilidad Autorizadas",null,null,null,1,null,1,null,1,null,1,null,"N/A",null,"N/A"]
[null,16,"G)","Trabajadores Cuyo Salario Básico Supere los Ingresos Promedio de un Docente en la Categoría más Alta del Tabulador Salarial Correspondiente a Cada Entidad",null,null,null,0,null,0,null,0,null,"N/A",null,"N/A",null,"N/A"]
[]
[]
[]
[]
[]
[]
[]
[]
[]
[]
[]
[]
[null,null,"C.P. ESMERALDA HERNANDEZ ESCOGIDO"]
[null,null,"Nombre del  Responsable"]
[]
[null,null,"SUBJEFE DE NOMINA FEDERAL"]
[null,null,"Cargo"]
[]
[]
[null,null,"Firma"]
[]
[null,null,"18 DE JULIO DE 2016"]
[null,null,"Fecha"]

{"sheet":"A Y  II D3","index":1,"n_rows":27,"n_cols":25,"rows_kept":27,"cut":false,"hidden":false,"merged":[[9,1,9,7],[12,6,12,12],[12,1,13,1],[12,2,13,2],[12,3,13,3],[12,4,13,4],[12,5,13,5],[23,12,23,14],[12,24,13,24],[12,13,12,14],[12,15,13,15],[12,16,13,16],[12,17,13,17],[12,18,12,19],[12,20,13,20],[21,13,21,14],[12,21,13,21],[12,22,13,22],[12,23,13,23]]}
[]
[]
[]
[]
[]
[]
[]
[]
[null,"Formato: Personal Comisionado"]
[null,{"$f":"IF('Caratula Resumen'!D22=\"Elige el Periodo…\",\"\",'Caratula Resumen'!D22)","v":"Fondo de Aportaciones para la Educación Tecnológica y de Adultos/Instituto Nacional para la Educación de los Adultos (FAETA/INEA)"},null,null,null,null,null,null,null,null,null,null,null,null,null,null,null,null,null,null,null,null,null,"2do. Trimestre 2016"]
[]
[]
[null,"Entidad Federativa","R.F.C.","CURP","Nombre","Clave integrada","Clave Presupuestal",null,null,null,null,null,null,"Fecha Comisión",null,"Percepciones pagadas en el Periodo de Comisión con Presupuesto Federal*","Percepciones pagadas en el Periodo de Comisión con Presupuesto de otra fuente*","Clave CT Origen","CT Destino dentro del sector",null,"Lugar de la comisión fuera del sector educativo","Tipo de Comisión","Función Específica","Objeto de la comision","No. Oficio"]
[null,null,null,null,null,null,"Partida Presupuestal","Código de Pago","Clave de Unidad","Clave de Sub Unidad","Clave de Categoría","Horas Semana Mes ","Número de Plaza","Inicio","Conclusión",null,null,null,"Clave","Turno"]
[]
[null,"Entidad Federativa","R.F.C.","CURP","Nombre","Clave integrada","Partida Presupuestal","Código de Pago","Clave de Unidad","Clave de Sub Unidad","Clave de Categoría","Horas Semana Mes ","Número de Plaza","Fecha Comisión\nInicio","Fecha Comisión\nConclusión","Percepciones pagadas en el Periodo de Comisión con Presupuesto Federal*","Percepciones pagadas en el Periodo de Comisión con Presupuesto de otra fuente*","Clave CT Origen","Clave","Turno","Lugar de la comisión fuera del sector educativo","Tipo de Comisión","Función Específica","Objeto de la comision","No. Oficio"]
[]
[]
[]
[]
[]
[null,"Total Personas : ",null,null,null,null,null,null,null,null,"Total Plazas : ",null,null,"Total Pto. Federal"]
[]
[null,null,null,null,null,null,null,null,null,null,null,null,"Total Ppto. Otras Fuentes"]
[]
[null,"*Total de Percepciones reportadas por la Entidad Federativa como pagadas al trabajador durante la comisión."]
[null,"Fuente : Información proporcionada por las Entidades Federativas."]

{"sheet":"A Y II D4","index":2,"n_rows":32,"n_cols":21,"rows_kept":32,"cut":false,"hidden":false,"merged":[[9,1,9,6],[26,13,26,14],[12,16,13,16],[12,17,13,17],[12,20,13,20],[12,1,13,1],[12,3,13,3],[12,4,13,4],[12,5,13,5],[12,6,12,12],[12,13,12,14],[12,2,13,2],[12,18,12,19],[12,15,13,15]]}
[]
[]
[]
[]
[]
[]
[]
[]
[null,"Formato: Personal con Licencia"]
[null,{"$f":"IF('Caratula Resumen'!D22=\"Elige el Periodo…\",\"\",'Caratula Resumen'!D22)","v":"Fondo de Aportaciones para la Educación Tecnológica y de Adultos/Instituto Nacional para la Educación de los Adultos (FAETA/INEA)"},null,null,null,null,null,null,null,null,null,null,null,null,null,null,null,null,null,null,"2do. Trimestre 2016"]
[]
[]
[null,"Entidad Federativa","R.F.C.","CURP","NOMBRE","Clave integrada","Clave Presupuestal",null,null,null,null,null,null,"Periodo Licencia",null,"Percepciones pagadas en el Periodo de la Licencia con Presupuesto Federal*","Percepciones pagadas en el Periodo de la Licencia con Presupuesto de otra fuente*","Clave CT Origen","Licencia",null,"Descripción de la Licencia"]
[null,null,null,null,null,null,"Partida Presupuestal","Código de Pago","Clave de Unidad","Clave de Sub Unidad","Clave de Categoría","Horas Semana Mes ","Número de Plaza","Inicio","Conclusión",null,null,null,"Clave","Tipo"]
[]
[null,"Entidad Federativa","R.F.C.","CURP","NOMBRE","Clave integrada","Partida Presupuestal","Código de Pago","Clave de Unidad","Clave de Sub Unidad","Clave de Categoría","Horas Semana Mes ","Número de Plaza","Periodo Licencia\nInicio","Periodo Licencia\nConclusión","Percepciones pagadas en el Periodo de la Licencia con Presupuesto Federal*","Percepciones pagadas en el Periodo de la Licencia con Presupuesto de otra fuente*","Clave CT Origen","Licencia\nClave","Licencia\nTipo","Descripción de la Licencia"]
[null,"GUANAJUATO","LOVE3907178K6","LOVE390717MGTPZS07","MA. ESTELA LOPEZ VAZQUEZ","831011720A0180700.0340",83101,1,7,20,"A01807",0,340,20160616,20160630,5610.34,1357.19,5610.34,1357.19,"CON GOCE DE SUELDO","PREJUBILATORIA"]
[null,"GUANAJUATO","ZACR521017I51","ZACR521017HGTMRG01","ROGELIO ARTURO ZAMARRIPA CRUZ","831011715T0382000.077",83101,1,7,15,"T03820",0,77,20160616,20160630,6849.67,3053.22,6849.67,3053.22,"CON GOCE DE SUELDO","PREJUBILATORIA"]
[null,"GUANAJUATO","LOSS570105T33","LOSS570105MTSZLS00","SUSANA ENRIQUETA LOZANO SALCEDO","831011741A0180600.0116",83101,1,7,41,"A01806",0,116,20160616,20160630,null,0,null,0,"CON GOCE DE SUELDO","PREJUBILATORIA"]
[null,"GUANAJUATO","HEPC690801P80","HEPC690801MGTRRR08","MA. DEL CARMEN HERNANDEZ PEREZ","831011727T0382000.01221",83101,1,7,27,"T03820",0,1221,20160616,20160630,6528.74,3887.8,6528.74,3887.8,"CON GOCE DE SUELDO","SINDICAL"]
[null,"GUANAJUATO","RIHM750221AD5","RIHM750221HGTSRG01","MIGUEL DAMICIO RIOS HERNANDEZ","831011718T0382000.02174",83101,1,7,18,"T03820",0,2174,20160616,20160630,6368.27,2708.88,6368.27,2708.88,"CON GOCE DE SUELDO","MEDICA"]
[null,"GUANAJUATO","RACR700730AH9","RACR700730MGTZNB06","REBECA RAZO CANO","831011720T0382000.02702",83101,1,7,20,"T03820",0,2702,20160616,20160630,null,0,null,0,"CON GOCE DE SUELDO","MEDICA"]
[null,"GUANAJUATO","FOMO6906162N2","FOMO690616HGTNDS05","OSCAR FONSECA MEDRANO","831011727T0382000.065",83101,1,7,27,"T03820",0,65,20160616,20160630,6344.08,6178.23,6344.08,6178.23,"CON GOCE DE SUELDO","SINDICAL"]
[null,"GUANAJUATO","LOCJ8109121HA","LOCJ810912HDFPRN00","JUAN CARLOS LOPEZ CRUZ","831011713A0380400.02592",83101,1,7,13,"A03804",0,2592,20160616,20160630,5045.55,4024.78,5045.55,4024.78,"CON GOCE DE SUELDO","SINDICAL"]
[null,"GUANAJUATO","MOCK900306NE6","MOCK900306MDFRSR15","KAREN ANEL MORENO CASTILLO","831011713T0382000.01228",83101,1,7,13,"T03820",0,1228,20160616,20160630,5106.26,2280.59,5106.26,2280.59,"CON GOCE DE SUELDO","SINDICAL"]
[null,"GUANAJUATO","CAGJ791209EN4","CAGJ791209HGTRTR01","JORGE ADRIAN CARDENAS GUTIERREZ","831011714T0382000.02462",83101,1,7,14,"T03820",0,2462,20160616,20160630,null,0,null,0,"CON GOCE DE SUELDO","MEDICA"]
[null,"Total Personas : ",10,null,null,null,null,null,null,null,"Total Plazas : ",null,10,"Total Pto. Federal",null,{"$f":"SUBTOTAL(109,Tabla3[Percepciones pagadas en el Periodo de la Licencia con Presupuesto Federal*])","v":41852.910000000003}]
[]
[null,null,null,null,null,null,null,null,null,null,null,null,null,"Total Ppto. Otras Fuentes"]
[]
[null,"*Total de Percepciones reportadas por la Entidad Federativa como pagadas al trabajador durante la Licencia."]
[null,"Fuente : Información proporcionada por las Entidades Federativas."]

{"sheet":"B)","index":3,"n_rows":27,"n_cols":19,"rows_kept":27,"cut":false,"hidden":false,"merged":[[9,1,9,10],[12,1,13,1],[12,2,13,2],[12,3,13,3],[12,4,13,4],[12,5,12,11],[12,18,13,18],[12,12,13,12],[12,13,13,13],[12,14,13,14],[12,15,12,16],[12,17,13,17]]}
[]
[]
[]
[]
[]
[]
[]
[]
[null,"Formato: Registro Federal de Contribuyentes de Trabajadores con Pagos Retroactivos con un Periodo Mayor a 45 días"]
[null,{"$f":"IF('Caratula Resumen'!D22=\"Elige el Periodo…\",\"\",'Caratula Resumen'!D22)","v":"Fondo de Aportaciones para la Educación Tecnológica y de Adultos/Instituto Nacional para la Educación de los Adultos (FAETA/INEA)"},null,null,null,null,null,null,null,null,null,null,null,null,null,null,null,"2do Trimestre 2016"]
[]
[]
[null,"Entidad Federativa","RFC","CURP","Nombre","Clave Presupuestal",null,null,null,null,null,null,"Clave de Centro de Trabajo","Fecha de emisión de pago","Motivo del Pago Retroactivo","Periodo pagado",null,"Días transcurridos para el pago","Percepciones pagadas en el periodo reportado *"]
[null,null,null,null,null,"Partida Presupuestal","Código de Pago","Clave de Unidad","Clave de Sub Unidad","Clave de Categoría","Horas Semana Mes ","Número de Plaza",null,null,null,"Desde","Hasta"]
[]
[null,"Entidad Federativa","RFC","CURP","Nombre","Partida Presupuestal","Código de Pago","Clave de Unidad","Clave de Sub Unidad","Clave de Categoría","Horas semana mes","Número de plaza","Clave de Centro de Trabajo","Fecha de emisión de pago","Motivo del Pago Retroactivo","Periodo pagado\nDesde","Periodo pagado\nHasta","Días transcurridos para el pago","Percepciones pagadas en el periodo reportado *"]
[]
[]
[]
[]
[]
[null,"Total Personas : ",null,null,null,null,null,null,null,null,"Total Plazas : ",null,null,null,null,"Total Percepciones Pagadas:"]
[]
[]
[]
[null,"*Total de Percepciones reportadas por la Entidad Federativa como pagadas en el periodo "]
[null,"Fuente : Información proporcionada por las Entidades Federativas"]

{"sheet":"II B) Y 1","index":4,"n_rows":350,"n_cols":25,"rows_kept":350,"cut":false,"hidden":false,"merged":[[12,24,14,24],[13,6,13,8],[13,9,13,11],[13,12,13,14],[13,15,13,17],[13,18,13,20],[12,6,12,20],[12,21,14,21],[12,22,14,22],[12,23,14,23],[12,4,14,4],[12,3,14,3],[12,2,14,2],[9,1,9,9],[347,21,347,23],[12,1,14,1],[12,5,14,5]]}
[]
[]
[]
[]
[]
[]
[]
[]
[null,"Formato: Plaza / Función"]
[null,{"$f":"IF('Caratula Resumen'!D22=\"Elige el Periodo…\",\"\",'Caratula Resumen'!D22)","v":"Fondo de Aportaciones para la Educación Tecnológica y de Adultos/Instituto Nacional para la Educación de los Adultos (FAETA/INEA)"},null,null,null,null,null,null,null,null,null,null,null,null,null,null,null,null,null,null,null,null,null,"2do. Trimestre 2016"]
[]
[]
[null,"Entidad Federativa","RFC","CURP","Nombre","Centros de Trabajo","Plazas por tipo de función",null,null,null,null,null,null,null,null,null,null,null,null,null,null,"Total plazas Jornada","Total \nHSM","Total de Honorarios","Total de recursos presupuestales ejercidos en servicios personales en el periodo\n(2)"]
[null,null,null,null,null,null,"Apoyo a la labor educativa",null,null,"Administrativo y de servicio",null,null,"Docente y Apoyo Técnico Pedagógico",null,null,"Directivos y Supervisión",null,null,"Mandos medios y superiores"]
[null,null,null,null,null,null,"Jornada","HSM","Honorarios","Jornada","HSM","Honorarios","Jornada","HSM","Honorarios","Jornada","HSM","Honorarios","Jornada","HSM","Honorarios"]
[]
[null,"Entidad Federativa","RFC","CURP","Nombre","Centros de Trabajo","Jornada","HSM","Honorarios","Jornada2","HSM3","Honorarios4","Jornada5","HSM6","Honorarios7","Jornada8","HSM9","Honorarios10","Jornada11","HSM12","Honorarios13","Total plazas Jornada","Total \nHSM","Total de Honorarios","Total de recursos presupuestales ejercidos en servicios personales en el periodo\n(2)"]
[null,"GUANAJUATO","TEMY831012PC7","TEMY831012MGTRDD05","YADIRA ELISA TERAN MEDINA",1,0,0,0,0,0,0,7,35,0,0,0,0,0,0,0,1,35,0,32476]
[null,"GUANAJUATO","COPC760616J13","COPC760616HGTRTR05","CARLOS ALBERTO CORDOBA PATIﾑO",1,0,0,0,0,0,0,7,35,0,0,0,0,0,0,0,1,35,0,31791]
[null,"GUANAJUATO","TOMG850829D80","TOMG850829HGTRRD08","JOSE GUADALUPE DE LA TORRE MARQUEZ",1,0,0,0,0,0,0,7,35,0,0,0,0,0,0,0,1,35,0,32308]
[null,"GUANAJUATO","AUNC890701HB6","AUNC890701MQTGXR05","MARIA CRISTINA AGUADO NUﾑEZ",1,0,0,0,0,0,0,7,35,0,0,0,0,0,0,0,1,35,0,27754]
[null,"GUANAJUATO","PETL870430KW3","PETL870430MMNRPZ02","LUZ MARIA PEREZ TAPIA",1,0,0,0,0,0,0,7,35,0,0,0,0,0,0,0,1,35,0,27754]
[null,"GUANAJUATO","GOSE861110S23","GOSE861110MGTNNR01","ERIKA ELIZABETH GONZALEZ SANCHEZ",1,0,0,0,0,0,0,7,35,0,0,0,0,0,0,0,1,35,0,27754]
[null,"GUANAJUATO","MISA810907T8A","MISA810907MGTRLL02","ALICIA MIRANDA SALAZAR",1,0,0,0,0,0,0,7,35,0,0,0,0,0,0,0,1,35,0,12444]
[null,"GUANAJUATO","GUGJ930811J60","GUGJ930811MGTRNS05","MARIA JOSE GUERRERO GONZALEZ",1,0,0,0,0,0,0,7,35,0,0,0,0,0,0,0,1,35,0,20740]
[null,"GUANAJUATO","CACJ850212C85","CACJ850212HGTMMN05","JUAN MIGUEL CAMARILLO CAMARILLO",1,0,0,0,0,0,0,7,35,0,0,0,0,0,0,0,1,35,0,8296]
[null,"GUANAJUATO","AUVA8802214EA","AUVA880221MGTNLN08","ANGELICA ANGUIANO VILLAGRANA",1,0,0,0,0,0,0,7,35,0,0,0,0,0,0,0,1,35,0,27754]
[null,"GUANAJUATO","PITJ930828Q89","PITJ930828HGTCRN07","JONATHAN EDUARDO PICON TORRES",1,0,0,0,0,0,0,7,35,0,0,0,0,0,0,0,1,35,0,20740]
[null,"GUANAJUATO","VATL701230M12","VATL701230MGTLRZ04","LUZ MARIA VALLE TORRES",1,0,0,0,0,0,0,7,35,0,0,0,0,0,0,0,1,35,0,28136]
[null,"GUANAJUATO","CASR640104TEA","CASR640104MGTBNS05","ROSA MARIA CABRERA SANCHEZ",1,0,0,0,0,0,0,7,35,0,0,0,0,0,0,0,1,35,0,31182]
[null,"GUANAJUATO","CADI801221FT5","CADI801221HGTRSS00","ISRAEL CARDENAS DIOSDADO",1,0,0,0,0,0,0,7,35,0,0,0,0,0,0,0,1,35,0,28136]
[null,"GUANAJUATO","CAOD910826S90","CAOD910826MSPNRL03","DULCE VIRIDIANA CANO ORTA",1,0,0,0,0,0,0,7,35,0,0,0,0,0,0,0,1,35,0,27403]
[null,"GUANAJUATO","GAGY780903491","GAGY780903MDFLMS06","YOSELIN AIMEE GALVAN GAMEZ",1,0,0,0,0,0,0,7,35,0,0,0,0,0,0,0,1,35,0,27754]
[null,"GUANAJUATO","SACA4609287F8","SACA460928MGTNRL03","MA. ALEJANDRINA CARMEN SANCHEZ CARRASCO",1,0,0,0,0,0,0,7,35,0,0,0,0,0,0,0,1,35,0,34633]
[null,"GUANAJUATO","MERM890606QX7","MERM890606MGTNYY01","MYRIAM DE LOS ANGELES MENDOZA REYES",1,0,0,0,0,0,0,7,35,0,0,0,0,0,0,0,1,35,0,25270]
[null,"GUANAJUATO","PAGG860302DX9","PAGG860302MDFDRB08","GABRIELA PADILLA GUERRERO",1,0,0,0,0,0,0,7,35,0,0,0,0,0,0,0,1,35,0,27212]
[null,"GUANAJUATO","VAMM8611122V7","VAMM861112MGTZCY00","MAYRA VAZQUEZ MACARENA",1,0,0,0,0,0,0,7,35,0,0,0,0,0,0,0,1,35,0,12444]
[null,"GUANAJUATO","GALA740123JB8","GALA740123MGTLPL08","ALMA ROSA GALINDO LOPEZ",1,0,0,0,0,0,0,7,35,0,0,0,0,0,0,0,1,35,0,27403]
[null,"GUANAJUATO","FECM8910217I9","FECM891021MDFRVR01","MARIANA GUISELA FERREIRA CUEVAS",1,0,0,0,0,0,0,7,35,0,0,0,0,0,0,0,1,35,0,28136]
[null,"GUANAJUATO","MADS8906296J1","MADS890629MGTRMR05","SUREY VIRIDIANA MARTINEZ DOMINGUEZ",1,0,0,0,0,0,0,7,35,0,0,0,0,0,0,0,1,35,0,12444]
[null,"GUANAJUATO","EAAJ8712218X3","EAAJ871221MMCSLS09","MARIA DE JESUS ESCAMILLA ALVAREZ",1,0,0,0,0,0,0,7,35,0,0,0,0,0,0,0,1,35,0,25270]
[null,"GUANAJUATO","GOGE831013479","GOGE831013MGTNRL03","ELIA JUDITH GONZALEZ GUERRA",1,0,0,0,0,0,0,7,35,0,0,0,0,0,0,0,1,35,0,27212]
[null,"GUANAJUATO","MOPS740919966","MOPS740919MMCRRL01","SILVIA MORENO PARADA",1,0,0,0,0,0,0,7,35,0,0,0,0,0,0,0,1,35,0,25270]
[null,"GUANAJUATO","COBA780319BUA","COBA780319HGTRTN00","JOSE ANTONIO CORDOBA BAUTISTA",1,0,0,0,0,0,0,7,35,0,0,0,0,0,0,0,1,35,0,27403]
[null,"GUANAJUATO","JUCR790316G8A","JUCR790316HGTRPL02","RAUL HERIBERTO JUAREZ CAPETILLO",1,0,0,0,0,0,0,7,35,0,0,0,0,0,0,0,1,35,0,8296]
[null,"GUANAJUATO","CUPS720728BN7","CUPS720728MGTVSL06","SILVIA CUEVAS PESCADOR",1,0,0,0,0,0,0,7,35,0,0,0,0,0,0,0,1,35,0,28679]
[null,"GUANAJUATO","FAHG7612098T7","FAHG761209MGTLRD03","MA. GUADALUPE FALCON HERNANDEZ",1,0,0,0,0,0,0,7,35,0,0,0,0,0,0,0,1,35,0,25079]
[null,"GUANAJUATO","MAAC750527A26","MAAC750527MGTRGR07","CAROLINA MARTINEZ AGREDA",1,0,0,0,0,0,0,7,35,0,0,0,0,0,0,0,1,35,0,29874]
[null,"GUANAJUATO","MADT730323NL2","MADT730323MGTTVR17","TERESITA DE JESUS MATA DAVALOS",1,0,0,0,0,0,0,7,35,0,0,0,0,0,0,0,1,35,0,35293]
[null,"GUANAJUATO","PECA660503AR0","PECA660503MGTRBN07","ANTONIA PEREZ CABELLO",1,0,0,0,0,0,0,7,35,0,0,0,0,0,0,0,1,35,0,34900]
[null,"GUANAJUATO","SAAP650303N74","SAAP650303MGTNLT02","PATRICIA SANCHEZ ALVARADO",1,0,0,0,0,0,0,7,35,0,0,0,0,0,0,0,1,35,0,32080]
[null,"GUANAJUATO","GOAA581209FLA","GOAA581209MGTNGL08","ALICIA GONZALEZ AGUIRRE",1,0,0,0,0,0,0,7,35,0,0,0,0,0,0,0,1,35,0,33775]
[null,"GUANAJUATO","UORV800303CD1","UORV800303MGTLNR08","VERONICA ULLOA RANGEL",1,0,0,0,0,0,0,7,35,0,0,0,0,0,0,0,1,35,0,29932]
[null,"GUANAJUATO","MEGG6409203P0","MEGG640920HGTDLR04","GERARDO MEDINA GALVAN",1,0,0,0,0,0,0,7,35,0,0,0,0,0,0,0,1,35,0,31286]
[null,"GUANAJUATO","MENM790123EM1","MENM790123MGTDVR00","MIRIAM DE LOS ANGELES MEDEL NAVARRETE",1,0,0,0,0,0,0,7,35,0,0,0,0,0,0,0,1,35,0,24888]
[null,"GUANAJUATO","EASG700512IU9","EASG700512MCMSNR00","GRACIELA ESCAMILLA SANCHEZ",1,0,0,0,0,0,0,7,35,0,0,0,0,0,0,0,1,35,0,45429]
[null,"GUANAJUATO","RIRJ650926ED3","RIRJ650926HGTCMX07","J.JESUS RICO RAMIREZ",1,0,0,0,0,0,0,7,35,0,0,0,0,0,0,0,1,35,0,32787]
[null,"GUANAJUATO","GUOA740914U2A","GUOA740914MMNDRN06","MA. DE LOS ANGELES GUDIﾑO ORDAZ",1,0,0,0,0,0,0,7,35,0,0,0,0,0,0,0,1,35,0,32593]
[null,"GUANAJUATO","LOCJ8109121HA","LOCJ810912HDFPRN00","JUAN CARLOS LOPEZ CRUZ",1,0,0,0,0,0,0,7,35,0,0,0,0,0,0,0,1,35,0,32633]
[null,"GUANAJUATO","HECG7209202C4","HECG720920MGTRRR07","GRISELDA HERRERA CERVANTES",1,0,0,0,0,0,0,7,35,0,0,0,0,0,0,0,1,35,0,34777]
[null,"GUANAJUATO","GURV740105E98","GURV740105MGTRDR07","VERONICA GUERRERO RODRIGUEZ",1,0,0,0,0,0,0,7,35,0,0,0,0,0,0,0,1,35,0,32134]
[null,"GUANAJUATO","GOND6504247RA","GOND650424MGTNXL03","DALIA SONIA GONZALEZ NIﾑO",1,0,0,0,0,0,0,7,35,0,0,0,0,0,0,0,1,35,0,31732]
[null,"GUANAJUATO","JABE820909HH0","JABE820909MGTSLL12","ELOISA JASSO BALLEZA",1,0,0,0,0,0,0,7,35,0,0,0,0,0,0,0,1,35,0,20740]
[null,"GUANAJUATO","CAGR690302HRA","CAGR690302MGTMMS03","MA. DEL ROSARIO CAMPOS GOMEZ",1,0,0,0,0,0,0,7,35,0,0,0,0,0,0,0,1,35,0,34261]
[null,"GUANAJUATO","CALM860815G43","CALM860815MJCHNY02","MAYRA CAROLINA CHAVEZ DE LEﾓN",1,0,0,0,0,0,0,7,35,0,0,0,0,0,0,0,1,35,0,27212]
[null,"GUANAJUATO","GOMM610218KG4","GOMM610218MGTNRR05","MARTA PATRICIA GONZALEZ MORENO",1,0,0,0,0,0,0,7,35,0,0,0,0,0,0,0,1,35,0,34198]
[null,"GUANAJUATO","MAAC750325Q52","MAAC750325MGTLLR02","MA. DEL CARMEN MALDONADO ALMANZA",1,0,0,0,0,0,0,7,35,0,0,0,0,0,0,0,1,35,0,30640]
[null,"GUANAJUATO","TAML5306213J5","TAML530621HGTPRS02","JOSE LUIS TAPIA MARTINEZ",1,0,0,0,0,0,0,7,35,0,0,0,0,0,0,0,1,35,0,31199]
[null,"GUANAJUATO","ZAZJ9610201D4","ZAZJ961020HQTRRN09","JONATAN REMBERTO ZARAZUA ZARAZUA",1,0,0,0,0,0,0,7,35,0,0,0,0,0,0,0,1,35,0,24888]
[null,"GUANAJUATO","PACP681127IL7","PACP681127MGTRHT00","PATRICIA PRADO CHAVEZ",1,0,0,0,0,0,0,7,35,0,0,0,0,0,0,0,1,35,0,35293]
[null,"GUANAJUATO","GOPS8011178I3","GOPS801117MGTMRN09","MARIA SANDRA GOMEZ PEREZ",1,0,0,0,0,0,0,7,35,0,0,0,0,0,0,0,1,35,0,27531]
[null,"GUANAJUATO","LEGJ871018BN9","LEGJ871018MGTDNN02","JENIFER LEDEZMA GONZALEZ",1,0,0,0,0,0,0,7,35,0,0,0,0,0,0,0,1,35,0,20740]
[null,"GUANAJUATO","PEYA830715T69","PEYA830715HGTRZN00","ANGEL ARMANDO PEREZ YZAGUIRRE",1,0,0,0,0,0,0,7,35,0,0,0,0,0,0,0,1,35,0,28136]
[null,"GUANAJUATO","EARF920415GZ8","EARF920415MGTSDT17","FATIMA YAZMIN ESTRADA RODRIGUEZ",1,0,0,0,0,0,0,7,35,0,0,0,0,0,0,0,1,35,0,27754]
[null,"GUANAJUATO","BARA700515RH6","BARA700515MGTRML07","ALMA VELIA BARBOSA RAMIREZ",1,0,0,0,0,0,0,7,35,0,0,0,0,0,0,0,1,35,0,28327]
[null,"GUANAJUATO","MAGG810106790","MAGG810106MGTRNR04","GRACIELA MARTINEZ GONZALEZ",1,0,0,0,0,0,0,7,35,0,0,0,0,0,0,0,1,35,0,25079]
[null,"GUANAJUATO","PACM931219CM1","PACM931219MDGLBY03","MAYLEN NOEMI PLASCENCIA CABRERA",1,0,0,0,0,0,0,7,35,0,0,0,0,0,0,0,1,35,0,28136]
[null,"GUANAJUATO","DUPS9001267KA","DUPS900126MGTRRN08","SANDRA IVONNE DURAN PRADO",1,0,0,0,0,0,0,7,35,0,0,0,0,0,0,0,1,35,0,28327]
[null,"GUANAJUATO","CARA730215VE3","CARA730215MGTHJL00","ALMA DELIA CHAVEZ ROJAS",1,0,0,0,0,0,0,7,35,0,0,0,0,0,0,0,1,35,0,33571]
[null,"GUANAJUATO","RIRZ9005014I8","RIRZ900501MMCCJZ06","ZAZIL RICO ROJAS",1,0,0,0,0,0,0,7,35,0,0,0,0,0,0,0,1,35,0,28136]
[null,"GUANAJUATO","CAGY820417182","CAGY820417MGTRTJ03","YAJAHIRA CARDENAS GUTIERREZ",1,0,0,0,0,0,0,7,35,0,0,0,0,0,0,0,1,35,0,27212]
[null,"GUANAJUATO","NAMR8410165H3","NAMR841016MGTVRS07","ROSALINDA NAVARRO MARTINEZ",1,0,0,0,0,0,0,7,35,0,0,0,0,0,0,0,1,35,0,25079]
[null,"GUANAJUATO","GUZK880623FTA","GUZK880623HGTTVR01","KARIM MIGUEL GUTIERREZ ZAVALA",1,0,0,0,0,0,0,7,35,0,0,0,0,0,0,0,1,35,0,25270]
[null,"GUANAJUATO","JAAX8707291Z3","JAAX870729MCLRRC03","XOCHITL YUVICELA JARA ARRIAGA",1,0,0,0,0,0,0,7,35,0,0,0,0,0,0,0,1,35,0,28136]
[null,"GUANAJUATO","FOQL7110275I8","FOQL711027MGTLVN02","LEONOR FLORES QUEVEDO",1,0,0,0,0,0,0,7,35,0,0,0,0,0,0,0,1,35,0,29416]
[null,"GUANAJUATO","OESD9012116A0","OESD901211MGTRVL05","DOLORES GUADALUPE ORTEGA SAAVEDRA",1,0,0,0,0,0,0,7,35,0,0,0,0,0,0,0,1,35,0,12444]
[null,"GUANAJUATO","HEDM871214861","HEDM871214HGTRLN04","JOSE MANUEL HERNANDEZ DELGADO",1,0,0,0,0,0,0,7,35,0,0,0,0,0,0,0,1,35,0,27212]
[null,"GUANAJUATO","AIMM891226K29","AIMM891226MMCMXR03","MARIANA AMBRIZ MUﾑOZ",1,0,0,0,0,0,0,7,35,0,0,0,0,0,0,0,1,35,0,27754]
[null,"GUANAJUATO","SEGE921103JEA","SEGE921103MMNRRS05","ESTEFANIA SERRATO GARCIA",1,0,0,0,0,0,0,7,35,0,0,0,0,0,0,0,1,35,0,12444]
[null,"GUANAJUATO","AAAL860804UN9","AAAL860804MTSBZD03","LUDIM ABRAHAM AZUARA",1,0,0,0,0,0,0,7,35,0,0,0,0,0,0,0,1,35,0,25079]
[null,"GUANAJUATO","VAPM701212VE4","VAPG701212MGTLRD04","MA. GUADALUPE VALADEZ PEREZ",1,0,0,0,0,0,0,7,35,0,0,0,0,0,0,0,1,35,0,8296]
[null,"GUANAJUATO","HUSM771116C7A","HUSM771116MMNNLR06","MARIZA HUANTE SILVA",1,0,0,0,0,0,0,7,35,0,0,0,0,0,0,0,1,35,0,25270]
[null,"GUANAJUATO","PECC830605V49","PECC830605MNEXSN04","CINTHYA PEﾑALOZA CISNEROS",1,0,0,0,0,0,0,7,35,0,0,0,0,0,0,0,1,35,0,29416]
[null,"GUANAJUATO","CAOE780824GY2","CAOE780824MGTSRM07","EMILIA CASTELLANO ORTEGA",1,0,0,0,0,0,0,7,35,0,0,0,0,0,0,0,1,35,0,33178]
[null,"GUANAJUATO","COOS660919CRA","COOS660919MGTNLS08","SUSANA ISABEL CONTRERAS OLMOS",1,0,0,0,0,0,0,7,35,0,0,0,0,0,0,0,1,35,0,33745]
[null,"GUANAJUATO","HECS730303TG6","HECS730303MGTRNS05","SUSANA TERESA HERNANDEZ CANTERO",1,0,0,0,0,0,0,7,35,0,0,0,0,0,0,0,1,35,0,34261]
[null,"GUANAJUATO","MAAL680513MP3","MAAL680513MMNRNZ01","MARIA DE LA LUZ MARTINEZ ANDRADE",1,0,0,0,0,0,0,7,35,0,0,0,0,0,0,0,1,35,0,35461]
[null,"GUANAJUATO","RAJC810331LAA","RAJC810331MGTMRL02","CLAUDIA JACQUELINE RAMIREZ JARAMILLO",1,0,0,0,0,0,0,7,35,0,0,0,0,0,0,0,1,35,0,33916]
[null,"GUANAJUATO","FONO7308067J5","FOXN730806MGTLXR04","NORMA LILIA FLORES ",1,0,0,0,0,0,0,7,35,0,0,0,0,0,0,0,1,35,0,34087]
[null,"GUANAJUATO","HECA7404077F6","HECA740407MGTRND08","ADRIANA HERNANDEZ CANTERO",1,0,0,0,0,0,0,7,35,0,0,0,0,0,0,0,1,35,0,33916]
[null,"GUANAJUATO","CAVA651011TB7","CAVA651011HGTLRL04","JOSE ALFREDO CALDERON VARELA",1,0,0,0,0,0,0,7,35,0,0,0,0,0,0,0,1,35,0,35641]
[null,"GUANAJUATO","CACP630616HG8","CACP630616MGTLHT16","MA. PATRICIA DOLORES CALDERON CHAVEZ",1,0,0,0,0,0,0,7,35,0,0,0,0,0,0,0,1,35,0,33022]
[null,"GUANAJUATO","AURM640517UH3","AURM640517HGTGCR01","MARTIN AGUIRRE RICO",1,0,0,0,0,0,0,7,35,0,0,0,0,0,0,0,1,35,0,34652]
[null,"GUANAJUATO","SOSM750119S26","SOSM750119MGTRTR02","MARTHA SORIA SOTO",1,0,0,0,0,0,0,7,35,0,0,0,0,0,0,0,1,35,0,34388]
[null,"GUANAJUATO","SACM760716KV0","SACM760716MJCNSN08","MONICA DEL CARMEN SANDOVAL CASTELLON",1,0,0,0,0,0,0,7,35,0,0,0,0,0,0,0,1,35,0,33146]
[null,"GUANAJUATO","PACL700401SI9","PACL700401MGTRHR04","LAURA PRADO CHAVEZ",1,0,0,0,0,0,0,7,35,0,0,0,0,0,0,0,1,35,0,36386]
[null,"GUANAJUATO","ZAGJ830623IG5","ZAGJ830623MGTVLN06","JUANA ZAVALA GALLEGOS",1,0,0,0,0,0,0,7,35,0,0,0,0,0,0,0,1,35,0,32102]
[null,"GUANAJUATO","AUGA6812277W5","AUGA681227MGTGRN03","ANA MARIA AGUILAR GARCIA",1,0,0,0,0,0,0,7,35,0,0,0,0,0,0,0,1,35,0,31851]
[null,"GUANAJUATO","HERA790725FQ8","HERA790725MGTRDL08","ALEJANDRA HERNANDEZ RODRIGUEZ",1,0,0,0,0,0,0,7,35,0,0,0,0,0,0,0,1,35,0,30643]
[null,"GUANAJUATO","HEAE670513TV7","HEAE670513HGTRGD08","EDUARDO HERNANDEZ AGUADO",1,0,0,0,0,0,0,7,35,0,0,0,0,0,0,0,1,35,0,33770]
[null,"GUANAJUATO","MIYA600511Q72","MIYA600511MGTRRN01","MA. ANTONIA MIRANDA YERENA",1,0,0,0,0,0,0,7,35,0,0,0,0,0,0,0,1,35,0,33739]
[null,"GUANAJUATO","MAGE751103B16","MAGE751103MGTYTR08","ERIKA GUADALUPE MAYCOTTE GUTIERREZ",1,0,0,0,0,0,0,7,35,0,0,0,0,0,0,0,1,35,0,34796]
[null,"GUANAJUATO","CUFC8809064X4","CUFC880906MOCRNY08","CYNTHIA CRUZ FUENTES",1,0,0,0,0,0,0,7,35,0,0,0,0,0,0,0,1,35,0,16896]
[null,"GUANAJUATO","PEAR630107AT2","PEAR630107HMCXRY08","JOSE REY PEﾑA ARRIAGA",1,0,0,0,0,0,0,7,35,0,0,0,0,0,0,0,1,35,0,32047]
[null,"GUANAJUATO","VIRM731126CL3","VIRM731126MGTLMN06","MARIA MONICA VILLANUEVA RAMIREZ",1,0,0,0,0,0,0,7,35,0,0,0,0,0,0,0,1,35,0,35036]
[null,"GUANAJUATO","FEET711003EB8","FEET711003MGTLSR05","TERESA FELIX ESTRELLA",1,0,0,0,0,0,0,7,35,0,0,0,0,0,0,0,1,35,0,36090]
[null,"GUANAJUATO","MISR800307LH4","MISR800307MGTRLS07","ROSAURA MIRANDA SALAZAR",1,0,0,0,0,0,0,7,35,0,0,0,0,0,0,0,1,35,0,34970]
[null,"GUANAJUATO","REFE870611H65","REFE870611HGTYNL02","ELI JUAN RUBEN REYES FUENTES",1,0,0,0,0,0,0,7,35,0,0,0,0,0,0,0,1,35,0,12672]
[null,"GUANAJUATO","LOVE3907178K6","LOVE390717MGTPZS07","MA. ESTELA LOPEZ VAZQUEZ",1,0,0,0,0,0,0,7,35,0,0,0,0,0,0,0,1,35,0,36292]
[null,"GUANAJUATO","AIML940210D95","AIML940210MGTRNZ09","LUZ PATRICIA ARVIZU MONTES",1,0,0,0,0,0,0,7,35,0,0,0,0,0,0,0,1,35,0,13155]
[null,"GUANAJUATO","VAPR690730J94","VAPR690730MGTZNS03","ROSA LAURA VAZQUEZ PONCE",1,0,0,0,0,0,0,7,35,0,0,0,0,0,0,0,1,35,0,38104]
[null,"GUANAJUATO","RAOM680518SX1","RAOM680518MMNNCR06","MARIBEL RANGEL OCHOA",1,0,0,0,0,0,0,7,35,0,0,0,0,0,0,0,1,35,0,37522]
[null,"GUANAJUATO","VAQE630516EZ8","VAQE630516MGTRVS07","ESTHELA VARGAS QUEVEDO",1,0,0,0,0,0,0,7,35,0,0,0,0,0,0,0,1,35,0,36871]
[null,"GUANAJUATO","CAJU6804082V6","CAXJ680408MGTMXN08","JUANA MARIA CAMACHO ",1,0,0,0,0,0,0,7,35,0,0,0,0,0,0,0,1,35,0,37957]
[null,"GUANAJUATO","HESF670102636","HESF670102HGTRLR07","FERMIN HERNANDEZ SILVA",1,0,0,0,0,0,0,7,35,0,0,0,0,0,0,0,1,35,0,38701]
[null,"GUANAJUATO","VIMG771213D20","VIMG771213MGTLNB08","GABRIELA VILLANUEVA MENDOZA",1,0,0,0,0,0,0,7,35,0,0,0,0,0,0,0,1,35,0,36655]
[null,"GUANAJUATO","AILP690120TW9","AILP690120MSPRNT09","PATRICIA DE JESUS ARCIGA LEON",1,0,0,0,0,0,0,7,35,0,0,0,0,0,0,0,1,35,0,38546]
[null,"GUANAJUATO","COOD541119637","COOD541119MGTNRL00","DULCE MARIA ELIZABETH CONTRERAS ORDUﾑA",1,0,0,0,0,0,0,7,35,0,0,0,0,0,0,0,1,35,0,37750]
[null,"GUANAJUATO","HECR621219RI5","HECR621219MGTRRS02","MARIA DEL ROSARIO HERNANDEZ CARDENAS",1,0,0,0,0,0,0,7,35,0,0,0,0,0,0,0,1,35,0,38329]
[null,"GUANAJUATO","MAOL731125E39","MAOL731125MGTLRC03","LUCINA MALDONADO ORDUﾑO",1,0,0,0,0,0,0,7,35,0,0,0,0,0,0,0,1,35,0,37171]
[null,"GUANAJUATO","BINL4906195XA","BINL490619HDFRGS05","JOSE LUIS BRIBIESCA NEGRETE",1,0,0,0,0,0,0,7,35,0,0,0,0,0,0,0,1,35,0,36313]
[null,"GUANAJUATO","GUAA541207PD5","GUAA541207MGTTVL07","ALMA ROSA GUTIERREZ AVILES",1,0,0,0,0,0,0,7,35,0,0,0,0,0,0,0,1,35,0,33370]
[null,"GUANAJUATO","NAHL730801RV8","NAHL730801MGTVRR01","MARIA DE LOURDES NAVARRO HERNANDEZ",1,0,0,0,0,0,0,7,35,0,0,0,0,0,0,0,1,35,0,34278]
[null,"GUANAJUATO","AOJM820726EC0","AOJM820726HGTRRR08","MARIO ARGOTE JUAREZ",1,0,0,0,0,0,0,7,35,0,0,0,0,0,0,0,1,35,0,21925]
[null,"GUANAJUATO","VARL750211VB2","VARL750211MGTRMR07","MARIA LOURDES VARGAS RAMIREZ",1,0,0,0,0,0,0,7,35,0,0,0,0,0,0,0,1,35,0,35559]
[null,"GUANAJUATO","GORA840728TD1","GORA840728MDFNMN07","ANA LAURA GONZALEZ RAMOS",1,0,0,0,0,0,0,7,35,0,0,0,0,0,0,0,1,35,0,8770]
[null,"GUANAJUATO","BARA6501175H5","BARA650117MGTRDN02","ANTONIA BARRERA RODRIGUEZ",1,0,0,0,0,0,0,7,35,0,0,0,0,0,0,0,1,35,0,38174]
[null,"GUANAJUATO","SEER810904RN6","SEER810904HGTRSF07","RAFAEL SERRATO ESPINOSA",1,0,0,0,0,0,0,7,35,0,0,0,0,0,0,0,1,35,0,34420]
[null,"GUANAJUATO","COSY800415BF0","COSY800415MGTRVN04","YUNERY CORTES SAAVEDRA",1,0,0,0,0,0,0,7,35,0,0,0,0,0,0,0,1,35,0,33766]
[null,"GUANAJUATO","GUMC6804029G4","GUMC680402MGTZNR09","MARIA DEL CARMEN GUZMAN MANZANILLA",1,0,0,0,0,0,0,7,35,0,0,0,0,0,0,0,1,35,0,41270]
[null,"GUANAJUATO","SAMM750910419","SAMM750910MGTCRR00","MERCEDES ELENA SAUCEDO MORENO",1,0,0,0,0,0,0,7,35,0,0,0,0,0,0,0,1,35,0,39740]
[null,"GUANAJUATO","CACF6710055H4","CACF671005HGTLDR06","FRANCISCO CALDERON CAUDILLO",1,0,0,0,0,0,0,7,35,0,0,0,0,0,0,0,1,35,0,41666]
[null,"GUANAJUATO","ROSR7704116C6","ROSR770411MGTDLS01","MARIA DEL ROSARIO RODRIGUEZ SALGADO",1,0,0,0,0,0,0,7,35,0,0,0,0,0,0,0,1,35,0,40112]
[null,"GUANAJUATO","HEPC690801P80","HEPC690801MGTRRR08","MA. DEL CARMEN HERNANDEZ PEREZ",1,0,0,0,0,0,0,7,35,0,0,0,0,0,0,0,1,35,0,41474]
[null,"GUANAJUATO","CARJ550620A19","CARJ550620HGTSDM09","JAIME CASTILLO RODRIGUEZ",1,0,0,0,0,0,0,7,35,0,0,0,0,0,0,0,1,35,0,39932]
[null,"GUANAJUATO","VARA71012288A","VARA710122MGTRMN01","MARIA DE LOS ANGELES VARGAS RAMIREZ",1,0,0,0,0,0,0,7,35,0,0,0,0,0,0,0,1,35,0,41282]
[null,"GUANAJUATO","VIGO710314HSA","VIGO710314HGTLNS05","OSCAR JACOBO VILLICAﾑA GONZALEZ",1,0,0,0,0,0,0,7,35,0,0,0,0,0,0,0,1,35,0,36884]
[null,"GUANAJUATO","VARA570811AR0","VARA570811MVZLDN06","ANA YOLANDA VALERIO RODRIGUEZ",1,0,0,0,0,0,0,7,35,0,0,0,0,0,0,0,1,35,0,38234]
[null,"GUANAJUATO","JUON6804281K2","JUON680428HGTRRX00","NOE JUAREZ ORTEGA",1,0,0,0,0,0,0,7,35,0,0,0,0,0,0,0,1,35,0,42626]
[null,"GUANAJUATO","BAGJ5610276T2","BAGC561027HGTLLR02","J. CARMEN BALDERAS GALLEGOS",1,0,0,0,0,0,0,7,35,0,0,0,0,0,0,0,1,35,0,37364]
[null,"GUANAJUATO","CABF530212GK8","CABF530212HGTNRR05","FRANCISCO JAVIER CANO BARRON",1,0,0,0,0,0,0,7,35,0,0,0,0,0,0,0,1,35,0,38774]
[null,"GUANAJUATO","GUMA6701215Q1","GUMA670121MGTTRN09","ANA GUTIERREZ MORENO",1,0,0,0,0,0,0,7,35,0,0,0,0,0,0,0,1,35,0,41858]
[null,"GUANAJUATO","PELL620125LZ0","PELL620125MVZRLR03","MARIA DE LOURDES PEREZ LLANOS",1,0,0,0,0,0,0,7,35,0,0,0,0,0,0,0,1,35,0,38518]
[null,"GUANAJUATO","BACA640430UIA","BACA640430HGTLRN06","ANTONIO BALTAZAR CORTES",1,0,0,0,0,0,0,7,35,0,0,0,0,0,0,0,1,35,0,41218]
[null,"GUANAJUATO","RALE870501NL5","RALE870501MGTMYL02","MARIA ELENA RAMOS LOYOLA",1,0,0,0,0,0,0,7,35,0,0,0,0,0,0,0,1,35,0,32889]
[null,"GUANAJUATO","VINF7009219V8","VINF700921HGTLXR06","FRANCISCO ALFONSO VILCHES NUﾑEZ",1,0,0,0,0,0,0,7,35,0,0,0,0,0,0,0,1,35,0,41954]
[null,"GUANAJUATO","AEAJ851118LC0","AEAJ851118HGTRCN00","JUAN CARLOS ARMENTA ACEVEDO",1,0,0,0,0,0,0,7,35,0,0,0,0,0,0,0,1,35,0,38198]
[null,"GUANAJUATO","MAGM6404092N1","MAGM640409MGTNNR08","MARTA MANDUJANO GONZALEZ",1,0,0,0,0,0,0,7,35,0,0,0,0,0,0,0,1,35,0,41858]
[null,"GUANAJUATO","OEMJ730208CX6","OEMM730208HGTJDR00","J. MERCED OJEDA MEDINA",1,0,0,0,0,0,0,7,35,0,0,0,0,0,0,0,1,35,0,38198]
[null,"GUANAJUATO","GOGA680110DL7","GOGA680110MGTNYN00","ANA BERTHA GONZALEZ GAYTAN",1,0,0,0,0,0,0,7,35,0,0,0,0,0,0,0,1,35,0,41858]
[null,"GUANAJUATO","MALA730704I26","MALA730704HGTRPR02","ARNULFO MARQUEZ LOPEZ",1,0,0,0,0,0,0,7,35,0,0,0,0,0,0,0,1,35,0,38198]
[null,"GUANAJUATO","MAGE551119NR4","MAGE551119MGTYRD05","EDITH MAYCOTTE GRANADOS",1,0,0,0,0,0,0,7,35,0,0,0,0,0,0,0,1,35,0,41282]
[null,"GUANAJUATO","VALF830903IU4","VALF830903HGTLNR07","FRANCISCO JAVIER VALDEZ LANDIN",1,0,0,0,0,0,0,7,35,0,0,0,0,0,0,0,1,35,0,33518]
[null,"GUANAJUATO","AURA5705038S9","AURA570503HGTGND03","JOSE ADOLFO AGUILERA RENDON",1,0,0,0,0,0,0,7,35,0,0,0,0,0,0,0,1,35,0,44897]
[null,"GUANAJUATO","LOGC850904FK8","LOGC850904HGTPRR05","CARLOS ALBERTO LOPEZ GARCIA",1,0,0,0,0,0,0,7,35,0,0,0,0,0,0,0,1,35,0,32889]
[null,"GUANAJUATO","ROCR541120D22","ROCR541120HGTSVC07","RICARDO FEDERICO ROSALES COVARRUBIAS",1,0,0,0,0,0,0,7,35,0,0,0,0,0,0,0,1,35,0,40316]
[null,"GUANAJUATO","CATE6508044X6","CATE650804MGTRRS04","ESPERANZA CARRILLO TORRES",1,0,0,0,0,0,0,7,35,0,0,0,0,0,0,0,1,35,0,39932]
[null,"GUANAJUATO","MOGC720409SJ9","MOGC720409MGTJZL04","CLAUDIA ELISA MOJICA GUZMAN",1,0,0,0,0,0,0,7,35,0,0,0,0,0,0,0,1,35,0,38138]
[null,"GUANAJUATO","CAAB610110HC5","CAAB610110MGTRRR07","BERTHA ANGELICA CARPIO ARAGON",1,0,0,0,0,0,0,7,35,0,0,0,0,0,0,0,1,35,0,32889]
[null,"GUANAJUATO","GAML720417UE8","GAML720417HGTRRS07","LUIS ALBERTO GARCIA MARTINEZ",1,0,0,0,0,0,0,7,35,0,0,0,0,0,0,0,1,35,0,40156]
[null,"GUANAJUATO","GORE840602N47","GORE840602HGTNDM00","EMMANUEL GONZALEZ RODRIGUEZ",1,0,0,0,0,0,0,7,35,0,0,0,0,0,0,0,1,35,0,35150]
[null,"GUANAJUATO","FICJ7603185H9","FICT760318HGTRSR03","J. TRINIDAD FRIAS CASTAﾑEDA",1,0,0,0,0,0,0,7,35,0,0,0,0,0,0,0,1,35,0,40364]
[null,"GUANAJUATO","LAMZ780504N49","LAMZ780504MSLRNN01","ZINTIA DENISE LARA MENDIVIL",1,0,0,0,0,0,0,7,35,0,0,0,0,0,0,0,1,35,0,34106]
[null,"GUANAJUATO","CAEJ651225BV9","CAEJ651225HVZHSS03","JESUS CHAGALA ESPEJO",1,0,0,0,0,0,0,7,35,0,0,0,0,0,0,0,1,35,0,35860]
[null,"GUANAJUATO","MOCK900306NE6","MOCK900306MDFRSR15","KAREN ANEL MORENO CASTILLO",1,0,0,0,0,0,0,7,35,0,0,0,0,0,0,0,1,35,0,32889]
[null,"GUANAJUATO","RAAG660220BC0","RAAG660220MGTMVD07","MA. GUADALUPE RUTH RAMOS AVILA",1,0,0,0,0,0,0,7,35,0,0,0,0,0,0,0,1,35,0,39932]
[null,"GUANAJUATO","GACC7402201D0","GACC740220MVZRYL09","CLAUDIA GARCIA CAYETANO",1,0,0,0,0,0,0,7,35,0,0,0,0,0,0,0,1,35,0,32889]
[null,"GUANAJUATO","AAGH700108U53","AAGH700108MGTLRR09","HORTENCIA ALMANZA GARCIA",1,0,0,0,0,0,0,7,35,0,0,0,0,0,0,0,1,35,0,39932]
[null,"GUANAJUATO","LOME901220AG6","LOME901220MQTRTS03","MARﾍA ESTEFANﾍA LORENZO MATA",1,0,0,0,0,0,0,7,35,0,0,0,0,0,0,0,1,35,0,27248]
[null,"GUANAJUATO","BIRL710430QF2","BIRL710430HGTRZB03","LIBRADO BRICEﾑO RUIZ",1,0,0,0,0,0,0,7,35,0,0,0,0,0,0,0,1,35,0,41282]
[null,"GUANAJUATO","CAPJ840105CE0","CAPJ840105HGTMRL00","JULIO CESAR CAMACHO PRADO",1,0,0,0,0,0,0,7,35,0,0,0,0,0,0,0,1,35,0,32889]
[null,"GUANAJUATO","HEMM781102T78","HEMM781102MGTRNR07","MARISELA HERNANDEZ MONTOYA",1,0,0,0,0,0,0,7,35,0,0,0,0,0,0,0,1,35,0,40124]
[null,"GUANAJUATO","CAVJ620328P75","CAVG620328HGTHRD03","J. GUADALUPE CHAVEZ VARGAZ",1,0,0,0,0,0,0,7,35,0,0,0,0,0,0,0,1,35,0,42626]
[null,"GUANAJUATO","RAMD681211IP3","RAMD681211HMCMRN05","DANIEL RAMIREZ MARTINEZ",1,0,0,0,0,0,0,7,35,0,0,0,0,0,0,0,1,35,0,41282]
[null,"GUANAJUATO","PEEM590530399","PEEM590530HDFRSN06","MANUEL ANGEL PEREZ ESCAMILLA",1,0,0,0,0,0,0,7,35,0,0,0,0,0,0,0,1,35,0,42338]
[null,"GUANAJUATO","EIRJ6812089I5","EIRC681208HGTNMR05","J. CARLOS ENRIQUEZ RAMIREZ",1,0,0,0,0,0,0,7,35,0,0,0,0,0,0,0,1,35,0,41282]
[null,"GUANAJUATO","NIMU831228318","NIMU831228MGTXRR02","URSULA MACARENA NIﾑO MARTINEZ",1,0,0,0,0,0,0,7,35,0,0,0,0,0,0,0,1,35,0,35150]
[null,"GUANAJUATO","RARC7011229A3","RARC701122MGTNDR00","MA. CARLOTA PATRICIA RANGEL RODRIGUEZ",1,0,0,0,0,0,0,7,35,0,0,0,0,0,0,0,1,35,0,39964]
[null,"GUANAJUATO","SAME750520NR8","SAME750520MGTNJR05","ERIKA SANCHEZ MEJIA",1,0,0,0,0,0,0,7,35,0,0,0,0,0,0,0,1,35,0,35150]
[null,"GUANAJUATO","AUTC7502082I3","AUTC750208MGTGRN15","MA. CONSUELO AGUILAR TIRADO",1,0,0,0,0,0,0,7,35,0,0,0,0,0,0,0,1,35,0,40124]
[null,"GUANAJUATO","LAOJ8212131K9","LAOJ821213HGTRLS09","JESUS SAMUEL LARA OLMOS",1,0,0,0,0,0,0,7,35,0,0,0,0,0,0,0,1,35,0,35150]
[null,"GUANAJUATO","CUSG780213V57","CUSG780213HGTRVL03","GUILIBALDO CRUZ SAAVEDRA",1,0,0,0,0,0,0,7,35,0,0,0,0,0,0,0,1,35,0,42148]
[null,"GUANAJUATO","LOLB681130LWA","LOLB681130MGTPLT03","BEATRIZ LOPEZ LLANOS",1,0,0,0,0,0,0,7,35,0,0,0,0,0,0,0,1,35,0,35390]
[null,"GUANAJUATO","FOMO6906162N2","FOMO690616HGTNDS05","OSCAR FONSECA MEDRANO",1,0,0,0,0,0,0,7,35,0,0,0,0,0,0,0,1,35,0,40364]
[null,"GUANAJUATO","MOSR650129V62","MOSR650129MGTRNF09","MA. DEL REFUGIO MORONES SANCHEZ",1,0,0,0,0,0,0,7,35,0,0,0,0,0,0,0,1,35,0,38198]
[null,"GUANAJUATO","DOVL720318BXA","DOVL720318HGTMLS06","JOSE LUIS DOMINGUEZ VALDES",1,0,0,0,0,0,0,7,35,0,0,0,0,0,0,0,1,35,0,39964]
[null,"GUANAJUATO","RAML6801057F2","RAML680105MMNMCN00","LINDA RAMIREZ MACEDO",1,0,0,0,0,0,0,7,35,0,0,0,0,0,0,0,1,35,0,38198]
[null,"GUANAJUATO","BEBL7508072M7","BEBL750807HQTRRS05","J. LUIS BERRA BORTOLINI",1,0,0,0,0,0,0,7,35,0,0,0,0,0,0,0,1,35,0,37460]
[null,"GUANAJUATO","FOMJ7811187W8","FOMJ781118HGTLDN07","JUAN PABLO FLORES MEDINA",1,0,0,0,0,0,0,7,35,0,0,0,0,0,0,0,1,35,0,38390]
[null,"GUANAJUATO","TOSH760727J54","TOSH760727HGTRNC04","HECTOR DANIEL TORRES SAENEZ",1,0,0,0,0,0,0,7,35,0,0,0,0,0,0,0,1,35,0,37460]
[null,"GUANAJUATO","GOAS751103PH7","GOAS751103MGTNRL01","SILVIA SANTOS GONZALEZ ARANDA",1,0,0,0,0,0,0,7,35,0,0,0,0,0,0,0,1,35,0,39404]
[null,"GUANAJUATO","RARC7301176A2","RARC730117MGTMVR07","MA. CARINA ALEJANDRA RAMIREZ RIVAS",1,0,0,0,0,0,0,7,35,0,0,0,0,0,0,0,1,35,0,37460]
[null,"GUANAJUATO","ROLA760606566","ROLA760606HGTJPN03","JOSE ANTONIO ROJAS LOPEZ",1,0,0,0,0,0,0,7,35,0,0,0,0,0,0,0,1,35,0,39932]
[null,"GUANAJUATO","GUHA770213FQ8","GUHA770213MGTVRL02","ALMA ROSA GUEVARA HERNANDEZ",1,0,0,0,0,0,0,7,35,0,0,0,0,0,0,0,1,35,0,39932]
[null,"GUANAJUATO","ZAGB700228KX3","ZAGB700228MGTVMT03","BEATRIZ ZAVALA GOMEZ",1,0,0,0,0,0,0,7,35,0,0,0,0,0,0,0,1,35,0,39900]
[null,"GUANAJUATO","MEVG630915G81","MEVG630915MGTRRD08","MA. GUADALUPE MERCADO VARELA",1,0,0,0,0,0,0,7,35,0,0,0,0,0,0,0,1,35,0,39194]
[null,"GUANAJUATO","COCB750608U65","COCB750608MGTRRL08","BLANCA RAQUEL CORONEL CARBAJAL",1,0,0,0,0,0,0,7,35,0,0,0,0,0,0,0,1,35,0,39548]
[null,"GUANAJUATO","MOTE6904283LA","MOTE690428MGTRRL09","ELVIRA MORALES TORRES",1,0,0,0,0,0,0,7,35,0,0,0,0,0,0,0,1,35,0,40508]
[null,"GUANAJUATO","ROJJ671130GY1","ROJJ671130HGTDMS06","JOSE RODRIGUEZ JIMENEZ",1,0,0,0,0,0,0,7,35,0,0,0,0,0,0,0,1,35,0,39726]
[null,"GUANAJUATO","GURR6007275B3","GURR600727HSPLMD06","RODOLFO GUEL RAMIREZ",1,0,0,0,0,0,0,7,35,0,0,0,0,0,0,0,1,35,0,40732]
[null,"GUANAJUATO","FEGR710424QJ8","FEXG710424MGTRXR09","GRACIELA FERRER ",1,0,0,0,0,0,0,7,35,0,0,0,0,0,0,0,1,35,0,30636]
[null,"GUANAJUATO","FAHI7401088Z2","FAHI740108HGTBRV04","IVAN FABELA HERNANDEZ",1,0,0,0,0,0,0,7,35,0,0,0,0,0,0,0,1,35,0,41122]
[null,"GUANAJUATO","COMM660914G87","COMR660914MGTNDC09","MA. DEL ROCIO CONCHA MEDINA",1,0,0,0,0,0,0,7,35,0,0,0,0,0,0,0,1,35,0,36206]
[null,"GUANAJUATO","QULC671003EH8","QULC671003MDFRPL03","CLAUDIA REYNA QUIROZ LOPEZ",1,0,0,0,0,0,0,7,35,0,0,0,0,0,0,0,1,35,0,40508]
[null,"GUANAJUATO","RORC700828A28","RORC700828MGTMML06","CLAUDIA IMELDA ROMERO RAMOS",1,0,0,0,0,0,0,7,35,0,0,0,0,0,0,0,1,35,0,39484]
[null,"GUANAJUATO","RIRS751216TU4","RIRS751216MDFSMN07","SONIA RIOS RAMOS",1,0,0,0,0,0,0,7,35,0,0,0,0,0,0,0,1,35,0,38042]
[null,"GUANAJUATO","LUMR751129U75","LUMR751129HGTGTC02","RICARDO ERNESTO LUGO MATA",1,0,0,0,0,0,0,7,35,0,0,0,0,0,0,0,1,35,0,32889]
[null,"GUANAJUATO","NEPR690831KW1","NEPR690831HGTGDM08","RAMON GUILLERMO NEGRETE PADRON",1,0,0,0,0,0,0,7,35,0,0,0,0,0,0,0,1,35,0,38042]
[null,"GUANAJUATO","ROPE881009G46","ROPE881009MGTDRV05","EVELIN GUADALUPE RODRIGUEZ PEREZ",1,0,0,0,0,0,0,7,35,0,0,0,0,0,0,0,1,35,0,32889]
[null,"GUANAJUATO","LOVH74031691A","LOVH740316HDFPNG06","HUGO LOPEZ VENEGAS",1,0,0,0,0,0,0,7,35,0,0,0,0,0,0,0,1,35,0,40508]
[null,"GUANAJUATO","RILM750601TH0","RILM750601MOCSSG04","MAGDALENA RIOS LUIS",1,0,0,0,0,0,0,7,35,0,0,0,0,0,0,0,1,35,0,42291]
[null,"GUANAJUATO","RIHM750221AD5","RIHM750221HGTSRG01","MIGUEL DAMICIO RIOS HERNANDEZ",1,0,0,0,0,0,0,7,35,0,0,0,0,0,0,0,1,35,0,26548]
[null,"GUANAJUATO","CIVM630826EF1","CIVR630826MGTSRS09","MA. DEL ROSARIO CISNEROS VERDIN",1,0,0,0,0,0,0,7,35,0,0,0,0,0,0,0,1,35,0,36084]
[null,"GUANAJUATO","ROPP680417AU8","ROPP680417MGTDRT05","PATRICIA RODRIGUEZ PEREZ",1,0,0,0,0,0,0,7,35,0,0,0,0,0,0,0,1,35,0,40508]
[null,"GUANAJUATO","BABM6804276E6","BABM680427MMCXLR01","MARGARITA BAﾑOS BAILON",1,0,0,0,0,0,0,7,35,0,0,0,0,0,0,0,1,35,0,38972]
[null,"GUANAJUATO","NAMS5306098W6","NAMS530609MGTRRL00","SILVIA LAURA NARVAEZ MORA",1,0,0,0,0,0,0,7,35,0,0,0,0,0,0,0,1,35,0,40380]
[null,"GUANAJUATO","NEGM641224M74","NEGM641224MGTGVR06","MARTINA NEGRETE GOVEA",1,0,0,0,0,0,0,7,35,0,0,0,0,0,0,0,1,35,0,34478]
[null,"GUANAJUATO","ZAMH6907077M4","ZAMH690707MGTVRR00","MARIA HERLINDA ZAVALA MARTINEZ",1,0,0,0,0,0,0,7,35,0,0,0,0,0,0,0,1,35,0,37850]
[null,"GUANAJUATO","PEDM7406101Q5","PEDM740610MDFRMR01","MARGARITA PERALTA DOMINGUEZ",1,0,0,0,0,0,0,7,35,0,0,0,0,0,0,0,1,35,0,39164]
[null,"GUANAJUATO","AERS660208UT4","AERS660208HGTRYR01","SERGIO ARREDONDO RAYA",1,0,0,0,0,0,0,7,35,0,0,0,0,0,0,0,1,35,0,40892]
[null,"GUANAJUATO","LOLG8002136P9","LOLG800213HGTPNS03","GUSTAVO LOPEZ LUNA",1,0,0,0,0,0,0,7,35,0,0,0,0,0,0,0,1,35,0,15318]
[null,"GUANAJUATO","LOLA751009LC7","LOLA751009MGTPNN06","MA. DE LOS ANGELES LOPEZ LUNA",1,0,0,0,0,0,0,7,35,0,0,0,0,0,0,0,1,35,0,40496]
[null,"GUANAJUATO","LERM7308264B5","LERM730826MGTDSN09","MONICA LEDESMA ROSALES",1,0,0,0,0,0,0,7,35,0,0,0,0,0,0,0,1,35,0,39356]
[null,"GUANAJUATO","MELR640522PX9","MELR640522MGTNNT06","RITA MENDEZ LEON",1,0,0,0,0,0,0,7,35,0,0,0,0,0,0,0,1,35,0,40316]
[null,"GUANAJUATO","ROTD900918TRA","ROTD900918HVZDLG06","DAGOBERTO RODRIGUEZ TELLO",1,0,0,0,0,0,0,7,35,0,0,0,0,0,0,0,1,35,0,30636]
[null,"GUANAJUATO","CAGR650930FB6","CAGR650930HGTLYB04","RUBEN CALDERON GAYTAN",1,0,0,0,0,0,0,7,35,0,0,0,0,0,0,0,1,35,0,40316]
[null,"GUANAJUATO","DOVR6304095Y7","DOVR630409MBCMZS05","MARIA DEL ROSARIO DOMINGUEZ VAZQUEZ",1,0,0,0,0,0,0,7,35,0,0,0,0,0,0,0,1,35,0,39356]
[null,"GUANAJUATO","BAVG670930HU0","BAVG670930MGTRZD05","MA. GUADALUPE BARCENAS VAZQUEZ",1,0,0,0,0,0,0,7,35,0,0,0,0,0,0,0,1,35,0,42818]
[null,"GUANAJUATO","GOGL670809V8A","GOGL670809HGTNRS00","LUIS ALBERTO GONZALEZ GARCIA",1,0,0,0,0,0,0,7,35,0,0,0,0,0,0,0,1,35,0,42242]
[null,"GUANAJUATO","QULJ710417B39","QULJ710417HDFRPN08","JUAN BERNARDO QUIROZ LOPEZ",1,0,0,0,0,0,0,7,35,0,0,0,0,0,0,0,1,35,0,40316]
[null,"GUANAJUATO","SAAL700325CX2","SAAL700325MGTNGT00","LETICIA SANDOVAL AGUAYO",1,0,0,0,0,0,0,7,35,0,0,0,0,0,0,0,1,35,0,39164]
[null,"GUANAJUATO","LUOE610116R96","LUOE610116HDGNLM05","EMILIO LUNA OLAGUE",1,0,0,0,0,0,0,7,35,0,0,0,0,0,0,0,1,35,0,42882]
[null,"GUANAJUATO","REPC540808QI9","REPC540808MGTNRN06","MARIA CONCEPCION RENTERIA PEREZ",1,0,0,0,0,0,0,7,35,0,0,0,0,0,0,0,1,35,0,44010]
[null,"GUANAJUATO","YEPV780203IU0","YEPV780203MGTBVR00","VERONICA ADRIANA YEBRA PAVON",1,0,0,0,0,0,0,7,35,0,0,0,0,0,0,0,1,35,0,40892]
[null,"GUANAJUATO","VILR670220CZ3","VILR670220MGTLNM04","RAMONA VILLANUEVA LUNA",1,0,0,0,0,0,0,7,35,0,0,0,0,0,0,0,1,35,0,43010]
[null,"GUANAJUATO","MASV810101DZ8","MASV810101MGTRRR01","VERONICA MARTINEZ SARABIA",1,0,0,0,0,0,0,7,35,0,0,0,0,0,0,0,1,35,0,40316]
[null,"GUANAJUATO","VEPE671201NI6","VEPE671201MGTGRG04","MARIA EUGENIA VEGA PAREDES",1,0,0,0,0,0,0,7,35,0,0,0,0,0,0,0,1,35,0,39612]
[null,"GUANAJUATO","AELM6906275A6","AELR690627MGTRPS15","MA ROSARIO ARREGUIN LOPEZ",1,0,0,0,0,0,0,7,35,0,0,0,0,0,0,0,1,35,0,40316]
[null,"GUANAJUATO","RORD790510T10","RORD790510MGTMML09","DULCE MARIA ROMERO RAMIREZ",1,0,0,0,0,0,0,7,35,0,0,0,0,0,0,0,1,35,0,20424]
[null,"GUANAJUATO","METC6212134V3","METC621213HGTRPS06","CESAR MARTIN MERINO TAPIA",1,0,0,0,0,0,0,7,35,0,0,0,0,0,0,0,1,35,0,40316]
[null,"GUANAJUATO","NADP821016J68","NADP821016MGTVRL01","MARIA DEL PILAR NAVARRO DURAN",1,0,0,0,0,0,0,7,35,0,0,0,0,0,0,0,1,35,0,20424]
[null,"GUANAJUATO","NEAC740715LD9","NEAC740715HGTGRR02","CRISTOBAL NEGRETE ARIAS",1,0,0,0,0,0,0,7,35,0,0,0,0,0,0,0,1,35,0,41330]
[null,"GUANAJUATO","RARA580417NI3","RARA580417HGTMMR07","ARMANDO RAMIREZ RAMIREZ",1,0,0,0,0,0,0,7,35,0,0,0,0,0,0,0,1,35,0,20424]
[null,"GUANAJUATO","GAMJ711118AJ8","GAMJ711118HGTRCC07","JACOBO GARCIA MICHACA",1,0,0,0,0,0,0,7,35,0,0,0,0,0,0,0,1,35,0,41090]
[null,"GUANAJUATO","OOPM650124AG1","OOPM650124HGTRRG05","MIGUEL OROZCO PEREZ",1,0,0,0,0,0,0,7,35,0,0,0,0,0,0,0,1,35,0,42242]
[null,"GUANAJUATO","MUHD640208LB9","MUHD640208MDFXRL08","MARIA DOLORES MUﾑOZ HERRERA",1,0,0,0,0,0,0,7,35,0,0,0,0,0,0,0,1,35,0,40508]
[null,"GUANAJUATO","ROJJ610420EGA","ROJC610420HGTCMR06","J. CARMEN ROCHA JIMENEZ",1,0,0,0,0,0,0,7,35,0,0,0,0,0,0,0,1,35,0,39648]
[null,"GUANAJUATO","FOQP690616QU0","FOQP690616MGTLVT01","PETRA FLORES QUEVEDO",1,0,0,0,0,0,0,7,35,0,0,0,0,0,0,0,1,35,0,42792]
[null,"GUANAJUATO","MARC601223340","MARC601223MGTRLC03","CECILIA MARTINEZ RUELAS",1,0,0,0,0,0,0,7,35,0,0,0,0,0,0,0,1,35,0,37397]
[null,"GUANAJUATO","VAQG581212JV2","VAQG581212HGTLJD08","J. GUADALUPE VALENCIA QUIJAS",1,0,0,0,0,0,0,7,35,0,0,0,0,0,0,0,1,35,0,39584]
[null,"GUANAJUATO","GOSL721116725","GOSL721116HGTRSS06","LUIS JAVIER GORDILLO SOSA",1,0,0,0,0,0,0,7,35,0,0,0,0,0,0,0,1,35,0,40508]
[null,"GUANAJUATO","JUAA750702KJ9","JUAA750702HGTRRN04","JOSE ANDRES JUAREZ ARROYO",1,0,0,0,0,0,0,7,35,0,0,0,0,0,0,0,1,35,0,40508]
[null,"GUANAJUATO","GUSS6608135L6","GUSS660813MGTRNF04","SOFIA GUERRERO SANDOVAL",1,0,0,0,0,0,0,7,35,0,0,0,0,0,0,0,1,35,0,39584]
[null,"GUANAJUATO","COPG660114BC1","COPG660114HGTNLR03","GERARDO LUIS CONTRERAS PALACIOS",1,0,0,0,0,0,0,7,35,0,0,0,0,0,0,0,1,35,0,42434]
[null,"GUANAJUATO","TOAN630405S63","TOXA630405HGTLXN01","JOSE ANTONIO TOLENTINO ",1,0,0,0,0,0,0,7,35,0,0,0,0,0,0,0,1,35,0,39968]
[null,"GUANAJUATO","PAQF701109SJ2","PAQF701109HGTRNL00","FILEMON PAREDON QUINTERO",1,0,0,0,0,0,0,7,35,0,0,0,0,0,0,0,1,35,0,40940]
[null,"GUANAJUATO","RICR7705149U3","RICR770514HGTVRB05","ROBERTO CARLOS RIVERA CORONILLA",1,0,0,0,0,0,0,7,35,0,0,0,0,0,0,0,1,35,0,40540]
[null,"GUANAJUATO","COOM721217SVA","COOM721217MGTNLN02","MA. MANUELA CONTRERAS OLMOS",1,0,0,0,0,0,0,7,35,0,0,0,0,0,0,0,1,35,0,40604]
[null,"GUANAJUATO","BEMS700226KJ6","BEMS700226HGTCNL00","SALVADOR BECERRA MANDUJANO",1,0,0,0,0,0,0,7,35,0,0,0,0,0,0,0,1,35,0,40604]
[null,"GUANAJUATO","DUVE540209Q63","DUVE540209HGTRLR06","ERNESTO DURAN VALDIVIA",1,0,0,0,0,0,0,7,35,0,0,0,0,0,0,0,1,35,0,43400]
[null,"GUANAJUATO","LURF6001292T1","LURF600129HGTNMR01","FRANCISCO JAVIER LUNA RAMIREZ",1,0,0,0,0,0,0,7,35,0,0,0,0,0,0,0,1,35,0,42998]
[null,"GUANAJUATO","VAGL591217DU7","VAGL591217MGTRRL06","LILIA VARGAS GARCIDUEﾑAS",1,0,0,0,0,0,0,7,35,0,0,0,0,0,0,0,1,35,0,43400]
[null,"GUANAJUATO","ZACR521017I51","ZACR521017HGTMRG01","ROGELIO ARTURO ZAMARRIPA CRUZ",1,0,0,0,0,0,0,7,35,0,0,0,0,0,0,0,1,35,0,43400]
[null,"GUANAJUATO","MENC680926QE2","MENC680926MGTDVR02","MARIA DEL CARMEN MEDEL NAVARRETE",1,0,0,0,0,0,0,7,35,0,0,0,0,0,0,0,1,35,0,41090]
[null,"GUANAJUATO","ROSJ600516BL3","ROSJ600516MGTBNN05","JUANA ROBLES SANTANA",1,0,0,0,0,0,0,7,35,0,0,0,0,0,0,0,1,35,0,40700]
[null,"GUANAJUATO","MAGE550714NZ1","MAGE550714HGTRNS03","ESTEBAN MARTINEZ GONZALEZ",1,0,0,0,0,0,0,7,35,0,0,0,0,0,0,0,1,35,0,43400]
[null,"GUANAJUATO","PAGT5911092P8","PAGT591109HGTLRD01","TEODORO PALMERIN GARCIA",1,0,0,0,0,0,0,7,35,0,0,0,0,0,0,0,1,35,0,44118]
[null,"GUANAJUATO","RATR611023E56","RATR611023MGTMRS03","ROSA MAGDALENA RAMIREZ TRONCOSO",1,0,0,0,0,0,0,7,35,0,0,0,0,0,0,0,1,35,0,43400]
[null,"GUANAJUATO","GOGR650725KF1","GOGR650725HGTNRB02","ROBERTO GONZALEZ GARCIA",1,0,0,0,0,0,0,7,35,0,0,0,0,0,0,0,1,35,0,42626]
[null,"GUANAJUATO","LAGG8705075P8","LAGG870507MGTGRS08","GISELA LAGUNA GUERRERO",1,0,0,0,0,0,0,7,35,0,0,0,0,0,0,0,1,35,0,39836]
[null,"GUANAJUATO","AAGB8305061P7","AAGB830506MGTYTR02","BRENDA AYALA GUTIERREZ",1,0,0,0,0,0,0,7,35,0,0,0,0,0,0,0,1,35,0,30636]
[null,"GUANAJUATO","JUEC8408019SA","JUEC840801MGTRSR08","MARIA DEL CARMEN IVONNE JUAREZ ESPITIA",1,0,0,0,0,0,0,7,35,0,0,0,0,0,0,0,1,35,0,30636]
[null,"GUANAJUATO","GUMM920308B42","GUMM920308MGTRJN03","MONICA JUANA GUERRERO MEJIA",1,0,0,0,0,0,0,7,35,0,0,0,0,0,0,0,1,35,0,30636]
[null,"GUANAJUATO","COIM780815PDA","COIM780815HGTPRR02","MARIO ALBERTO COPADO IRINEO",1,0,0,0,0,0,0,7,35,0,0,0,0,0,0,0,1,35,0,30636]
[null,"GUANAJUATO","HERG640304LK9","HERG640304MGTRDR09","GRACIELA HERNANDEZ RODRIGUEZ",1,0,0,0,0,0,0,7,35,0,0,0,0,0,0,0,1,35,0,30636]
[null,"GUANAJUATO","HECG7108185E0","HECG710818HGTRBR07","GERARDO HERNANDEZ CABEZA",1,0,0,0,0,0,0,7,35,0,0,0,0,0,0,0,1,35,0,30636]
[null,"GUANAJUATO","HELM710411Q56","HELM710411MGTRDR02","MARTHA ANGELICA HERNANDEZ LEDESMA",1,0,0,0,0,0,0,7,35,0,0,0,0,0,0,0,1,35,0,39836]
[null,"GUANAJUATO","SOBF761123PU9","SOBF761123HGTLRR07","FRANCISCO SOLORZANO BERNAL",1,0,0,0,0,0,0,7,35,0,0,0,0,0,0,0,1,35,0,39836]
[null,"GUANAJUATO","FOTL950830PQ2","FOTL950830MGTLRR02","LAURA JAZMIN FLORES TORRES",1,0,0,0,0,0,0,7,35,0,0,0,0,0,0,0,1,35,0,30636]
[null,"GUANAJUATO","MANL580917DN5","MANL580917HGTRXS04","JOSE LUIS MARTINEZ NUﾑEZ",1,0,0,0,0,0,0,7,35,0,0,0,0,0,0,0,1,35,0,39836]
[null,"GUANAJUATO","COSL800716SL8","COSL800716MGTRRD08","LIDIA CAROLINA CORTES SIERRA",1,0,0,0,0,0,0,7,35,0,0,0,0,0,0,0,1,35,0,39836]
[null,"GUANAJUATO","LOHD930413C30","LOHD930413MGTPDN05","DIANA GUADALUPE LOPEZ HIDALGO",1,0,0,0,0,0,0,7,35,0,0,0,0,0,0,0,1,35,0,39836]
[null,"GUANAJUATO","JAAA741109NM2","JAAA741109MGTSGL04","ALMA PATRICIA JASSO AGUILERA",1,0,0,0,0,0,0,7,35,0,0,0,0,0,0,0,1,35,0,33845]
[null,"GUANAJUATO","CASE871206B31","CASE871206HGTSND05","JOSE EDUARDO CASTAﾑEDA SAENZ",1,0,0,0,0,0,0,7,35,0,0,0,0,0,0,0,1,35,0,33845]
[null,"GUANAJUATO","ROVK831026QX5","ROVK831026MGTSZR01","MARIA KARINA ROSAS VAZQUEZ",1,0,0,0,0,0,0,7,35,0,0,0,0,0,0,0,1,35,0,33845]
[null,"GUANAJUATO","VEVS760824QM4","VEVS760824MGTNLL09","SILVINA ELIZABETH VENEGAS VILLALOBOS",1,0,0,0,0,0,0,7,35,0,0,0,0,0,0,0,1,35,0,32562]
[null,"GUANAJUATO","CAOC8910102C1","CAOC891010MGTSRR04","MARIA CRUZ CASTAﾑEDA ORNELAS",1,0,0,0,0,0,0,7,35,0,0,0,0,0,0,0,1,35,0,39836]
[null,"GUANAJUATO","EICS8311094H1","EICS831109MGTLNN06","SANDRA ELISA ELIAS CONTRERAS",1,0,0,0,0,0,0,7,35,0,0,0,0,0,0,0,1,35,0,39836]
[null,"GUANAJUATO","SACT890401492","SACT890401HGTNLD08","TADEO SANCHEZ CALDERON",1,0,0,0,0,0,0,7,35,0,0,0,0,0,0,0,1,35,0,39836]
[null,"GUANAJUATO","IAJM900213S93","IAJM900213HGTBSR04","MARIO ALBERTO IBARRA JASSO",1,0,0,0,0,0,0,7,35,0,0,0,0,0,0,0,1,35,0,39836]
[null,"GUANAJUATO","GOOG7802057F2","GOOG780205HGTNRD04","JOSE GUADALUPE GONZALEZ ORTEGA",1,0,0,0,0,0,0,7,35,0,0,0,0,0,0,0,1,35,0,39836]
[null,"GUANAJUATO","TOFM860110TE7","TOFM860110MGTRNR00","MARTHA EDITH TORRES FUENTES",1,0,0,0,0,0,0,7,35,0,0,0,0,0,0,0,1,35,0,39836]
[null,"GUANAJUATO","TOFF601228BV5","TOFF601228HGTRGR04","FRANCISCO JAVIER TORRES FIGUEROA",1,0,0,0,0,0,0,7,35,0,0,0,0,0,0,0,1,35,0,39836]
[null,"GUANAJUATO","VERT861015NB6","VERT861015MGTRMR01","TERESA VERDE RAMIREZ",1,0,0,0,0,0,0,7,35,0,0,0,0,0,0,0,1,35,0,39836]
[null,"GUANAJUATO","GUMJ870317R44","GUMJ870317HGTRRN00","JONAS GUERRERO MARTINEZ",1,0,0,0,0,0,0,7,35,0,0,0,0,0,0,0,1,35,0,30636]
[null,"GUANAJUATO","QUCL890311NE9","QUCL890311HGTNNS07","LUIS ALBERTO QUINTINO CINTORA",1,0,0,0,0,0,0,7,35,0,0,0,0,0,0,0,1,35,0,30636]
[null,"GUANAJUATO","GORD8312168D4","GORD831216MGTMVL06","DULCE MARIA MONSERRAT GOMEZ RIVERA",1,0,0,0,0,0,0,7,35,0,0,0,0,0,0,0,1,35,0,30636]
[null,"GUANAJUATO","MAFR721206U28","MAFR721206MGTRLC04","ROCIO ANEL MARTINEZ FLORES",1,0,0,0,0,0,0,7,35,0,0,0,0,0,0,0,1,35,0,15318]
[null,"GUANAJUATO","MABM7603207B6","MABM760320MGTCSR01","MARIANA MACHUCA BUSTAMANTE",1,0,0,0,0,0,0,7,35,0,0,0,0,0,0,0,1,35,0,30636]
[null,"GUANAJUATO","GORM961124VB9","GORM961124MGTNZC03","MICHEL YARED GONZALEZ RAZO",1,0,0,0,0,0,0,7,35,0,0,0,0,0,0,0,1,35,0,15318]
[null,"GUANAJUATO","MESE811002373","MEXS811002MGTJXL00","MARIA SELEM MEJIA ",1,0,0,0,0,0,0,7,35,0,0,0,0,0,0,0,1,35,0,15318]
[null,"GUANAJUATO","VATR761025BJA","VATR761025MDFRRS05","ROSA MARIA VARGAS TRUJILLO",1,0,0,0,0,0,0,7,35,0,0,0,0,0,0,0,1,35,0,41918]
[null,"GUANAJUATO","GARM751031J11","GARM751031HGTRMS07","MOISES GRANADOS RAMOS",1,0,0,0,0,0,0,7,35,0,0,0,0,0,0,0,1,35,0,46547]
[null,"GUANAJUATO","HERG571023MS0","HERG571023MGTRPD07","MA. GUADALUPE JUDITH HERNANDEZ RIPALDA",1,0,0,0,0,0,0,7,35,0,0,0,0,0,0,0,1,35,0,46619]
[null,"GUANAJUATO","HEEE731209HI1","HEEE731209MGTRSS09","ESMERALDA HERNANDEZ ESCOGIDO",1,0,0,0,0,0,0,7,35,0,0,0,0,0,0,0,1,35,0,46397]
[null,"GUANAJUATO","POLH650106FW2","POLH650106HDFZPG03","HUGO POZADA LOPEZ",1,0,0,0,0,0,0,7,35,0,0,0,0,0,0,0,1,35,0,46019]
[null,"GUANAJUATO","COJP700317TZ9","COJP700317HMNRMD06","PEDRO CORTES JIMENEZ",1,0,0,0,0,0,0,7,35,0,0,0,0,0,0,0,1,35,0,45719]
[null,"GUANAJUATO","AEPB811216AUA","AEPB811216MGTRLL03","BLANCA BERENICE ARREGUIN PALMA",1,0,0,0,0,0,0,7,35,0,0,0,0,0,0,0,1,35,0,46319]
[null,"GUANAJUATO","MOMR770326563","MOMR770326HGTRRB08","ROBERTO CARLOS MORALES MURO",1,0,0,0,0,0,0,7,35,0,0,0,0,0,0,0,1,35,0,45997]
[null,"GUANAJUATO","MURE780503RL7","MURE780503MGTXVS02","MARIA ESMERALDA MUﾑOZ RIVERA",1,0,0,0,0,0,0,7,35,0,0,0,0,0,0,0,1,35,0,46319]
[null,"GUANAJUATO","OEGL8003134Z8","OEGL800313MGTRMR09","LAURA AMERICA ORTEGA GAMIﾑO",1,0,0,0,0,0,0,7,35,0,0,0,0,0,0,0,1,35,0,46019]
[null,"GUANAJUATO","GUNC8511262G5","GUNC851126HQRTVR08","CARLOS FELIPE GUTIERREZ NOVELO",1,0,0,0,0,0,0,7,35,0,0,0,0,0,0,0,1,35,0,8448]
[null,"GUANAJUATO","FOAP6704124J5","FOAP670412MGTLLT01","PATRICIA FLORES ALVAREZ",1,0,0,0,0,0,0,7,35,0,0,0,0,0,0,0,1,35,0,18772]
[null,"GUANAJUATO","MEMS601125CV5","MEMS601125HMNNLM04","SAMUEL MENDOZA MALDONADO",1,0,0,0,0,0,0,7,35,0,0,0,0,0,0,0,1,35,0,20424]
[null,"GUANAJUATO","RAGM9005156P3","RAGM900515MGTMJN01","MONICA SAMANTHA RAMOS GOUJON",1,0,0,0,0,0,0,7,35,0,0,0,0,0,0,0,1,35,0,26702]
[null,"GUANAJUATO","ROBC900904U49","ROBC900904MDFCZT03","CITLALLIN MARGARITA ROCHA BAEZA",1,0,0,0,0,0,0,7,35,0,0,0,0,0,0,0,1,35,0,33922]
[null,"GUANAJUATO","TONL701209CT8","TONL701209MGTRCR09","LAURA MA GUADALUPE TORRES NACHE",1,0,0,0,0,0,0,7,35,0,0,0,0,0,0,0,1,35,0,34696]
[null,"GUANAJUATO","MACE770912412","MACE770912HQTRHC07","ECTOR JAVIER MARTINEZ CHAVEZ",1,0,0,0,0,0,0,0,0,0,0,0,0,0,0,0,1,40,0,68857]
[null,"GUANAJUATO","CAVS681207JX2","CAVS681207HGTNRL04","SALVADOR CANO VARGAS",1,0,0,0,0,0,0,0,0,0,0,0,0,0,0,0,1,40,0,68875]
[null,"GUANAJUATO","ROVR580704ND4","ROVR580704HVZXLB09","ROBERTO ROA VELAZQUEZ",1,0,0,0,0,0,0,0,0,0,0,0,0,0,0,0,1,40,0,68977]
[null,"GUANAJUATO","RUCE791216KR2","RUCE791216HGTLRD00","EDUARDO RUELAS CORNEJO",1,0,0,0,0,0,0,0,0,0,0,0,0,0,0,0,1,40,0,68299]
[null,"GUANAJUATO","MURM820910149","MURM820910HGTRDR08","MAURICIO ALEJANDRO MURILLO RODRIGUEZ",1,0,0,0,0,0,0,0,0,0,0,0,0,0,0,0,1,40,0,68299]
[null,"GUANAJUATO","REGJ781111QG6","REGJ781111HGTYRN09","JUAN MANUEL REYES GUERRERO",1,0,0,0,0,0,0,0,0,0,0,0,0,0,0,0,1,40,0,65005]
[null,"GUANAJUATO","PARL850303S64","PARL850303MGTDVN02","LEONOR PADILLA RIVERA",1,0,0,0,0,0,0,0,0,0,0,0,0,0,0,0,1,40,0,55248]
[null,"GUANAJUATO","TAMP860314464","TAMP860314HGTFZL09","JOSE PAUL TAFOYA MEZA",1,0,0,0,0,0,0,0,0,0,0,0,0,0,0,0,1,40,0,68299]
[null,"GUANAJUATO","LISA7512109V7","LISA751210MGTRLN04","ANA ISABEL LIRA SALDAﾑA",1,0,0,0,0,0,0,0,0,0,0,0,0,0,0,0,1,40,0,52236]
[null,"GUANAJUATO","LUGL7801215UA","LUGL780121HGTNRS00","LUIS ALBERTO LUNA GUERRA",1,0,0,0,0,0,0,0,0,0,0,0,0,0,0,0,1,40,0,68299]
[null,"GUANAJUATO","AUGF640316LK3","AUGF640316HGTGRR05","FRANCISCO JAVIER AGUIRRE GUERRERO",1,0,0,0,0,0,0,0,0,0,0,0,0,0,0,0,1,40,0,68299]
[null,"GUANAJUATO","HEMJ740921F99","HEMJ740921HGTRXND8","JUAN LORENZO HERNANDEZ MUﾑOZ",1,0,0,0,0,0,0,0,0,0,0,0,0,0,0,0,1,40,0,68299]
[null,"GUANAJUATO","HELJ920419M66","HELJ920419HQTRYS06","JOSE DE JESUS HERNANDEZ LOYOLA",1,0,0,0,0,0,0,0,0,0,0,0,0,0,0,0,1,40,0,34823]
[null,"GUANAJUATO","CASS881024AL7","CASS881024MGTHNN07","SANDRA PAULINA CHAVEZ SANCHEZ",1,0,0,0,0,0,0,0,0,0,0,0,0,0,0,0,1,40,0,52236]
[null,"GUANAJUATO","HOHL860601124","HOHL860601MGTRRZ09","LUZ ANGELICA HORTA HERNANDEZ",1,0,0,0,0,0,0,0,0,0,0,0,0,0,0,0,1,40,0,53182]
[null,"GUANAJUATO","CEGF8505052A9","CEGF850505HGTLTR01","FERNANDO CELEDON GUTIERREZ",1,0,0,0,0,0,0,0,0,0,0,0,0,0,0,0,1,40,0,77817]
[null,"GUANAJUATO","ROBA860619I59","RXBA860619MDFDRR07","ARIANA RODRIGUEZ BRITO",1,0,0,0,0,0,0,0,0,0,0,0,0,0,0,0,1,40,0,77817]
[null,"GUANAJUATO","NIJV910312FZ6","NIJV910312HDFTSC07","VICTOR DAVID NIETO JASSO",1,0,0,0,0,0,0,0,0,0,0,0,0,0,0,0,1,40,0,58729]
[null,"GUANAJUATO","BEGL8709056T2","BEGL870905HGTCRS09","LUIS ALFONSO BECERRA GARCIA",1,0,0,0,0,0,0,0,0,0,0,0,0,0,0,0,1,40,0,17412]
[null,"GUANAJUATO","JIAR5906097A6","JIAR590609HVZMNB07","ROBERTO JIMENEZ DEL ANGEL",1,0,0,0,0,0,0,0,0,0,0,0,0,0,0,0,1,40,0,240833]
[null,"Total Personas : ",270,null,null,null,null,null,null,null,null,null,null,null,null,null,null,null,null,null,null,"Total Recursos Ejercidos:",null,null,{"$f":"SUBTOTAL(109,Tabla11[Total de recursos presupuestales ejercidos en servicios personales en el periodo\n(2)])","v":12066977}]
[]
[null,"Fuente : Información proporcionada por las Entidades Federativas."]

{"sheet":"II C y 1_","index":5,"n_rows":351,"n_cols":22,"rows_kept":351,"cut":false,"hidden":false,"merged":[[345,18,345,19],[11,6,12,6],[11,7,12,7],[11,18,11,19],[11,3,12,3],[11,4,12,4],[8,1,8,8],[11,1,12,1],[11,2,12,2],[11,5,12,5],[11,20,12,20],[11,21,12,21],[11,8,12,8],[11,9,11,15],[11,16,12,16],[11,17,12,17]]}
[]
[]
[]
[]
[]
[]
[]
[null,"Formato: Personal Federalizado por Registro Federal de Contribuyentes"]
[null,{"$f":"IF('Caratula Resumen'!D22=\"Elige el Periodo…\",\"\",'Caratula Resumen'!D22)","v":"Fondo de Aportaciones para la Educación Tecnológica y de Adultos/Instituto Nacional para la Educación de los Adultos (FAETA/INEA)"},null,null,null,null,null,null,null,null,null,null,null,null,null,null,null,null,null,null,"2do. Trimestre 2016"]
[]
[]
[null,"Entidad Federativa","Clave CT","Turno","RFC","CURP","Nombre","Funcion Real","Horas que labora en el Centro de Trabajo","Clave Presupuestal",null,null,null,null,null,null,"Tipo de Categoría","Identificador de Contrato de Honorarios","Periodo de efecto de pago en el trimestre",null,"Percepciones pagadas en el Periodo de Comisión con Presupuesto Federal*","Percepciones pagadas en el Periodo de Comisión con Presupuesto de otra fuente*"]
[null,null,null,null,null,null,null,null,null,"Partida Presupuestal","Código de Pago","Clave de Unidad","Clave de Sub Unidad","Clave de Categoría","Horas Semana Mes ","Número de Plaza",null,null,"Inicial","Termino"]
[]
[null,"Entidad Federativa","Clave CT","Turno","RFC","CURP","Nombre","Funcion Real","Horas que labora en el Centro de Trabajo","Partida Presupuestal","Código de Pago","Clave de Unidad","Clave de Sub Unidad","Clave de Categoría","Horas semana mes","Número de plaza","Tipo de Categoría","Identificador de Contrato de Honorarios","Periodo de efecto de pago en el trimestre\nInicial","Periodo de efecto de pago en el trimestre\nTermino","Percepciones pagadas en el Periodo de Comisión con Presupuesto Federal*","Percepciones pagadas en el Periodo de Comisión con Presupuesto de otra fuente*"]
[null,"GUANAJUATO","11EBS0027E",100,"AAAL860804UN9","AAAL860804MTSBZD03","LUDIM ABRAHAM AZUARA","TECNICO MEDIO",35,83101,1,7,28,"T03803","00.0",184,2,null,null,null,25079,0]
[null,"GUANAJUATO","11EBS0027E",100,"AAGB8305061P7","AAGB830506MGTYTR02","BRENDA AYALA GUTIERREZ","TECNICO DOCENTE",35,83101,1,7,20,"T03820","00.0",62,2,null,null,null,30636,0]
[null,"GUANAJUATO","11EBS0027E",100,"AAGH700108U53","AAGH700108MGTLRR09","HORTENCIA ALMANZA GARCIA","TECNICO DOCENTE",35,83101,1,7,17,"T03820","00.0",1943,2,null,null,null,39932,0]
[null,"GUANAJUATO","11EBS0027E",100,"AEAJ851118LC0","AEAJ851118HGTRCN00","JUAN CARLOS ARMENTA ACEVEDO","TECNICO DOCENTE",35,83101,1,7,13,"T03820","00.0",1280,2,null,null,null,38198,0]
[null,"GUANAJUATO","11EBS0027E",100,"AELM6906275A6","AELR690627MGTRPS15","MA ROSARIO ARREGUIN LOPEZ","TECNICO DOCENTE",35,83101,1,7,25,"T03820","00.0",2195,2,null,null,null,40316,0]
[null,"GUANAJUATO","11EBS0027E",100,"AEPB811216AUA","AEPB811216MGTRLL03","BLANCA BERENICE ARREGUIN PALMA","PROFESIONAL DICTAMINADOR DE SERVICIOS ESPECIALIZADOS",35,83101,1,2,4,"CF21865","00.0",8,2,null,null,null,46319,0]
[null,"GUANAJUATO","11EBS0027E",100,"AERS660208UT4","AERS660208HGTRYR01","SERGIO ARREDONDO RAYA","TECNICO DOCENTE",35,83101,1,7,40,"T03820","00.0",2241,2,null,null,null,40892,0]
[null,"GUANAJUATO","11EBS0027E",100,"AILP690120TW9","AILP690120MSPRNT09","PATRICIA DE JESUS ARCIGA LEON","JEFE DE OFICINA",35,83101,1,7,42,"A01807","00.0",169,2,null,null,null,38546,0]
[null,"GUANAJUATO","11EBS0027E",100,"AIML940210D95","AIML940210MGTRNZ09","LUZ PATRICIA ARVIZU MONTES","JEFE DE OFICINA",35,83101,1,7,30,"A01807","00.0",172,2,null,null,null,13155,0]
[null,"GUANAJUATO","11EBS0027E",100,"AIMM891226K29","AIMM891226MMCMXR03","MARIANA AMBRIZ MUÑOZ","TECNICO MEDIO",35,83101,1,7,13,"T03803","00.0",338,2,null,null,null,27754,0]
[null,"GUANAJUATO","11EBS0027E",100,"AOJM820726EC0","AOJM820726HGTRRR08","MARIO ARGOTE JUAREZ","JEFE DE OFICINA",35,83101,1,2,6,"A01807","00.0",168,2,null,null,null,21925,0]
[null,"GUANAJUATO","11EBS0027E",100,"AUGA6812277W5","AUGA681227MGTGRN03","ANA MARIA AGUILAR GARCIA","ANALISTA ADMINISTRATIVO",35,83101,1,7,19,"A01806","00.0",450,2,null,null,null,31851,0]
[null,"GUANAJUATO","11EBS0027E",100,"AUGF640316LK3","AUGF640316HGTGRR05","FRANCISCO JAVIER AGUIRRE GUERRERO","COORDINADOR DE ZONA",40,83101,1,7,19,"CF36014","00.0",522,5,null,null,null,68299,0]
[null,"GUANAJUATO","11EBS0027E",100,"AUNC890701HB6","AUNC890701MQTGXR05","MARIA CRISTINA AGUADO NUÑEZ","OFICIAL DE SERVICIOS Y MANTEN.",35,83101,1,7,30,"S01803","00.0",1241,2,null,null,null,27754,0]
[null,"GUANAJUATO","11EBS0027E",100,"AURA5705038S9","AURA570503HGTGND03","JOSE ADOLFO AGUILERA RENDON","TECNICO DOCENTE",35,83101,1,7,43,"T03820","00.0",362,2,null,null,null,44897,0]
[null,"GUANAJUATO","11EBS0027E",100,"AURM640517UH3","AURM640517HGTGCR01","MARTIN AGUIRRE RICO","ANALISTA ADMINISTRATIVO",35,83101,1,7,40,"A01806","00.0",117,2,null,null,null,34652,0]
[null,"GUANAJUATO","11EBS0027E",100,"AUTC7502082I3","AUTC750208MGTGRN15","MA. CONSUELO AGUILAR TIRADO","TECNICO DOCENTE",35,83101,1,7,16,"T03820","00.0",1623,2,null,null,null,40124,0]
[null,"GUANAJUATO","11EBS0027E",100,"AUVA8802214EA","AUVA880221MGTNLN08","ANGELICA ANGUIANO VILLAGRANA","ESPECIALISTA EN PROYECTOS TECNICOS",35,83101,1,3,10,"T03810","00.0",2682,2,null,null,null,27754,0]
[null,"GUANAJUATO","11EBS0027E",100,"BABM6804276E6","BABM680427MMCXLR01","MARGARITA BAÑOS BAILON","TECNICO DOCENTE",35,83101,1,7,13,"T03820","00.0",1101,2,null,null,null,38972,0]
[null,"GUANAJUATO","11EBS0027E",100,"BACA640430UIA","BACA640430HGTLRN06","ANTONIO BALTAZAR CORTES","TECNICO DOCENTE",35,83101,1,7,16,"T03820","00.0",1739,2,null,null,null,41218,0]
[null,"GUANAJUATO","11EBS0027E",100,"BAGJ5610276T2","BAGC561027HGTLLR02","J. CARMEN BALDERAS GALLEGOS","TECNICO DOCENTE",35,83101,1,7,19,"T03820","00.0",658,2,null,null,null,37364,0]
[null,"GUANAJUATO","11EBS0027E",100,"BARA6501175H5","BARA650117MGTRDN02","ANTONIA BARRERA RODRIGUEZ","JEFE DE OFICINA",35,83101,1,7,16,"A01807","00.0",231,2,null,null,null,38174,0]
[null,"GUANAJUATO","11EBS0027E",100,"BARA700515RH6","BARA700515MGTRML07","ALMA VELIA BARBOSA RAMIREZ","SECRETARIA \"C\"",35,83101,1,7,25,"A03804","00.0",97,2,null,null,null,28327,0]
[null,"GUANAJUATO","11EBS0027E",100,"BAVG670930HU0","BAVG670930MGTRZD05","MA. GUADALUPE BARCENAS VAZQUEZ","TECNICO DOCENTE",35,83101,1,7,14,"T03820","00.0",664,2,null,null,null,42818,0]
[null,"GUANAJUATO","11EBS0027E",100,"BEBL7508072M7","BEBL750807HQTRRS05","J. LUIS BERRA BORTOLINI","TECNICO DOCENTE",35,83101,1,7,28,"T03820","00.0",125,2,null,null,null,37460,0]
[null,"GUANAJUATO","11EBS0027E",100,"BEGL8709056T2","BEGL870905HGTCRS09","LUIS ALFONSO BECERRA GARCIA","COORDINADOR REGIONAL",40,83101,1,5,12,"CF36014","00.0",21,5,null,null,null,17412,0]
[null,"GUANAJUATO","11EBS0027E",100,"BEMS700226KJ6","BEMS700226HGTCNL00","SALVADOR BECERRA MANDUJANO","TECNICO DOCENTE",35,83101,1,7,13,"T03820","00.0",2892,2,null,null,null,40604,0]
[null,"GUANAJUATO","11EBS0027E",100,"BINL4906195XA","BINL490619HDFRGS05","JOSE LUIS BRIBIESCA NEGRETE","JEFE DE OFICINA",35,83101,1,7,42,"A01807","00.0",132,2,null,null,null,36313,0]
[null,"GUANAJUATO","11EBS0027E",100,"BIRL710430QF2","BIRL710430HGTRZB03","LIBRADO BRICEÑO RUIZ","TECNICO DOCENTE",35,83101,1,7,42,"T03820","00.0",1590,2,null,null,null,41282,0]
[null,"GUANAJUATO","11EBS0027E",100,"CAAB610110HC5","CAAB610110MGTRRR07","BERTHA ANGELICA CARPIO ARAGON","TECNICO DOCENTE",35,83101,1,7,13,"T03820","00.0",2463,2,null,null,null,32889,0]
[null,"GUANAJUATO","11EBS0027E",100,"CABF530212GK8","CABF530212HGTNRR05","FRANCISCO JAVIER CANO BARRON","TECNICO DOCENTE",35,83101,1,7,33,"T03820","00.0",686,2,null,null,null,38774,0]
[null,"GUANAJUATO","11EBS0027E",100,"CACF6710055H4","CACF671005HGTLDR06","FRANCISCO CALDERON CAUDILLO","TECNICO DOCENTE",35,83101,1,7,15,"T03820","00.0",1102,2,null,null,null,41666,0]
[null,"GUANAJUATO","11EBS0027E",100,"CACJ850212C85","CACJ850212HGTMMN05","JUAN MIGUEL CAMARILLO CAMARILLO","ADMINISTRATIVO ESPECIALIZADO",35,83101,1,7,27,"A01803","00.0",27,2,null,null,null,8296,0]
[null,"GUANAJUATO","11EBS0027E",100,"CACP630616HG8","CACP630616MGTLHT16","MA. PATRICIA DOLORES CALDERON CHAVEZ","TECNICO MEDIO",35,83101,1,7,14,"T03803","00.0",178,2,null,null,null,33022,0]
[null,"GUANAJUATO","11EBS0027E",100,"CADI801221FT5","CADI801221HGTRSS00","ISRAEL CARDENAS DIOSDADO","ESPECIALISTA EN PROYECTOS TECNICOS",35,83101,1,7,28,"T03810","00.0",3702,2,null,null,null,28136,0]
[null,"GUANAJUATO","11EBS0027E",100,"CAEJ651225BV9","CAEJ651225HVZHSS03","JESUS CHAGALA ESPEJO","TECNICO DOCENTE",35,83101,1,7,14,"T03820","00.0",2946,2,null,null,null,35860,0]
[null,"GUANAJUATO","11EBS0027E",100,"CAGR650930FB6","CAGR650930HGTLYB04","RUBEN CALDERON GAYTAN","TECNICO DOCENTE",35,83101,1,7,25,"T03820","00.0",1269,2,null,null,null,40316,0]
[null,"GUANAJUATO","11EBS0027E",100,"CAGR690302HRA","CAGR690302MGTMMS03","MA. DEL ROSARIO CAMPOS GOMEZ","SECRETARIA \"C\"",35,83101,1,7,13,"A03804","00.0",300,2,null,null,null,34261,0]
[null,"GUANAJUATO","11EBS0027E",100,"CAGY820417182","CAGY820417MGTRTJ03","YAJAHIRA CARDENAS GUTIERREZ","TECNICO MEDIO",35,83101,1,7,24,"T03803","00.0",32,2,null,null,null,27212,0]
[null,"GUANAJUATO","11EBS0027E",100,"CAJU6804082V6","CAXJ680408MGTMXN08","JUANA MARIA CAMACHO ","JEFE DE OFICINA",35,83101,1,7,18,"A01807","00.0",2681,2,null,null,null,37957,0]
[null,"GUANAJUATO","11EBS0027E",100,"CALM860815G43","CALM860815MJCHNY02","MAYRA CAROLINA CHAVEZ DE LEÓN","SECRETARIA \"C\"",35,83101,1,1,3,"A03804","00.0",171,2,null,null,null,27212,0]
[null,"GUANAJUATO","11EBS0027E",100,"CAOC8910102C1","CAOC891010MGTSRR04","MARIA CRUZ CASTAÑEDA ORNELAS","TECNICO DOCENTE",35,83101,1,7,29,"T03820","00.0",367,2,null,null,null,39836,0]
[null,"GUANAJUATO","11EBS0027E",100,"CAOD910826S90","CAOD910826MSPNRL03","DULCE VIRIDIANA CANO ORTA","ESPECIALISTA EN PROYECTOS TECNICOS",35,83101,1,7,29,"T03810","00.0",201,2,null,null,null,27403,0]
[null,"GUANAJUATO","11EBS0027E",100,"CAOE780824GY2","CAOE780824MGTSRM07","EMILIA CASTELLANO ORTEGA","TECNICO MEDIO",35,83101,1,7,42,"T03803","00.0",3742,2,null,null,null,33178,0]
[null,"GUANAJUATO","11EBS0027E",100,"CAPJ840105CE0","CAPJ840105HGTMRL00","JULIO CESAR CAMACHO PRADO","TECNICO DOCENTE",35,83101,1,7,13,"T03820","00.0",1116,2,null,null,null,32889,0]
[null,"GUANAJUATO","11EBS0027E",100,"CARA730215VE3","CARA730215MGTHJL00","ALMA DELIA CHAVEZ ROJAS","TECNICO MEDIO",35,83101,1,7,24,"T03803","00.0",7,2,null,null,null,33571,0]
[null,"GUANAJUATO","11EBS0027E",100,"CARJ550620A19","CARJ550620HGTSDM09","JAIME CASTILLO RODRIGUEZ","TECNICO DOCENTE",35,83101,1,7,17,"T03820","00.0",794,2,null,null,null,39932,0]
[null,"GUANAJUATO","11EBS0027E",100,"CASE871206B31","CASE871206HGTSND05","JOSE EDUARDO CASTAÑEDA SAENZ","TECNICO DOCENTE",35,83101,1,7,40,"T03820","00.0",2887,2,null,null,null,33845,0]
[null,"GUANAJUATO","11EBS0027E",100,"CASR640104TEA","CASR640104MGTBNS05","ROSA MARIA CABRERA SANCHEZ","ESPECIALISTA EN PROYECTOS TECNICOS",35,83101,1,7,24,"T03810","00.0",2212,2,null,null,null,31182,0]
[null,"GUANAJUATO","11EBS0027E",100,"CASS881024AL7","CASS881024MGTHNN07","SANDRA PAULINA CHAVEZ SANCHEZ","JEFE DE DEPARTAMENTO",40,83101,1,9,51,"CF01059","00.0",52,5,null,null,null,52236,0]
[null,"GUANAJUATO","11EBS0027E",100,"CATE6508044X6","CATE650804MGTRRS04","ESPERANZA CARRILLO TORRES","TECNICO DOCENTE",35,83101,1,7,16,"T03820","00.0",622,2,null,null,null,39932,0]
[null,"GUANAJUATO","11EBS0027E",100,"CAVA651011TB7","CAVA651011HGTLRL04","JOSE ALFREDO CALDERON VARELA","TECNICO MEDIO",35,83101,1,7,15,"T03803","00.0",20,2,null,null,null,35641,0]
[null,"GUANAJUATO","11EBS0027E",100,"CAVJ620328P75","CAVG620328HGTHRD03","J. GUADALUPE CHAVEZ VARGAZ","TECNICO DOCENTE",35,83101,1,7,15,"T03820","00.0",2591,2,null,null,null,42626,0]
[null,"GUANAJUATO","11EBS0027E",100,"CAVS681207JX2","CAVS681207HGTNRL04","SALVADOR CANO VARGAS","COORDINADOR DE ZONA",40,83101,1,7,17,"CF36014","00.0",45,5,null,null,null,68875,0]
[null,"GUANAJUATO","11EBS0027E",100,"CEGF8505052A9","CEGF850505HGTLTR01","FERNANDO CELEDON GUTIERREZ","JEFE DE DEPARTAMENTO",40,83101,1,8,44,"CF01059","00.0",361,5,null,null,null,77817,0]
[null,"GUANAJUATO","11EBS0027E",100,"CIVM630826EF1","CIVR630826MGTSRS09","MA. DEL ROSARIO CISNEROS VERDIN","TECNICO DOCENTE",35,83101,1,7,13,"T03820","00.0",1959,2,null,null,null,36084,0]
[null,"GUANAJUATO","11EBS0027E",100,"COBA780319BUA","COBA780319HGTRTN00","JOSE ANTONIO CORDOBA BAUTISTA","ESPECIALISTA EN PROYECTOS TECNICOS",35,83101,1,7,16,"T03810","00.0",3572,2,null,null,null,27403,0]
[null,"GUANAJUATO","11EBS0027E",100,"COCB750608U65","COCB750608MGTRRL08","BLANCA RAQUEL CORONEL CARBAJAL","TECNICO DOCENTE",35,83101,1,7,15,"T03820","00.0",1867,2,null,null,null,39548,0]
[null,"GUANAJUATO","11EBS0027E",100,"COIM780815PDA","COIM780815HGTPRR02","MARIO ALBERTO COPADO IRINEO","TECNICO DOCENTE",35,83101,1,7,28,"T03820","00.0",176,2,null,null,null,30636,0]
[null,"GUANAJUATO","11EBS0027E",100,"COJP700317TZ9","COJP700317HMNRMD06","PEDRO CORTES JIMENEZ","PROFESIONAL DICTAMINADOR DE SERVICIOS ESPECIALIZADOS",35,83101,1,2,4,"CF21865","00.0",2,2,null,null,null,45719,0]
[null,"GUANAJUATO","11EBS0027E",100,"COMM660914G87","COMR660914MGTNDC09","MA. DEL ROCIO CONCHA MEDINA","TECNICO DOCENTE",35,83101,1,7,13,"T03820","00.0",151,2,null,null,null,36206,0]
[null,"GUANAJUATO","11EBS0027E",100,"COOD541119637","COOD541119MGTNRL00","DULCE MARIA ELIZABETH CONTRERAS ORDUÑA","JEFE DE OFICINA",35,83101,1,7,28,"A01807","00.0",578,2,null,null,null,37750,0]
[null,"GUANAJUATO","11EBS0027E",100,"COOM721217SVA","COOM721217MGTNLN02","MA. MANUELA CONTRERAS OLMOS","TECNICO DOCENTE",35,83101,1,7,22,"T03820","00.0",207,2,null,null,null,40604,0]
[null,"GUANAJUATO","11EBS0027E",100,"COOS660919CRA","COOS660919MGTNLS08","SUSANA ISABEL CONTRERAS OLMOS","TECNICO MEDIO",35,83101,1,7,22,"T03803","00.0",1631,2,null,null,null,33745,0]
[null,"GUANAJUATO","11EBS0027E",100,"COPC760616J13","COPC760616HGTRTR05","CARLOS ALBERTO CORDOBA PATIÑO","OFICIAL DE SERVICIOS Y MANTEN.",35,83101,1,7,14,"S01803","00.0",117,2,null,null,null,31791,0]
[null,"GUANAJUATO","11EBS0027E",100,"COPG660114BC1","COPG660114HGTNLR03","GERARDO LUIS CONTRERAS PALACIOS","TECNICO DOCENTE",35,83101,1,7,19,"T03820","00.0",281,2,null,null,null,42434,0]
[null,"GUANAJUATO","11EBS0027E",100,"COSL800716SL8","COSL800716MGTRRD08","LIDIA CAROLINA CORTES SIERRA","TECNICO DOCENTE",35,83101,1,7,42,"T03820","00.0",4511,2,null,null,null,39836,0]
[null,"GUANAJUATO","11EBS0027E",100,"COSY800415BF0","COSY800415MGTRVN04","YUNERY CORTES SAAVEDRA","JEFE DE OFICINA",35,83101,1,7,15,"A01807","00.0",326,2,null,null,null,33766,0]
[null,"GUANAJUATO","11EBS0027E",100,"CUFC8809064X4","CUFC880906MOCRNY08","CYNTHIA CRUZ FUENTES","ANALISTA ADMINISTRATIVO",35,83101,1,7,13,"A01806","00.0",91,2,null,null,null,16896,0]
[null,"GUANAJUATO","11EBS0027E",100,"CUPS720728BN7","CUPS720728MGTVSL06","SILVIA CUEVAS PESCADOR","ESPECIALISTA EN PROYECTOS TECNICOS",35,83101,1,7,43,"T03810","00.0",1102,2,null,null,null,28679,0]
[null,"GUANAJUATO","11EBS0027E",100,"CUSG780213V57","CUSG780213HGTRVL03","GUILIBALDO CRUZ SAAVEDRA","TECNICO DOCENTE",35,83101,1,7,42,"T03820","00.0",675,2,null,null,null,42148,0]
[null,"GUANAJUATO","11EBS0027E",100,"DOVL720318BXA","DOVL720318HGTMLS06","JOSE LUIS DOMINGUEZ VALDES","TECNICO DOCENTE",35,83101,1,7,15,"T03820","00.0",1701,2,null,null,null,39964,0]
[null,"GUANAJUATO","11EBS0027E",100,"DOVR6304095Y7","DOVR630409MBCMZS05","MARIA DEL ROSARIO DOMINGUEZ VAZQUEZ","TECNICO DOCENTE",35,83101,1,7,27,"T03820","00.0",1449,2,null,null,null,39356,0]
[null,"GUANAJUATO","11EBS0027E",100,"DUPS9001267KA","DUPS900126MGTRRN08","SANDRA IVONNE DURAN PRADO","SECRETARIA \"C\"",35,83101,1,7,42,"A03804","00.0",112,2,null,null,null,28327,0]
[null,"GUANAJUATO","11EBS0027E",100,"DUVE540209Q63","DUVE540209HGTRLR06","ERNESTO DURAN VALDIVIA","TECNICO DOCENTE",35,83101,1,7,27,"T03820","00.0",1242,2,null,null,null,43400,0]
[null,"GUANAJUATO","11EBS0027E",100,"EAAJ8712218X3","EAAJ871221MMCSLS09","MARIA DE JESUS ESCAMILLA ALVAREZ","ESPECIALISTA EN PROYECTOS TECNICOS",35,83101,1,7,25,"T03810","00.0",220,2,null,null,null,25270,0]
[null,"GUANAJUATO","11EBS0027E",100,"EARF920415GZ8","EARF920415MGTSDT17","FATIMA YAZMIN ESTRADA RODRIGUEZ","SECRETARIA \"C\"",35,83101,1,1,1,"A03804","00.0",3571,2,null,null,null,27754,0]
[null,"GUANAJUATO","11EBS0027E",100,"EASG700512IU9","EASG700512MCMSNR00","GRACIELA ESCAMILLA SANCHEZ","SECRETARIA \"C\"",35,83101,1,7,42,"A03804","00.0",3741,2,null,null,null,45429,0]
[null,"GUANAJUATO","11EBS0027E",100,"EICS8311094H1","EICS831109MGTLNN06","SANDRA ELISA ELIAS CONTRERAS","TECNICO DOCENTE",35,83101,1,7,29,"T03820","00.0",263,2,null,null,null,39836,0]
[null,"GUANAJUATO","11EBS0027E",100,"EIRJ6812089I5","EIRC681208HGTNMR05","J. CARLOS ENRIQUEZ RAMIREZ","TECNICO DOCENTE",35,83101,1,7,18,"T03820","00.0",1561,2,null,null,null,41282,0]
[null,"GUANAJUATO","11EBS0027E",100,"FAHG7612098T7","FAHG761209MGTLRD03","MA. GUADALUPE FALCON HERNANDEZ","ESPECIALISTA EN PROYECTOS TECNICOS",35,83101,1,7,41,"T03810","00.0",219,2,null,null,null,25079,0]
[null,"GUANAJUATO","11EBS0027E",100,"FAHI7401088Z2","FAHI740108HGTBRV04","IVAN FABELA HERNANDEZ","TECNICO DOCENTE",35,83101,1,7,33,"T03820","00.0",1793,2,null,null,null,41122,0]
[null,"GUANAJUATO","11EBS0027E",100,"FECM8910217I9","FECM891021MDFRVR01","MARIANA GUISELA FERREIRA CUEVAS","ESPECIALISTA EN PROYECTOS TECNICOS",35,83101,1,7,43,"T03810","00.0",116,2,null,null,null,28136,0]
[null,"GUANAJUATO","11EBS0027E",100,"FEET711003EB8","FEET711003MGTLSR05","TERESA FELIX ESTRELLA","ANALISTA ADMINISTRATIVO",35,83101,1,7,22,"A01806","00.0",283,2,null,null,null,36090,0]
[null,"GUANAJUATO","11EBS0027E",100,"FEGR710424QJ8","FEXG710424MGTRXR09","GRACIELA FERRER ","TECNICO DOCENTE",35,83101,1,7,24,"T03820","00.0",1392,2,null,null,null,30636,0]
[null,"GUANAJUATO","11EBS0027E",100,"FICJ7603185H9","FICT760318HGTRSR03","J. TRINIDAD FRIAS CASTAÑEDA","TECNICO DOCENTE",35,83101,1,7,40,"T03820","00.0",2114,2,null,null,null,40364,0]
[null,"GUANAJUATO","11EBS0027E",100,"FOAP6704124J5","FOAP670412MGTLLT01","PATRICIA FLORES ALVAREZ","ANALISTA PROGRAMADOR \"B\"",35,83101,1,2,4,"CF12804","00.0",0,2,null,null,null,18772,0]
[null,"GUANAJUATO","11EBS0027E",100,"FOMJ7811187W8","FOMJ781118HGTLDN07","JUAN PABLO FLORES MEDINA","TECNICO DOCENTE",35,83101,1,7,28,"T03820","00.0",128,2,null,null,null,38390,0]
[null,"GUANAJUATO","11EBS0027E",100,"FOMO6906162N2","FOMO690616HGTNDS05","OSCAR FONSECA MEDRANO","TECNICO DOCENTE",35,83101,1,7,27,"T03820","00.0",65,2,null,null,null,40364,0]
[null,"GUANAJUATO","11EBS0027E",100,"FONO7308067J5","FOXN730806MGTLXR04","NORMA LILIA FLORES ","TECNICO MEDIO",35,83101,1,7,19,"T03803","00.0",24,2,null,null,null,34087,0]
[null,"GUANAJUATO","11EBS0027E",100,"FOQL7110275I8","FOQL711027MGTLVN02","LEONOR FLORES QUEVEDO","TECNICO MEDIO",35,83101,1,7,28,"T03803","00.0",22,2,null,null,null,29416,0]
[null,"GUANAJUATO","11EBS0027E",100,"FOQP690616QU0","FOQP690616MGTLVT01","PETRA FLORES QUEVEDO","TECNICO DOCENTE",35,83101,1,7,22,"T03820","00.0",470,2,null,null,null,42792,0]
[null,"GUANAJUATO","11EBS0027E",100,"FOTL950830PQ2","FOTL950830MGTLRR02","LAURA JAZMIN FLORES TORRES","TECNICO DOCENTE",35,83101,1,7,27,"T03820","00.0",2251,2,null,null,null,30636,0]
[null,"GUANAJUATO","11EBS0027E",100,"GACC7402201D0","GACC740220MVZRYL09","CLAUDIA GARCIA CAYETANO","TECNICO DOCENTE",35,83101,1,7,27,"T03820","00.0",142,2,null,null,null,32889,0]
[null,"GUANAJUATO","11EBS0027E",100,"GAGY780903491","GAGY780903MDFLMS06","YOSELIN AIMEE GALVAN GAMEZ","ESPECIALISTA EN PROYECTOS TECNICOS",35,83101,1,7,30,"T03810","00.0",151,2,null,null,null,27754,0]
[null,"GUANAJUATO","11EBS0027E",100,"GALA740123JB8","GALA740123MGTLPL08","ALMA ROSA GALINDO LOPEZ","ESPECIALISTA EN PROYECTOS TECNICOS",35,83101,1,7,13,"T03810","00.0",187,2,null,null,null,27403,0]
[null,"GUANAJUATO","11EBS0027E",100,"GAMJ711118AJ8","GAMJ711118HGTRCC07","JACOBO GARCIA MICHACA","TECNICO DOCENTE",35,83101,1,7,18,"T03820","00.0",1932,2,null,null,null,41090,0]
[null,"GUANAJUATO","11EBS0027E",100,"GAML720417UE8","GAML720417HGTRRS07","LUIS ALBERTO GARCIA MARTINEZ","TECNICO DOCENTE",35,83101,1,7,35,"T03820","00.0",2754,2,null,null,null,40156,0]
[null,"GUANAJUATO","11EBS0027E",100,"GARM751031J11","GARM751031HGTRMS07","MOISES GRANADOS RAMOS","PROFESIONAL DICTAMINADOR DE SERVICIOS ESPECIALIZADOS",35,83101,1,8,44,"CF21865","00.0",5,2,null,null,null,46547,0]
[null,"GUANAJUATO","11EBS0027E",100,"GOAA581209FLA","GOAA581209MGTNGL08","ALICIA GONZALEZ AGUIRRE","ESPECIALISTA EN PROYECTOS TECNICOS",35,83101,1,7,22,"T03810","00.0",201,2,null,null,null,33775,0]
[null,"GUANAJUATO","11EBS0027E",100,"GOAS751103PH7","GOAS751103MGTNRL01","SILVIA SANTOS GONZALEZ ARANDA","TECNICO DOCENTE",35,83101,1,7,27,"T03820","00.0",1656,2,null,null,null,39404,0]
[null,"GUANAJUATO","11EBS0027E",100,"GOGA680110DL7","GOGA680110MGTNYN00","ANA BERTHA GONZALEZ GAYTAN","TECNICO DOCENTE",35,83101,1,7,25,"T03820","00.0",757,2,null,null,null,41858,0]
[null,"GUANAJUATO","11EBS0027E",100,"GOGE831013479","GOGE831013MGTNRL03","ELIA JUDITH GONZALEZ GUERRA","ESPECIALISTA EN PROYECTOS TECNICOS",35,83101,1,7,33,"T03810","00.0",198,2,null,null,null,27212,0]
[null,"GUANAJUATO","11EBS0027E",100,"GOGL670809V8A","GOGL670809HGTNRS00","LUIS ALBERTO GONZALEZ GARCIA","TECNICO DOCENTE",35,83101,1,7,25,"T03820","00.0",383,2,null,null,null,42242,0]
[null,"GUANAJUATO","11EBS0027E",100,"GOGR650725KF1","GOGR650725HGTNRB02","ROBERTO GONZALEZ GARCIA","TECNICO DOCENTE",35,83101,1,7,41,"T03820","00.0",235,2,null,null,null,42626,0]
[null,"GUANAJUATO","11EBS0027E",100,"GOMM610218KG4","GOMM610218MGTNRR05","MARTA PATRICIA GONZALEZ MORENO","SECRETARIA \"C\"",35,83101,1,7,13,"A03804","00.0",4412,2,null,null,null,34198,0]
[null,"GUANAJUATO","11EBS0027E",100,"GOND6504247RA","GOND650424MGTNXL03","DALIA SONIA GONZALEZ NIÑO","SECRETARIA \"C\"",35,83101,1,7,17,"A03804","00.0",135,2,null,null,null,31732,0]
[null,"GUANAJUATO","11EBS0027E",100,"GOOG7802057F2","GOOG780205HGTNRD04","JOSE GUADALUPE GONZALEZ ORTEGA","TECNICO DOCENTE",35,83101,1,7,42,"T03820","00.0",1686,2,null,null,null,39836,0]
[null,"GUANAJUATO","11EBS0027E",100,"GOPS8011178I3","GOPS801117MGTMRN09","MARIA SANDRA GOMEZ PEREZ","SECRETARIA \"C\"",35,83101,1,7,20,"A03804","00.0",2221,2,null,null,null,27531,0]
[null,"GUANAJUATO","11EBS0027E",100,"GORA840728TD1","GORA840728MDFNMN07","ANA LAURA GONZALEZ RAMOS","JEFE DE OFICINA",35,83101,1,7,25,"A01807","00.0",312,2,null,null,null,8770,0]
[null,"GUANAJUATO","11EBS0027E",100,"GORD8312168D4","GORD831216MGTMVL06","DULCE MARIA MONSERRAT GOMEZ RIVERA","TECNICO DOCENTE",35,83101,1,7,28,"T03820","00.0",1638,2,null,null,null,30636,0]
[null,"GUANAJUATO","11EBS0027E",100,"GORE840602N47","GORE840602HGTNDM00","EMMANUEL GONZALEZ RODRIGUEZ","TECNICO DOCENTE",35,83101,1,7,27,"T03820","00.0",2520,2,null,null,null,35150,0]
[null,"GUANAJUATO","11EBS0027E",100,"GORM961124VB9","GORM961124MGTNZC03","MICHEL YARED GONZALEZ RAZO","TECNICO DOCENTE",35,83101,1,7,20,"T03820","00.0",617,2,null,null,null,15318,0]
[null,"GUANAJUATO","11EBS0027E",100,"GOSE861110S23","GOSE861110MGTNNR01","ERIKA ELIZABETH GONZALEZ SANCHEZ","ADMINISTRATIVO ESPECIALIZADO",35,83101,1,9,51,"A01803","00.0",41,2,null,null,null,27754,0]
[null,"GUANAJUATO","11EBS0027E",100,"GOSL721116725","GOSL721116HGTRSS06","LUIS JAVIER GORDILLO SOSA","TECNICO DOCENTE",35,83101,1,7,28,"T03820","00.0",3037,2,null,null,null,40508,0]
[null,"GUANAJUATO","11EBS0027E",100,"GUAA541207PD5","GUAA541207MGTTVL07","ALMA ROSA GUTIERREZ AVILES","JEFE DE OFICINA",35,83101,1,7,19,"A01807","00.0",4231,2,null,null,null,33370,0]
[null,"GUANAJUATO","11EBS0027E",100,"GUGJ930811J60","GUGJ930811MGTRNS05","MARIA JOSE GUERRERO GONZALEZ","ADMINISTRATIVO ESPECIALIZADO",35,83101,1,5,12,"A01803","00.0",471,2,null,null,null,20740,0]
[null,"GUANAJUATO","11EBS0027E",100,"GUHA770213FQ8","GUHA770213MGTVRL02","ALMA ROSA GUEVARA HERNANDEZ","TECNICO DOCENTE",35,83101,1,7,13,"T03820","00.0",2046,2,null,null,null,39932,0]
[null,"GUANAJUATO","11EBS0027E",100,"GUMA6701215Q1","GUMA670121MGTTRN09","ANA GUTIERREZ MORENO","TECNICO DOCENTE",35,83101,1,7,24,"T03820","00.0",700,2,null,null,null,41858,0]
[null,"GUANAJUATO","11EBS0027E",100,"GUMC6804029G4","GUMC680402MGTZNR09","MARIA DEL CARMEN GUZMAN MANZANILLA","TECNICO DOCENTE",35,83101,1,7,15,"T03820","00.0",1911,2,null,null,null,41270,0]
[null,"GUANAJUATO","11EBS0027E",100,"GUMJ870317R44","GUMJ870317HGTRRN00","JONAS GUERRERO MARTINEZ","TECNICO DOCENTE",35,83101,1,7,40,"T03820","00.0",1171,2,null,null,null,30636,0]
[null,"GUANAJUATO","11EBS0027E",100,"GUMM920308B42","GUMM920308MGTRJN03","MONICA JUANA GUERRERO MEJIA","TECNICO DOCENTE",35,83101,1,7,28,"T03820","00.0",2525,2,null,null,null,30636,0]
[null,"GUANAJUATO","11EBS0027E",100,"GUNC8511262G5","GUNC851126HQRTVR08","CARLOS FELIPE GUTIERREZ NOVELO","ANALISTA ADMINISTRATIVO",35,83101,1,7,14,"CF34810","00.0",31,2,null,null,null,8448,0]
[null,"GUANAJUATO","11EBS0027E",100,"GUOA740914U2A","GUOA740914MMNDRN06","MA. DE LOS ANGELES GUDIÑO ORDAZ","SECRETARIA \"C\"",35,83101,1,7,43,"A03804","00.0",16,2,null,null,null,32593,0]
[null,"GUANAJUATO","11EBS0027E",100,"GURR6007275B3","GURR600727HSPLMD06","RODOLFO GUEL RAMIREZ","TECNICO DOCENTE",35,83101,1,7,30,"T03820","00.0",2478,2,null,null,null,40732,0]
[null,"GUANAJUATO","11EBS0027E",100,"GURV740105E98","GURV740105MGTRDR07","VERONICA GUERRERO RODRIGUEZ","SECRETARIA \"C\"",35,83101,1,7,13,"A03804","00.0",393,2,null,null,null,32134,0]
[null,"GUANAJUATO","11EBS0027E",100,"GUSS6608135L6","GUSS660813MGTRNF04","SOFIA GUERRERO SANDOVAL","TECNICO DOCENTE",35,83101,1,7,13,"T03820","00.0",590,2,null,null,null,39584,0]
[null,"GUANAJUATO","11EBS0027E",100,"GUZK880623FTA","GUZK880623HGTTVR01","KARIM MIGUEL GUTIERREZ ZAVALA","TECNICO MEDIO",35,83101,1,7,40,"T03803","00.0",2172,2,null,null,null,25270,0]
[null,"GUANAJUATO","11EBS0027E",100,"HEAE670513TV7","HEAE670513HGTRGD08","EDUARDO HERNANDEZ AGUADO","ANALISTA ADMINISTRATIVO",35,83101,1,7,25,"A01806","00.0",552,2,null,null,null,33770,0]
[null,"GUANAJUATO","11EBS0027E",100,"HECA7404077F6","HECA740407MGTRND08","ADRIANA HERNANDEZ CANTERO","TECNICO MEDIO",35,83101,1,7,14,"T03803","00.0",311,2,null,null,null,33916,0]
[null,"GUANAJUATO","11EBS0027E",100,"HECG7108185E0","HECG710818HGTRBR07","GERARDO HERNANDEZ CABEZA","TECNICO DOCENTE",35,83101,1,7,20,"T03820","00.0",199,2,null,null,null,30636,0]
[null,"GUANAJUATO","11EBS0027E",100,"HECG7209202C4","HECG720920MGTRRR07","GRISELDA HERRERA CERVANTES","SECRETARIA \"C\"",35,83101,1,7,24,"A03804","00.0",80,2,null,null,null,34777,0]
[null,"GUANAJUATO","11EBS0027E",100,"HECR621219RI5","HECR621219MGTRRS02","MARIA DEL ROSARIO HERNANDEZ CARDENAS","JEFE DE OFICINA",35,83101,1,7,18,"A01807","00.0",2481,2,null,null,null,38329,0]
[null,"GUANAJUATO","11EBS0027E",100,"HECS730303TG6","HECS730303MGTRNS05","SUSANA TERESA HERNANDEZ CANTERO","TECNICO MEDIO",35,83101,1,7,14,"T03803","00.0",1921,2,null,null,null,34261,0]
[null,"GUANAJUATO","11EBS0027E",100,"HEDM871214861","HEDM871214HGTRLN04","JOSE MANUEL HERNANDEZ DELGADO","TECNICO MEDIO",35,83101,1,1,3,"T03803","00.0",512,2,null,null,null,27212,0]
[null,"GUANAJUATO","11EBS0027E",100,"HEEE731209HI1","HEEE731209MGTRSS09","ESMERALDA HERNANDEZ ESCOGIDO","PROFESIONAL DICTAMINADOR DE SERVICIOS ESPECIALIZADOS",35,83101,1,9,53,"CF21865","00.0",6,2,null,null,null,46397,0]
[null,"GUANAJUATO","11EBS0027E",100,"HELJ920419M66","HELJ920419HQTRYS06","JOSE DE JESUS HERNANDEZ LOYOLA","COORDINADOR DE ZONA",40,83101,1,8,44,"CF36014","00.0",349,5,null,null,null,34823,0]
[null,"GUANAJUATO","11EBS0027E",100,"HELM710411Q56","HELM710411MGTRDR02","MARTHA ANGELICA HERNANDEZ LEDESMA","TECNICO DOCENTE",35,83101,1,7,27,"T03820","00.0",507,2,null,null,null,39836,0]
[null,"GUANAJUATO","11EBS0027E",100,"HEMJ740921F99","HEMJ740921HGTRXND8","JUAN LORENZO HERNANDEZ MUÑOZ","COORDINADOR DE ZONA",40,83101,1,7,18,"CF36014","00.0",84,5,null,null,null,68299,0]
[null,"GUANAJUATO","11EBS0027E",100,"HEMM781102T78","HEMM781102MGTRNR07","MARISELA HERNANDEZ MONTOYA","TECNICO DOCENTE",35,83101,1,7,35,"T03820","00.0",1999,2,null,null,null,40124,0]
[null,"GUANAJUATO","11EBS0027E",100,"HEPC690801P80","HEPC690801MGTRRR08","MA. DEL CARMEN HERNANDEZ PEREZ","TECNICO DOCENTE",35,83101,1,7,27,"T03820","00.0",1221,2,null,null,null,41474,0]
[null,"GUANAJUATO","11EBS0027E",100,"HERA790725FQ8","HERA790725MGTRDL08","ALEJANDRA HERNANDEZ RODRIGUEZ","ANALISTA ADMINISTRATIVO",35,83101,1,7,15,"A01806","00.0",1523,2,null,null,null,30643,0]
[null,"GUANAJUATO","11EBS0027E",100,"HERG571023MS0","HERG571023MGTRPD07","MA. GUADALUPE JUDITH HERNANDEZ RIPALDA","PROFESIONAL DICTAMINADOR DE SERVICIOS ESPECIALIZADOS",35,83101,1,1,2,"CF21865","00.0",1,2,null,null,null,46619,0]
[null,"GUANAJUATO","11EBS0027E",100,"HERG640304LK9","HERG640304MGTRDR09","GRACIELA HERNANDEZ RODRIGUEZ","TECNICO DOCENTE",35,83101,1,7,41,"T03820","00.0",812,2,null,null,null,30636,0]
[null,"GUANAJUATO","11EBS0027E",100,"HESF670102636","HESF670102HGTRLR07","FERMIN HERNANDEZ SILVA","JEFE DE OFICINA",35,83101,1,7,35,"A01807","00.0",405,2,null,null,null,38701,0]
[null,"GUANAJUATO","11EBS0027E",100,"HOHL860601124","HOHL860601MGTRRZ09","LUZ ANGELICA HORTA HERNANDEZ","JEFE DE DEPARTAMENTO",40,83101,1,2,4,"CF01059","00.0",21,5,null,null,null,53182,0]
[null,"GUANAJUATO","11EBS0027E",100,"HUSM771116C7A","HUSM771116MMNNLR06","MARIZA HUANTE SILVA","TECNICO MEDIO",35,83101,1,7,25,"T03803","00.0",301,2,null,null,null,25270,0]
[null,"GUANAJUATO","11EBS0027E",100,"IAJM900213S93","IAJM900213HGTBSR04","MARIO ALBERTO IBARRA JASSO","TECNICO DOCENTE",35,83101,1,7,29,"T03820","00.0",87,2,null,null,null,39836,0]
[null,"GUANAJUATO","11EBS0027E",100,"JAAA741109NM2","JAAA741109MGTSGL04","ALMA PATRICIA JASSO AGUILERA","TECNICO DOCENTE",35,83101,1,7,20,"T03820","00.0",2916,2,null,null,null,33845,0]
[null,"GUANAJUATO","11EBS0027E",100,"JAAX8707291Z3","JAAX870729MCLRRC03","XOCHITL YUVICELA JARA ARRIAGA","TECNICO MEDIO",35,83101,1,7,22,"T03803","00.0",511,2,null,null,null,28136,0]
[null,"GUANAJUATO","11EBS0027E",100,"JABE820909HH0","JABE820909MGTSLL12","ELOISA JASSO BALLEZA","SECRETARIA \"C\"",35,83101,1,8,44,"A03804","00.0",243,2,null,null,null,20740,0]
[null,"GUANAJUATO","11EBS0027E",100,"JIAR5906097A6","JIAR590609HVZMNB07","ROBERTO JIMENEZ DEL ANGEL","DELEGADO",40,83101,1,5,12,"CF14070","00.0",32,5,null,null,null,240833,0]
[null,"GUANAJUATO","11EBS0027E",100,"JUAA750702KJ9","JUAA750702HGTRRN04","JOSE ANDRES JUAREZ ARROYO","TECNICO DOCENTE",35,83101,1,7,19,"T03820","00.0",3033,2,null,null,null,40508,0]
[null,"GUANAJUATO","11EBS0027E",100,"JUCR790316G8A","JUCR790316HGTRPL02","RAUL HERIBERTO JUAREZ CAPETILLO","ESPECIALISTA EN PROYECTOS TECNICOS",35,83101,1,7,28,"T03810","00.0",83,2,null,null,null,8296,0]
[null,"GUANAJUATO","11EBS0027E",100,"JUEC8408019SA","JUEC840801MGTRSR08","MARIA DEL CARMEN IVONNE JUAREZ ESPITIA","TECNICO DOCENTE",35,83101,1,7,40,"T03820","00.0",704,2,null,null,null,30636,0]
[null,"GUANAJUATO","11EBS0027E",100,"JUON6804281K2","JUON680428HGTRRX00","NOE JUAREZ ORTEGA","TECNICO DOCENTE",35,83101,1,7,41,"T03820","00.0",2582,2,null,null,null,42626,0]
[null,"GUANAJUATO","11EBS0027E",100,"LAGG8705075P8","LAGG870507MGTGRS08","GISELA LAGUNA GUERRERO","TECNICO DOCENTE",35,83101,1,7,43,"T03820","00.0",391,2,null,null,null,39836,0]
[null,"GUANAJUATO","11EBS0027E",100,"LAMZ780504N49","LAMZ780504MSLRNN01","ZINTIA DENISE LARA MENDIVIL","TECNICO DOCENTE",35,83101,1,7,24,"T03820","00.0",2744,2,null,null,null,34106,0]
[null,"GUANAJUATO","11EBS0027E",100,"LAOJ8212131K9","LAOJ821213HGTRLS09","JESUS SAMUEL LARA OLMOS","TECNICO DOCENTE",35,83101,1,7,22,"T03820","00.0",1573,2,null,null,null,35150,0]
[null,"GUANAJUATO","11EBS0027E",100,"LEGJ871018BN9","LEGJ871018MGTDNN02","JENIFER LEDEZMA GONZALEZ","SECRETARIA \"C\"",35,83101,1,9,51,"A03804","00.0",209,2,null,null,null,20740,0]
[null,"GUANAJUATO","11EBS0027E",100,"LERM7308264B5","LERM730826MGTDSN09","MONICA LEDESMA ROSALES","TECNICO DOCENTE",35,83101,1,7,13,"T03820","00.0",1757,2,null,null,null,39356,0]
[null,"GUANAJUATO","11EBS0027E",100,"LISA7512109V7","LISA751210MGTRLN04","ANA ISABEL LIRA SALDAÑA","COORDINADOR DE ZONA",40,83101,1,1,1,"CF36014","00.0",378,5,null,null,null,52236,0]
[null,"GUANAJUATO","11EBS0027E",100,"LOCJ8109121HA","LOCJ810912HDFPRN00","JUAN CARLOS LOPEZ CRUZ","SECRETARIA \"C\"",35,83101,1,7,13,"A03804","00.0",2592,2,null,null,null,32633,0]
[null,"GUANAJUATO","11EBS0027E",100,"LOGC850904FK8","LOGC850904HGTPRR05","CARLOS ALBERTO LOPEZ GARCIA","TECNICO DOCENTE",35,83101,1,7,24,"T03820","00.0",67,2,null,null,null,32889,0]
[null,"GUANAJUATO","11EBS0027E",100,"LOHD930413C30","LOHD930413MGTPDN05","DIANA GUADALUPE LOPEZ HIDALGO","TECNICO DOCENTE",35,83101,1,7,42,"T03820","00.0",708,2,null,null,null,39836,0]
[null,"GUANAJUATO","11EBS0027E",100,"LOLA751009LC7","LOLA751009MGTPNN06","MA. DE LOS ANGELES LOPEZ LUNA","TECNICO DOCENTE",35,83101,1,7,25,"T03820","00.0",1951,2,null,null,null,40496,0]
[null,"GUANAJUATO","11EBS0027E",100,"LOLB681130LWA","LOLB681130MGTPLT03","BEATRIZ LOPEZ LLANOS","TECNICO DOCENTE",35,83101,1,7,43,"T03820","00.0",282,2,null,null,null,35390,0]
[null,"GUANAJUATO","11EBS0027E",100,"LOLG8002136P9","LOLG800213HGTPNS03","GUSTAVO LOPEZ LUNA","TECNICO DOCENTE",35,83101,1,7,35,"T03820","00.0",122,2,null,null,null,15318,0]
[null,"GUANAJUATO","11EBS0027E",100,"LOME901220AG6","LOME901220MQTRTS03","MARÍA ESTEFANÍA LORENZO MATA","TECNICO DOCENTE",35,83101,1,7,18,"T03820","00.0",14,2,null,null,null,27248,0]
[null,"GUANAJUATO","11EBS0027E",100,"LOVE3907178K6","LOVE390717MGTPZS07","MA. ESTELA LOPEZ VAZQUEZ","JEFE DE OFICINA",35,83101,1,7,20,"A01807","00.0",340,2,null,null,null,36292,0]
[null,"GUANAJUATO","11EBS0027E",100,"LOVH74031691A","LOVH740316HDFPNG06","HUGO LOPEZ VENEGAS","TECNICO DOCENTE",35,83101,1,7,19,"T03820","00.0",2029,2,null,null,null,40508,0]
[null,"GUANAJUATO","11EBS0027E",100,"LUGL7801215UA","LUGL780121HGTNRS00","LUIS ALBERTO LUNA GUERRA","COORDINADOR DE ZONA",40,83101,1,7,16,"CF36014","00.0",2581,5,null,null,null,68299,0]
[null,"GUANAJUATO","11EBS0027E",100,"LUMR751129U75","LUMR751129HGTGTC02","RICARDO ERNESTO LUGO MATA","TECNICO DOCENTE",35,83101,1,7,30,"T03820","00.0",109,2,null,null,null,32889,0]
[null,"GUANAJUATO","11EBS0027E",100,"LUOE610116R96","LUOE610116HDGNLM05","EMILIO LUNA OLAGUE","TECNICO DOCENTE",35,83101,1,7,14,"T03820","00.0",1922,2,null,null,null,42882,0]
[null,"GUANAJUATO","11EBS0027E",100,"LURF6001292T1","LURF600129HGTNMR01","FRANCISCO JAVIER LUNA RAMIREZ","TECNICO DOCENTE",35,83101,1,7,14,"T03820","00.0",200,2,null,null,null,42998,0]
[null,"GUANAJUATO","11EBS0027E",100,"MAAC750325Q52","MAAC750325MGTLLR02","MA. DEL CARMEN MALDONADO ALMANZA","SECRETARIA \"C\"",35,83101,1,7,14,"A03804","00.0",1522,2,null,null,null,30640,0]
[null,"GUANAJUATO","11EBS0027E",100,"MAAC750527A26","MAAC750527MGTRGR07","CAROLINA MARTINEZ AGREDA","ESPECIALISTA EN PROYECTOS TECNICOS",35,83101,1,7,14,"T03810","00.0",266,2,null,null,null,29874,0]
[null,"GUANAJUATO","11EBS0027E",100,"MAAL680513MP3","MAAL680513MMNRNZ01","MARIA DE LA LUZ MARTINEZ ANDRADE","TECNICO MEDIO",35,83101,1,7,27,"T03803","00.0",53,2,null,null,null,35461,0]
[null,"GUANAJUATO","11EBS0027E",100,"MABM7603207B6","MABM760320MGTCSR01","MARIANA MACHUCA BUSTAMANTE","TECNICO DOCENTE",35,83101,1,7,28,"T03820","00.0",1202,2,null,null,null,30636,0]
[null,"GUANAJUATO","11EBS0027E",100,"MACE770912412","MACE770912HQTRHC07","ECTOR JAVIER MARTINEZ CHAVEZ","COORDINADOR DE ZONA",40,83101,1,7,28,"CF36014","00.0",351,5,null,null,null,68857,0]
[null,"GUANAJUATO","11EBS0027E",100,"MADS8906296J1","MADS890629MGTRMR05","SUREY VIRIDIANA MARTINEZ DOMINGUEZ","ESPECIALISTA EN PROYECTOS TECNICOS",35,83101,1,7,15,"T03810","00.0",157,2,null,null,null,12444,0]
[null,"GUANAJUATO","11EBS0027E",100,"MADT730323NL2","MADT730323MGTTVR17","TERESITA DE JESUS MATA DAVALOS","ESPECIALISTA EN PROYECTOS TECNICOS",35,83101,1,7,42,"T03810","00.0",466,2,null,null,null,35293,0]
[null,"GUANAJUATO","11EBS0027E",100,"MAFR721206U28","MAFR721206MGTRLC04","ROCIO ANEL MARTINEZ FLORES","TECNICO DOCENTE",35,83101,1,7,15,"T03820","00.0",6162,2,null,null,null,15318,0]
[null,"GUANAJUATO","11EBS0027E",100,"MAGE550714NZ1","MAGE550714HGTRNS03","ESTEBAN MARTINEZ GONZALEZ","TECNICO DOCENTE",35,83101,1,7,30,"T03820","00.0",127,2,null,null,null,43400,0]
[null,"GUANAJUATO","11EBS0027E",100,"MAGE551119NR4","MAGE551119MGTYRD05","EDITH MAYCOTTE GRANADOS","TECNICO DOCENTE",35,83101,1,7,16,"T03820","00.0",1630,2,null,null,null,41282,0]
[null,"GUANAJUATO","11EBS0027E",100,"MAGE751103B16","MAGE751103MGTYTR08","ERIKA GUADALUPE MAYCOTTE GUTIERREZ","ANALISTA ADMINISTRATIVO",35,83101,1,7,16,"A01806","00.0",534,2,null,null,null,34796,0]
[null,"GUANAJUATO","11EBS0027E",100,"MAGG810106790","MAGG810106MGTRNR04","GRACIELA MARTINEZ GONZALEZ","SECRETARIA \"C\"",35,83101,1,7,28,"A03804","00.0",143,2,null,null,null,25079,0]
[null,"GUANAJUATO","11EBS0027E",100,"MAGM6404092N1","MAGM640409MGTNNR08","MARTA MANDUJANO GONZALEZ","TECNICO DOCENTE",35,83101,1,7,43,"T03820","00.0",749,2,null,null,null,41858,0]
[null,"GUANAJUATO","11EBS0027E",100,"MALA730704I26","MALA730704HGTRPR02","ARNULFO MARQUEZ LOPEZ","TECNICO DOCENTE",35,83101,1,7,27,"T03820","00.0",832,2,null,null,null,38198,0]
[null,"GUANAJUATO","11EBS0027E",100,"MANL580917DN5","MANL580917HGTRXS04","JOSE LUIS MARTINEZ NUÑEZ","TECNICO DOCENTE",35,83101,1,7,42,"T03820","00.0",435,2,null,null,null,39836,0]
[null,"GUANAJUATO","11EBS0027E",100,"MAOL731125E39","MAOL731125MGTLRC03","LUCINA MALDONADO ORDUÑO","JEFE DE OFICINA",35,83101,1,5,12,"A01807","00.0",598,2,null,null,null,37171,0]
[null,"GUANAJUATO","11EBS0027E",100,"MARC601223340","MARC601223MGTRLC03","CECILIA MARTINEZ RUELAS","TECNICO DOCENTE",35,83101,1,7,33,"T03820","00.0",475,2,null,null,null,37397,0]
[null,"GUANAJUATO","11EBS0027E",100,"MASV810101DZ8","MASV810101MGTRRR01","VERONICA MARTINEZ SARABIA","TECNICO DOCENTE",35,83101,1,7,40,"T03820","00.0",269,2,null,null,null,40316,0]
[null,"GUANAJUATO","11EBS0027E",100,"MEGG6409203P0","MEGG640920HGTDLR04","GERARDO MEDINA GALVAN","SECRETARIA \"C\"",35,83101,1,9,52,"A03804","00.0",2171,2,null,null,null,31286,0]
[null,"GUANAJUATO","11EBS0027E",100,"MELR640522PX9","MELR640522MGTNNT06","RITA MENDEZ LEON","TECNICO DOCENTE",35,83101,1,7,24,"T03820","00.0",456,2,null,null,null,40316,0]
[null,"GUANAJUATO","11EBS0027E",100,"MEMS601125CV5","MEMS601125HMNNLM04","SAMUEL MENDOZA MALDONADO","ESP. EN TELEINFORMATICA",35,83101,1,9,52,"CF12814","00.0",41,2,null,null,null,20424,0]
[null,"GUANAJUATO","11EBS0027E",100,"MENC680926QE2","MENC680926MGTDVR02","MARIA DEL CARMEN MEDEL NAVARRETE","TECNICO DOCENTE",35,83101,1,7,20,"T03820","00.0",1929,2,null,null,null,41090,0]
[null,"GUANAJUATO","11EBS0027E",100,"MENM790123EM1","MENM790123MGTDVR00","MIRIAM DE LOS ANGELES MEDEL NAVARRETE","SECRETARIA \"C\"",35,83101,1,7,20,"A03804","00.0",173,2,null,null,null,24888,0]
[null,"GUANAJUATO","11EBS0027E",100,"MERM890606QX7","MERM890606MGTNYY01","MYRIAM DE LOS ANGELES MENDOZA REYES","ESPECIALISTA EN PROYECTOS TECNICOS",35,83101,1,7,29,"T03810","00.0",112,2,null,null,null,25270,0]
[null,"GUANAJUATO","11EBS0027E",100,"MESE811002373","MEXS811002MGTJXL00","MARIA SELEM MEJIA ","TECNICO DOCENTE",35,83101,1,7,18,"T03820","00.0",699,2,null,null,null,15318,0]
[null,"GUANAJUATO","11EBS0027E",100,"METC6212134V3","METC621213HGTRPS06","CESAR MARTIN MERINO TAPIA","TECNICO DOCENTE",35,83101,1,7,15,"T03820","00.0",2186,2,null,null,null,40316,0]
[null,"GUANAJUATO","11EBS0027E",100,"MEVG630915G81","MEVG630915MGTRRD08","MA. GUADALUPE MERCADO VARELA","TECNICO DOCENTE",35,83101,1,7,43,"T03820","00.0",951,2,null,null,null,39194,0]
[null,"GUANAJUATO","11EBS0027E",100,"MISA810907T8A","MISA810907MGTRLL02","ALICIA MIRANDA SALAZAR","ADMINISTRATIVO ESPECIALIZADO",35,83101,1,7,15,"A01803","00.0",152,2,null,null,null,12444,0]
[null,"GUANAJUATO","11EBS0027E",100,"MISR800307LH4","MISR800307MGTRLS07","ROSAURA MIRANDA SALAZAR","ANALISTA ADMINISTRATIVO",35,83101,1,7,15,"A01806","00.0",4232,2,null,null,null,34970,0]
[null,"GUANAJUATO","11EBS0027E",100,"MIYA600511Q72","MIYA600511MGTRRN01","MA. ANTONIA MIRANDA YERENA","ANALISTA ADMINISTRATIVO",35,83101,1,7,14,"A01806","00.0",298,2,null,null,null,33739,0]
[null,"GUANAJUATO","11EBS0027E",100,"MOCK900306NE6","MOCK900306MDFRSR15","KAREN ANEL MORENO CASTILLO","TECNICO DOCENTE",35,83101,1,7,13,"T03820","00.0",1228,2,null,null,null,32889,0]
[null,"GUANAJUATO","11EBS0027E",100,"MOGC720409SJ9","MOGC720409MGTJZL04","CLAUDIA ELISA MOJICA GUZMAN","TECNICO DOCENTE",35,83101,1,7,27,"T03820","00.0",2819,2,null,null,null,38138,0]
[null,"GUANAJUATO","11EBS0027E",100,"MOMR770326563","MOMR770326HGTRRB08","ROBERTO CARLOS MORALES MURO","PROFESIONAL DICTAMINADOR DE SERVICIOS ESPECIALIZADOS",35,83101,1,9,52,"CF21865","00.0",13,2,null,null,null,45997,0]
[null,"GUANAJUATO","11EBS0027E",100,"MOPS740919966","MOPS740919MMCRRL01","SILVIA MORENO PARADA","ESPECIALISTA EN PROYECTOS TECNICOS",35,83101,1,7,25,"T03810","00.0",4512,2,null,null,null,25270,0]
[null,"GUANAJUATO","11EBS0027E",100,"MOSR650129V62","MOSR650129MGTRNF09","MA. DEL REFUGIO MORONES SANCHEZ","TECNICO DOCENTE",35,83101,1,7,27,"T03820","00.0",914,2,null,null,null,38198,0]
[null,"GUANAJUATO","11EBS0027E",100,"MOTE6904283LA","MOTE690428MGTRRL09","ELVIRA MORALES TORRES","TECNICO DOCENTE",35,83101,1,7,24,"T03820","00.0",1715,2,null,null,null,40508,0]
[null,"GUANAJUATO","11EBS0027E",100,"MUHD640208LB9","MUHD640208MDFXRL08","MARIA DOLORES MUÑOZ HERRERA","TECNICO DOCENTE",35,83101,1,7,27,"T03820","00.0",3030,2,null,null,null,40508,0]
[null,"GUANAJUATO","11EBS0027E",100,"MURE780503RL7","MURE780503MGTXVS02","MARIA ESMERALDA MUÑOZ RIVERA","PROFESIONAL DICTAMINADOR DE SERVICIOS ESPECIALIZADOS",35,83101,1,8,44,"CF21865","00.0",11,2,null,null,null,46319,0]
[null,"GUANAJUATO","11EBS0027E",100,"MURM820910149","MURM820910HGTRDR08","MAURICIO ALEJANDRO MURILLO RODRIGUEZ","COORDINADOR DE ZONA",40,83101,1,7,42,"CF36014","00.0",2222,5,null,null,null,68299,0]
[null,"GUANAJUATO","11EBS0027E",100,"NADP821016J68","NADP821016MGTVRL01","MARIA DEL PILAR NAVARRO DURAN","TECNICO DOCENTE",35,83101,1,7,27,"T03820","00.0",229,2,null,null,null,20424,0]
[null,"GUANAJUATO","11EBS0027E",100,"NAHL730801RV8","NAHL730801MGTVRR01","MARIA DE LOURDES NAVARRO HERNANDEZ","JEFE DE OFICINA",35,83101,1,7,14,"A01807","00.0",262,2,null,null,null,34278,0]
[null,"GUANAJUATO","11EBS0027E",100,"NAMR8410165H3","NAMR841016MGTVRS07","ROSALINDA NAVARRO MARTINEZ","TECNICO MEDIO",35,83101,1,7,18,"T03803","00.0",92,2,null,null,null,25079,0]
[null,"GUANAJUATO","11EBS0027E",100,"NAMS5306098W6","NAMS530609MGTRRL00","SILVIA LAURA NARVAEZ MORA","TECNICO DOCENTE",35,83101,1,7,16,"T03820","00.0",1619,2,null,null,null,40380,0]
[null,"GUANAJUATO","11EBS0027E",100,"NEAC740715LD9","NEAC740715HGTGRR02","CRISTOBAL NEGRETE ARIAS","TECNICO DOCENTE",35,83101,1,7,20,"T03820","00.0",1990,2,null,null,null,41330,0]
[null,"GUANAJUATO","11EBS0027E",100,"NEGM641224M74","NEGM641224MGTGVR06","MARTINA NEGRETE GOVEA","TECNICO DOCENTE",35,83101,1,7,13,"T03820","00.0",2894,2,null,null,null,34478,0]
[null,"GUANAJUATO","11EBS0027E",100,"NEPR690831KW1","NEPR690831HGTGDM08","RAMON GUILLERMO NEGRETE PADRON","TECNICO DOCENTE",35,83101,1,7,13,"T03820","00.0",264,2,null,null,null,38042,0]
[null,"GUANAJUATO","11EBS0027E",100,"NIJV910312FZ6","NIJV910312HDFTSC07","VICTOR DAVID NIETO JASSO","JEFE DE DEPARTAMENTO",40,83101,1,5,12,"CF01059","00.0",133,5,null,null,null,58729,0]
[null,"GUANAJUATO","11EBS0027E",100,"NIMU831228318","NIMU831228MGTXRR02","URSULA MACARENA NIÑO MARTINEZ","TECNICO DOCENTE",35,83101,1,7,33,"T03820","00.0",570,2,null,null,null,35150,0]
[null,"GUANAJUATO","11EBS0027E",100,"OEGL8003134Z8","OEGL800313MGTRMR09","LAURA AMERICA ORTEGA GAMIÑO","PROFESIONAL DICTAMINADOR DE SERVICIOS ESPECIALIZADOS",35,83101,1,9,51,"CF21865","00.0",12,2,null,null,null,46019,0]
[null,"GUANAJUATO","11EBS0027E",100,"OEMJ730208CX6","OEMM730208HGTJDR00","J. MERCED OJEDA MEDINA","TECNICO DOCENTE",35,83101,1,7,13,"T03820","00.0",299,2,null,null,null,38198,0]
[null,"GUANAJUATO","11EBS0027E",100,"OESD9012116A0","OESD901211MGTRVL05","DOLORES GUADALUPE ORTEGA SAAVEDRA","TECNICO MEDIO",35,83101,1,7,14,"T03803","00.0",42,2,null,null,null,12444,0]
[null,"GUANAJUATO","11EBS0027E",100,"OOPM650124AG1","OOPM650124HGTRRG05","MIGUEL OROZCO PEREZ","TECNICO DOCENTE",35,83101,1,7,16,"T03820","00.0",413,2,null,null,null,42242,0]
[null,"GUANAJUATO","11EBS0027E",100,"PACL700401SI9","PACL700401MGTRHR04","LAURA PRADO CHAVEZ","ANALISTA ADMINISTRATIVO",35,83101,1,7,13,"A01806","00.0",388,2,null,null,null,36386,0]
[null,"GUANAJUATO","11EBS0027E",100,"PACM931219CM1","PACM931219MDGLBY03","MAYLEN NOEMI PLASCENCIA CABRERA","SECRETARIA \"C\"",35,83101,1,7,41,"A03804","00.0",602,2,null,null,null,28136,0]
[null,"GUANAJUATO","11EBS0027E",100,"PACP681127IL7","PACP681127MGTRHT00","PATRICIA PRADO CHAVEZ","SECRETARIA \"C\"",35,83101,1,7,27,"A03804","00.0",25,2,null,null,null,35293,0]
[null,"GUANAJUATO","11EBS0027E",100,"PAGG860302DX9","PAGG860302MDFDRB08","GABRIELA PADILLA GUERRERO","ESPECIALISTA EN PROYECTOS TECNICOS",35,83101,1,7,33,"T03810","00.0",369,2,null,null,null,27212,0]
[null,"GUANAJUATO","11EBS0027E",100,"PAGT5911092P8","PAGT591109HGTLRD01","TEODORO PALMERIN GARCIA","TECNICO DOCENTE",35,83101,1,7,16,"T03820","00.0",2211,2,null,null,null,44118,0]
[null,"GUANAJUATO","11EBS0027E",100,"PAQF701109SJ2","PAQF701109HGTRNL00","FILEMON PAREDON QUINTERO","TECNICO DOCENTE",35,83101,1,7,19,"T03820","00.0",2780,2,null,null,null,40940,0]
[null,"GUANAJUATO","11EBS0027E",100,"PARL850303S64","PARL850303MGTDVN02","LEONOR PADILLA RIVERA","COORDINADOR DE ZONA",40,83101,1,2,4,"CF36014","00.0",46,5,null,null,null,55248,0]
[null,"GUANAJUATO","11EBS0027E",100,"PEAR630107AT2","PEAR630107HMCXRY08","JOSE REY PEÑA ARRIAGA","ANALISTA ADMINISTRATIVO",35,83101,1,8,44,"A01806","00.0",115,2,null,null,null,32047,0]
[null,"GUANAJUATO","11EBS0027E",100,"PECA660503AR0","PECA660503MGTRBN07","ANTONIA PEREZ CABELLO","ESPECIALISTA EN PROYECTOS TECNICOS",35,83101,1,7,20,"T03810","00.0",129,2,null,null,null,34900,0]
[null,"GUANAJUATO","11EBS0027E",100,"PECC830605V49","PECC830605MNEXSN04","CINTHYA PEÑALOZA CISNEROS","TECNICO MEDIO",35,83101,1,7,13,"T03803","00.0",114,2,null,null,null,29416,0]
[null,"GUANAJUATO","11EBS0027E",100,"PEDM7406101Q5","PEDM740610MDFRMR01","MARGARITA PERALTA DOMINGUEZ","TECNICO DOCENTE",35,83101,1,7,14,"T03820","00.0",2562,2,null,null,null,39164,0]
[null,"GUANAJUATO","11EBS0027E",100,"PEEM590530399","PEEM590530HDFRSN06","MANUEL ANGEL PEREZ ESCAMILLA","TECNICO DOCENTE",35,83101,1,7,29,"T03820","00.0",3292,2,null,null,null,42338,0]
[null,"GUANAJUATO","11EBS0027E",100,"PELL620125LZ0","PELL620125MVZRLR03","MARIA DE LOURDES PEREZ LLANOS","TECNICO DOCENTE",35,83101,1,7,15,"T03820","00.0",1096,2,null,null,null,38518,0]
[null,"GUANAJUATO","11EBS0027E",100,"PETL870430KW3","PETL870430MMNRPZ02","LUZ MARIA PEREZ TAPIA","ADMINISTRATIVO ESPECIALIZADO",35,83101,1,9,53,"A01803","00.0",30,2,null,null,null,27754,0]
[null,"GUANAJUATO","11EBS0027E",100,"PEYA830715T69","PEYA830715HGTRZN00","ANGEL ARMANDO PEREZ YZAGUIRRE","SECRETARIA \"C\"",35,83101,1,2,4,"A03804","00.0",371,2,null,null,null,28136,0]
[null,"GUANAJUATO","11EBS0027E",100,"PITJ930828Q89","PITJ930828HGTCRN07","JONATHAN EDUARDO PICON TORRES","ESPECIALISTA EN PROYECTOS TECNICOS",35,83101,1,8,44,"T03810","00.0",28,2,null,null,null,20740,0]
[null,"GUANAJUATO","11EBS0027E",100,"POLH650106FW2","POLH650106HDFZPG03","HUGO POZADA LOPEZ","PROFESIONAL DICTAMINADOR DE SERVICIOS ESPECIALIZADOS",35,83101,1,5,12,"CF21865","00.0",7,2,null,null,null,46019,0]
[null,"GUANAJUATO","11EBS0027E",100,"QUCL890311NE9","QUCL890311HGTNNS07","LUIS ALBERTO QUINTINO CINTORA","TECNICO DOCENTE",35,83101,1,7,25,"T03820","00.0",942,2,null,null,null,30636,0]
[null,"GUANAJUATO","11EBS0027E",100,"QULC671003EH8","QULC671003MDFRPL03","CLAUDIA REYNA QUIROZ LOPEZ","TECNICO DOCENTE",35,83101,1,7,16,"T03820","00.0",2177,2,null,null,null,40508,0]
[null,"GUANAJUATO","11EBS0027E",100,"QULJ710417B39","QULJ710417HDFRPN08","JUAN BERNARDO QUIROZ LOPEZ","TECNICO DOCENTE",35,83101,1,7,42,"T03820","00.0",1530,2,null,null,null,40316,0]
[null,"GUANAJUATO","11EBS0027E",100,"RAAG660220BC0","RAAG660220MGTMVD07","MA. GUADALUPE RUTH RAMOS AVILA","TECNICO DOCENTE",35,83101,1,7,35,"T03820","00.0",327,2,null,null,null,39932,0]
[null,"GUANAJUATO","11EBS0027E",100,"RAGM9005156P3","RAGM900515MGTMJN01","MONICA SAMANTHA RAMOS GOUJON","COORD. DE SERVICIOS ESP.",35,83101,1,2,4,"CF33849","00.0",373,2,null,null,null,26702,0]
[null,"GUANAJUATO","11EBS0027E",100,"RAJC810331LAA","RAJC810331MGTMRL02","CLAUDIA JACQUELINE RAMIREZ JARAMILLO","TECNICO MEDIO",35,83101,1,7,27,"T03803","00.0",10,2,null,null,null,33916,0]
[null,"GUANAJUATO","11EBS0027E",100,"RALE870501NL5","RALE870501MGTMYL02","MARIA ELENA RAMOS LOYOLA","TECNICO DOCENTE",35,83101,1,7,30,"T03820","00.0",118,2,null,null,null,32889,0]
[null,"GUANAJUATO","11EBS0027E",100,"RAMD681211IP3","RAMD681211HMCMRN05","DANIEL RAMIREZ MARTINEZ","TECNICO DOCENTE",35,83101,1,7,18,"T03820","00.0",1567,2,null,null,null,41282,0]
[null,"GUANAJUATO","11EBS0027E",100,"RAML6801057F2","RAML680105MMNMCN00","LINDA RAMIREZ MACEDO","TECNICO DOCENTE",35,83101,1,7,13,"T03820","00.0",468,2,null,null,null,38198,0]
[null,"GUANAJUATO","11EBS0027E",100,"RAOM680518SX1","RAOM680518MMNNCR06","MARIBEL RANGEL OCHOA","JEFE DE OFICINA",35,83101,1,5,12,"A01807","00.0",174,2,null,null,null,37522,0]
[null,"GUANAJUATO","11EBS0027E",100,"RARA580417NI3","RARA580417HGTMMR07","ARMANDO RAMIREZ RAMIREZ","TECNICO DOCENTE",35,83101,1,7,27,"T03820","00.0",17,2,null,null,null,20424,0]
[null,"GUANAJUATO","11EBS0027E",100,"RARC7011229A3","RARC701122MGTNDR00","MA. CARLOTA PATRICIA RANGEL RODRIGUEZ","TECNICO DOCENTE",35,83101,1,7,14,"T03820","00.0",1926,2,null,null,null,39964,0]
[null,"GUANAJUATO","11EBS0027E",100,"RARC7301176A2","RARC730117MGTMVR07","MA. CARINA ALEJANDRA RAMIREZ RIVAS","TECNICO DOCENTE",35,83101,1,7,14,"T03820","00.0",2815,2,null,null,null,37460,0]
[null,"GUANAJUATO","11EBS0027E",100,"RATR611023E56","RATR611023MGTMRS03","ROSA MAGDALENA RAMIREZ TRONCOSO","TECNICO DOCENTE",35,83101,1,7,22,"T03820","00.0",66,2,null,null,null,43400,0]
[null,"GUANAJUATO","11EBS0027E",100,"REFE870611H65","REFE870611HGTYNL02","ELI JUAN RUBEN REYES FUENTES","ANALISTA ADMINISTRATIVO",35,83101,1,2,6,"A01806","00.0",420,2,null,null,null,12672,0]
[null,"GUANAJUATO","11EBS0027E",100,"REGJ781111QG6","REGJ781111HGTYRN09","JUAN MANUEL REYES GUERRERO","COORDINADOR DE ZONA",40,83101,1,7,41,"CF36014","00.0",82,5,null,null,null,65005,0]
[null,"GUANAJUATO","11EBS0027E",100,"REPC540808QI9","REPC540808MGTNRN06","MARIA CONCEPCION RENTERIA PEREZ","TECNICO DOCENTE",35,83101,1,5,12,"T03820","00.0",1339,2,null,null,null,44010,0]
[null,"GUANAJUATO","11EBS0027E",100,"RICR7705149U3","RICR770514HGTVRB05","ROBERTO CARLOS RIVERA CORONILLA","TECNICO DOCENTE",35,83101,1,7,18,"T03820","00.0",2934,2,null,null,null,40540,0]
[null,"GUANAJUATO","11EBS0027E",100,"RIHM750221AD5","RIHM750221HGTSRG01","MIGUEL DAMICIO RIOS HERNANDEZ","TECNICO DOCENTE",35,83101,1,7,18,"T03820","00.0",2174,2,null,null,null,26548,0]
[null,"GUANAJUATO","11EBS0027E",100,"RILM750601TH0","RILM750601MOCSSG04","MAGDALENA RIOS LUIS","TECNICO DOCENTE",35,83101,1,7,17,"T03820","00.0",531,2,null,null,null,42291,0]
[null,"GUANAJUATO","11EBS0027E",100,"RIRJ650926ED3","RIRJ650926HGTCMX07","J.JESUS RICO RAMIREZ","SECRETARIA \"C\"",35,83101,1,8,44,"A03804","00.0",3291,2,null,null,null,32787,0]
[null,"GUANAJUATO","11EBS0027E",100,"RIRS751216TU4","RIRS751216MDFSMN07","SONIA RIOS RAMOS","TECNICO DOCENTE",35,83101,1,7,35,"T03820","00.0",2558,2,null,null,null,38042,0]
[null,"GUANAJUATO","11EBS0027E",100,"RIRZ9005014I8","RIRZ900501MMCCJZ06","ZAZIL RICO ROJAS","TECNICO MEDIO",35,83101,1,7,29,"T03803","00.0",22,2,null,null,null,28136,0]
[null,"GUANAJUATO","11EBS0027E",100,"ROBA860619I59","RXBA860619MDFDRR07","ARIANA RODRIGUEZ BRITO","JEFE DE DEPARTAMENTO",40,83101,1,1,1,"CF01059","00.0",241,5,null,null,null,77817,0]
[null,"GUANAJUATO","11EBS0027E",100,"ROBC900904U49","ROBC900904MDFCZT03","CITLALLIN MARGARITA ROCHA BAEZA","COORD. DE SERVICIOS ESP.",35,83101,1,2,4,"CF33849","00.0",296,2,null,null,null,33922,0]
[null,"GUANAJUATO","11EBS0027E",100,"ROCR541120D22","ROCR541120HGTSVC07","RICARDO FEDERICO ROSALES COVARRUBIAS","TECNICO DOCENTE",35,83101,1,7,15,"T03820","00.0",2665,2,null,null,null,40316,0]
[null,"GUANAJUATO","11EBS0027E",100,"ROJJ610420EGA","ROJC610420HGTCMR06","J. CARMEN ROCHA JIMENEZ","TECNICO DOCENTE",35,83101,1,7,35,"T03820","00.0",472,2,null,null,null,39648,0]
[null,"GUANAJUATO","11EBS0027E",100,"ROJJ671130GY1","ROJJ671130HGTDMS06","JOSE RODRIGUEZ JIMENEZ","TECNICO DOCENTE",35,83101,1,7,17,"T03820","00.0",1322,2,null,null,null,39726,0]
[null,"GUANAJUATO","11EBS0027E",100,"ROLA760606566","ROLA760606HGTJPN03","JOSE ANTONIO ROJAS LOPEZ","TECNICO DOCENTE",35,83101,1,7,19,"T03820","00.0",1162,2,null,null,null,39932,0]
[null,"GUANAJUATO","11EBS0027E",100,"ROPE881009G46","ROPE881009MGTDRV05","EVELIN GUADALUPE RODRIGUEZ PEREZ","TECNICO DOCENTE",35,83101,1,7,14,"T03820","00.0",1431,2,null,null,null,32889,0]
[null,"GUANAJUATO","11EBS0027E",100,"ROPP680417AU8","ROPP680417MGTDRT05","PATRICIA RODRIGUEZ PEREZ","TECNICO DOCENTE",35,83101,1,7,13,"T03820","00.0",2715,2,null,null,null,40508,0]
[null,"GUANAJUATO","11EBS0027E",100,"RORC700828A28","RORC700828MGTMML06","CLAUDIA IMELDA ROMERO RAMOS","TECNICO DOCENTE",35,83101,1,7,15,"T03820","00.0",459,2,null,null,null,39484,0]
[null,"GUANAJUATO","11EBS0027E",100,"RORD790510T10","RORD790510MGTMML09","DULCE MARIA ROMERO RAMIREZ","TECNICO DOCENTE",35,83101,1,7,13,"T03820","00.0",276,2,null,null,null,20424,0]
[null,"GUANAJUATO","11EBS0027E",100,"ROSJ600516BL3","ROSJ600516MGTBNN05","JUANA ROBLES SANTANA","TECNICO DOCENTE",35,83101,1,7,14,"T03820","00.0",1952,2,null,null,null,40700,0]
[null,"GUANAJUATO","11EBS0027E",100,"ROSR7704116C6","ROSR770411MGTDLS01","MARIA DEL ROSARIO RODRIGUEZ SALGADO","TECNICO DOCENTE",35,83101,1,7,27,"T03820","00.0",1104,2,null,null,null,40112,0]
[null,"GUANAJUATO","11EBS0027E",100,"ROTD900918TRA","ROTD900918HVZDLG06","DAGOBERTO RODRIGUEZ TELLO","TECNICO DOCENTE",35,83101,1,7,30,"T03820","00.0",703,2,null,null,null,30636,0]
[null,"GUANAJUATO","11EBS0027E",100,"ROVK831026QX5","ROVK831026MGTSZR01","MARIA KARINA ROSAS VAZQUEZ","TECNICO DOCENTE",35,83101,1,7,28,"T03820","00.0",2880,2,null,null,null,33845,0]
[null,"GUANAJUATO","11EBS0027E",100,"ROVR580704ND4","ROVR580704HVZXLB09","ROBERTO ROA VELAZQUEZ","COORDINADOR DE ZONA",40,83101,1,7,25,"CF36014","00.0",472,5,null,null,null,68977,0]
[null,"GUANAJUATO","11EBS0027E",100,"RUCE791216KR2","RUCE791216HGTLRD00","EDUARDO RUELAS CORNEJO","COORDINADOR DE ZONA",40,83101,1,7,35,"CF36014","00.0",48,5,null,null,null,68299,0]
[null,"GUANAJUATO","11EBS0027E",100,"SAAL700325CX2","SAAL700325MGTNGT00","LETICIA SANDOVAL AGUAYO","TECNICO DOCENTE",35,83101,1,7,15,"T03820","00.0",1614,2,null,null,null,39164,0]
[null,"GUANAJUATO","11EBS0027E",100,"SAAP650303N74","SAAP650303MGTNLT02","PATRICIA SANCHEZ ALVARADO","ESPECIALISTA EN PROYECTOS TECNICOS",35,83101,1,7,27,"T03810","00.0",286,2,null,null,null,32080,0]
[null,"GUANAJUATO","11EBS0027E",100,"SACA4609287F8","SACA460928MGTNRL03","MA. ALEJANDRINA CARMEN SANCHEZ CARRASCO","ESPECIALISTA EN PROYECTOS TECNICOS",35,83101,1,7,16,"T03810","00.0",214,2,null,null,null,34633,0]
[null,"GUANAJUATO","11EBS0027E",100,"SACM760716KV0","SACM760716MJCNSN08","MONICA DEL CARMEN SANDOVAL CASTELLON","ANALISTA ADMINISTRATIVO",35,83101,1,2,6,"A01806","00.0",8,2,null,null,null,33146,0]
[null,"GUANAJUATO","11EBS0027E",100,"SACT890401492","SACT890401HGTNLD08","TADEO SANCHEZ CALDERON","TECNICO DOCENTE",35,83101,1,7,29,"T03820","00.0",149,2,null,null,null,39836,0]
[null,"GUANAJUATO","11EBS0027E",100,"SAME750520NR8","SAME750520MGTNJR05","ERIKA SANCHEZ MEJIA","TECNICO DOCENTE",35,83101,1,7,41,"T03820","00.0",192,2,null,null,null,35150,0]
[null,"GUANAJUATO","11EBS0027E",100,"SAMM750910419","SAMM750910MGTCRR00","MERCEDES ELENA SAUCEDO MORENO","TECNICO DOCENTE",35,83101,1,7,24,"T03820","00.0",54,2,null,null,null,39740,0]
[null,"GUANAJUATO","11EBS0027E",100,"SEER810904RN6","SEER810904HGTRSF07","RAFAEL SERRATO ESPINOSA","JEFE DE OFICINA",35,83101,1,7,25,"A01807","00.0",191,2,null,null,null,34420,0]
[null,"GUANAJUATO","11EBS0027E",100,"SEGE921103JEA","SEGE921103MMNRRS05","ESTEFANIA SERRATO GARCIA","TECNICO MEDIO",35,83101,1,7,35,"T03803","00.0",29,2,null,null,null,12444,0]
[null,"GUANAJUATO","11EBS0027E",100,"SOBF761123PU9","SOBF761123HGTLRR07","FRANCISCO SOLORZANO BERNAL","TECNICO DOCENTE",35,83101,1,7,15,"T03820","00.0",4411,2,null,null,null,39836,0]
[null,"GUANAJUATO","11EBS0027E",100,"SOSM750119S26","SOSM750119MGTRTR02","MARTHA SORIA SOTO","ANALISTA ADMINISTRATIVO",35,83101,1,7,19,"A01806","00.0",3701,2,null,null,null,34388,0]
[null,"GUANAJUATO","11EBS0027E",100,"TAML5306213J5","TAML530621HGTPRS02","JOSE LUIS TAPIA MARTINEZ","SECRETARIA \"C\"",35,83101,1,9,52,"A03804","00.0",315,2,null,null,null,31199,0]
[null,"GUANAJUATO","11EBS0027E",100,"TAMP860314464","TAMP860314HGTFZL09","JOSE PAUL TAFOYA MEZA","COORDINADOR DE ZONA",40,83101,1,7,20,"CF36014","00.0",310,5,null,null,null,68299,0]
[null,"GUANAJUATO","11EBS0027E",100,"TEMY831012PC7","TEMY831012MGTRDD05","YADIRA ELISA TERAN MEDINA","OFICIAL DE SERVICIOS Y MANTEN.",35,83101,1,7,16,"S01803","00.0",150,2,null,null,null,32476,0]
[null,"GUANAJUATO","11EBS0027E",100,"TOAN630405S63","TOXA630405HGTLXN01","JOSE ANTONIO TOLENTINO ","TECNICO DOCENTE",35,83101,1,7,17,"T03820","00.0",295,2,null,null,null,39968,0]
[null,"GUANAJUATO","11EBS0027E",100,"TOFF601228BV5","TOFF601228HGTRGR04","FRANCISCO JAVIER TORRES FIGUEROA","TECNICO DOCENTE",35,83101,1,7,27,"T03820","00.0",892,2,null,null,null,39836,0]
[null,"GUANAJUATO","11EBS0027E",100,"TOFM860110TE7","TOFM860110MGTRNR00","MARTHA EDITH TORRES FUENTES","TECNICO DOCENTE",35,83101,1,7,42,"T03820","00.0",972,2,null,null,null,39836,0]
[null,"GUANAJUATO","11EBS0027E",100,"TOMG850829D80","TOMG850829HGTRRD08","JOSE GUADALUPE DE LA TORRE MARQUEZ","OFICIAL DE SERVICIOS Y MANTEN.",35,83101,1,7,27,"S01803","00.0",146,2,null,null,null,32308,0]
[null,"GUANAJUATO","11EBS0027E",100,"TONL701209CT8","TONL701209MGTRCR09","LAURA MA GUADALUPE TORRES NACHE","COORD. DE SERVICIOS ESP.",35,83101,1,2,6,"CF33849","00.0",521,2,null,null,null,34696,0]
[null,"GUANAJUATO","11EBS0027E",100,"TOSH760727J54","TOSH760727HGTRNC04","HECTOR DANIEL TORRES SAENEZ","TECNICO DOCENTE",35,83101,1,7,13,"T03820","00.0",119,2,null,null,null,37460,0]
[null,"GUANAJUATO","11EBS0027E",100,"UORV800303CD1","UORV800303MGTLNR08","VERONICA ULLOA RANGEL","SECRETARIA \"C\"",35,83101,1,1,3,"A03804","00.0",91,2,null,null,null,29932,0]
[null,"GUANAJUATO","11EBS0027E",100,"VAGL591217DU7","VAGL591217MGTRRL06","LILIA VARGAS GARCIDUEÑAS","TECNICO DOCENTE",35,83101,1,7,15,"T03820","00.0",69,2,null,null,null,43400,0]
[null,"GUANAJUATO","11EBS0027E",100,"VALF830903IU4","VALF830903HGTLNR07","FRANCISCO JAVIER VALDEZ LANDIN","TECNICO DOCENTE",35,83101,1,7,13,"T03820","00.0",766,2,null,null,null,33518,0]
[null,"GUANAJUATO","11EBS0027E",100,"VAMM8611122V7","VAMM861112MGTZCY00","MAYRA VAZQUEZ MACARENA","ESPECIALISTA EN PROYECTOS TECNICOS",35,83101,1,7,28,"T03810","00.0",144,2,null,null,null,12444,0]
[null,"GUANAJUATO","11EBS0027E",100,"VAPM701212VE4","VAPG701212MGTLRD04","MA. GUADALUPE VALADEZ PEREZ","TECNICO MEDIO",35,83101,1,7,41,"T03803","00.0",344,2,null,null,null,8296,0]
[null,"GUANAJUATO","11EBS0027E",100,"VAPR690730J94","VAPR690730MGTZNS03","ROSA LAURA VAZQUEZ PONCE","JEFE DE OFICINA",35,83101,1,7,19,"A01807","00.0",261,2,null,null,null,38104,0]
[null,"GUANAJUATO","11EBS0027E",100,"VAQE630516EZ8","VAQE630516MGTRVS07","ESTHELA VARGAS QUEVEDO","JEFE DE OFICINA",35,83101,1,7,22,"A01807","00.0",2231,2,null,null,null,36871,0]
[null,"GUANAJUATO","11EBS0027E",100,"VAQG581212JV2","VAQG581212HGTLJD08","J. GUADALUPE VALENCIA QUIJAS","TECNICO DOCENTE",35,83101,1,7,41,"T03820","00.0",511,2,null,null,null,39584,0]
[null,"GUANAJUATO","11EBS0027E",100,"VARA570811AR0","VARA570811MVZLDN06","ANA YOLANDA VALERIO RODRIGUEZ","TECNICO DOCENTE",35,83101,1,7,27,"T03820","00.0",2812,2,null,null,null,38234,0]
[null,"GUANAJUATO","11EBS0027E",100,"VARA71012288A","VARA710122MGTRMN01","MARIA DE LOS ANGELES VARGAS RAMIREZ","TECNICO DOCENTE",35,83101,1,7,17,"T03820","00.0",1655,2,null,null,null,41282,0]
[null,"GUANAJUATO","11EBS0027E",100,"VARL750211VB2","VARL750211MGTRMR07","MARIA LOURDES VARGAS RAMIREZ","JEFE DE OFICINA",35,83101,1,7,17,"A01807","00.0",345,2,null,null,null,35559,0]
[null,"GUANAJUATO","11EBS0027E",100,"VATL701230M12","VATL701230MGTLRZ04","LUZ MARIA VALLE TORRES","ESPECIALISTA EN PROYECTOS TECNICOS",35,83101,1,7,15,"T03810","00.0",2482,2,null,null,null,28136,0]
[null,"GUANAJUATO","11EBS0027E",100,"VATR761025BJA","VATR761025MDFRRS05","ROSA MARIA VARGAS TRUJILLO","TECNICO SUPERIOR",35,83101,1,8,44,"T03823","00.0",941,2,null,null,null,41918,0]
[null,"GUANAJUATO","11EBS0027E",100,"VEPE671201NI6","VEPE671201MGTGRG04","MARIA EUGENIA VEGA PAREDES","TECNICO DOCENTE",35,83101,1,7,33,"T03820","00.0",1632,2,null,null,null,39612,0]
[null,"GUANAJUATO","11EBS0027E",100,"VERT861015NB6","VERT861015MGTRMR01","TERESA VERDE RAMIREZ","TECNICO DOCENTE",35,83101,1,7,30,"T03820","00.0",915,2,null,null,null,39836,0]
[null,"GUANAJUATO","11EBS0027E",100,"VEVS760824QM4","VEVS760824MGTNLL09","SILVINA ELIZABETH VENEGAS VILLALOBOS","TECNICO DOCENTE",35,83101,1,7,42,"T03820","00.0",2447,2,null,null,null,32562,0]
[null,"GUANAJUATO","11EBS0027E",100,"VIGO710314HSA","VIGO710314HGTLNS05","OSCAR JACOBO VILLICAÑA GONZALEZ","TECNICO DOCENTE",35,83101,1,7,41,"T03820","00.0",1185,2,null,null,null,36884,0]
[null,"GUANAJUATO","11EBS0027E",100,"VILR670220CZ3","VILR670220MGTLNM04","RAMONA VILLANUEVA LUNA","TECNICO DOCENTE",35,83101,1,7,43,"T03820","00.0",2191,2,null,null,null,43010,0]
[null,"GUANAJUATO","11EBS0027E",100,"VIMG771213D20","VIMG771213MGTLNB08","GABRIELA VILLANUEVA MENDOZA","JEFE DE OFICINA",35,83101,1,5,12,"A01807","00.0",6161,2,null,null,null,36655,0]
[null,"GUANAJUATO","11EBS0027E",100,"VINF7009219V8","VINF700921HGTLXR06","FRANCISCO ALFONSO VILCHES NUÑEZ","TECNICO DOCENTE",35,83101,1,7,27,"T03820","00.0",705,2,null,null,null,41954,0]
[null,"GUANAJUATO","11EBS0027E",100,"VIRM731126CL3","VIRM731126MGTLMN06","MARIA MONICA VILLANUEVA RAMIREZ","ANALISTA ADMINISTRATIVO",35,83101,1,7,35,"A01806","00.0",51,2,null,null,null,35036,0]
[null,"GUANAJUATO","11EBS0027E",100,"YEPV780203IU0","YEPV780203MGTBVR00","VERONICA ADRIANA YEBRA PAVON","TECNICO DOCENTE",35,83101,1,7,41,"T03820","00.0",1985,2,null,null,null,40892,0]
[null,"GUANAJUATO","11EBS0027E",100,"ZACR521017I51","ZACR521017HGTMRG01","ROGELIO ARTURO ZAMARRIPA CRUZ","TECNICO DOCENTE",35,83101,1,7,15,"T03820","00.0",77,2,null,null,null,43400,0]
[null,"GUANAJUATO","11EBS0027E",100,"ZAGB700228KX3","ZAGB700228MGTVMT03","BEATRIZ ZAVALA GOMEZ","TECNICO DOCENTE",35,83101,1,7,25,"T03820","00.0",180,2,null,null,null,39900,0]
[null,"GUANAJUATO","11EBS0027E",100,"ZAGJ830623IG5","ZAGJ830623MGTVLN06","JUANA ZAVALA GALLEGOS","ANALISTA ADMINISTRATIVO",35,83101,1,7,14,"A01806","00.0",490,2,null,null,null,32102,0]
[null,"GUANAJUATO","11EBS0027E",100,"ZAMH6907077M4","ZAMH690707MGTVRR00","MARIA HERLINDA ZAVALA MARTINEZ","TECNICO DOCENTE",35,83101,1,7,27,"T03820","00.0",923,2,null,null,null,37850,0]
[null,"GUANAJUATO","11EBS0027E",100,"ZAZJ9610201D4","ZAZJ961020HQTRRN09","JONATAN REMBERTO ZARAZUA ZARAZUA","SECRETARIA \"C\"",35,83101,1,7,30,"A03804","00.0",137,2,null,null,null,24888,0]
[null,"Total Personas : ",null,null,null,null,null,null,null,null,null,null,null,"Total Plazas : ",null,330,null,null,"Total Pto. Federal",null,{"$f":"SUBTOTAL(109,Tabla12[Percepciones pagadas en el Periodo de Comisión con Presupuesto Federal*])","v":12066977}]
[]
[null,null,null,null,null,null,null,null,null,null,null,null,null,null,null,null,null,null,"Total Ppto. Otras Fuentes:",null,null,{"$f":"SUM(V16:V347)","v":0}]
[]
[null,"*Total de Percepciones reportadas por la Entidad Federativa como pagadas al trabajador durante la comisión."]
[null,"Fuente : Información proporcionada por las Entidades Federativas"]

{"sheet":"II D) 2","index":6,"n_rows":283,"n_cols":19,"rows_kept":283,"cut":false,"hidden":false,"merged":[[8,1,8,9],[11,0,12,0],[11,1,12,1],[11,5,12,5],[11,2,12,2],[11,3,12,3],[11,4,12,4],[11,16,12,16],[11,15,12,15],[11,17,12,17],[11,18,12,18],[11,6,11,12],[11,13,12,13],[11,14,12,14]]}
[]
[]
[]
[]
[]
[]
[]
[null,"Formato: Movimientos de Plazas"]
[null,{"$f":"IF('Caratula Resumen'!D22=\"Elige el Periodo…\",\"\",'Caratula Resumen'!D22)","v":"Fondo de Aportaciones para la Educación Tecnológica y de Adultos/Instituto Nacional para la Educación de los Adultos (FAETA/INEA)"},null,null,null,null,null,null,null,null,null,null,null,null,null,null,null,"2do. Trimestre 2016"]
[]
[]
[null,"Entidad Federativa","RFC","CURP","Nombre","Origen Presupuestal\n de la plazas","Clave Presupuestal",null,null,null,null,null,null,"Clave de nivel de puesto","Clave de nivel de sueldo","Zona Económica","Tipo de movimiento","Quincena Inicial","Quincena Final"]
[null,null,null,null,null,null,"Partida Presupuestal","Código de Pago","Clave de Unidad","Clave de Sub Unidad","Clave de Categoría","Horas Semana Mes ","Número de Plaza"]
[]
[null,"Entidad Federativa","RFC","CURP","Nombbre","Origen Presupuestal\n de la plazas","Partida Presupuestal","Código de Pago","Clave de Unidad","Clave de Sub Unidad","Clave de Categoría","Horas semana mes","Número de plaza","Clave de nivel de puesto","Clave de nivel de sueldo","Zona Económica","Tipo de movimiento","Quincena Inicial","Quincena Final"]
[null,"GUANAJUATO","MASE530517JN0","MASE530517HGTRNR09","ERNESTO MARTINEZ SANCHEZ",1,"831011715T0382000.001779",83101,7,15,"T03820","00.0",1779,82,7,"B",1,201602,201602]
[null,"GUANAJUATO","AAPR490907F72","AAPR490907MDFLLS06","MA. DEL ROSARIO ROCIO ALMAGRO PALATO",1,"831011715A0180300.000030",83101,7,15,"A01803","00.0",30,29,2,"B",2,201602,201602]
[null,"GUANAJUATO","GAAJ7304176P5","GAAG730417HGTRVD03","J. GUADALUPE GARCIA AVALOS",1,"831011725T0381000.0001102",83101,7,25,"T03810","00.0",1102,39,2,"B",2,201602,201602]
[null,"GUANAJUATO","LAOJ8212131K9","LAOJ821213HGTRLS09","JESUS SAMUEL LARA OLMOS",1,"831011722T0382000.001573",83101,7,22,"T03820","00.0",1573,82,7,"B",1,201602,201602]
[null,"GUANAJUATO","GARR860218GD7","GARR860218HGTRJL03","JOSE RAUL GRANADOS ROJAS",1,"831011952A0380400.0000602",83101,9,52,"A03804","00.0",602,43,2,"B",2,201602,201602]
[null,"GUANAJUATO","PARL850303S64","PARL850303MGTDVN02","LEONOR PADILLA RIVERA",1,"83101124CF3601400.0000023",83101,2,4,"CF36014","00.0",23,92,"OA1","B",1,201602,201602]
[null,"GUANAJUATO","LISA7512109V7","LISA751210MGTRLN04","ANA ISABEL LIRA SALDAﾑA",1,"83101111CF3601400.000044",83101,1,1,"CF36014","00.0",44,92,"OA1","B",1,201602,201602]
[null,"GUANAJUATO","LISA7512109V7","LISA751210MGTRLN04","ANA ISABEL LIRA SALDAﾑA",1,"83101111CF3601400.000378",83101,1,1,"CF36014","00.0",378,92,"OA1","B",3,201602,201602]
[null,"GUANAJUATO","FOGF6810217L0","FOGF681021HGTLRR06","JOSE FERNANDO FLORES GARCIA",1,"831011716T0382000.000146",83101,7,16,"T03820","00.0",146,82,7,"B",2,201603,201603]
[null,"GUANAJUATO","CUSG780213V57","CUSG780213HGTRVL03","GUILIBALDO CRUZ SAAVEDRA",1,"831011742T0382000.000146",83101,7,42,"T03820","00.0",146,82,7,"B",1,201603,201603]
[null,"GUANAJUATO","RULS870916391","RULS870916HGTZPR06","SERGIO ISMAEL RUIZ LOPEZ",1,"83101111CF3601400.0000021",83101,1,1,"CF36014","00.0",21,95,"OA1","A",2,201603,201603]
[null,"GUANAJUATO","GAEG840418L85","GAEG840418HGTLSS02","GUSTAVO ANTONIO GALLEGOS ESPINOSA",1,"831011727CF3601400.000046",83101,7,27,"CF36014","00.0",46,92,"OA1","B",2,201603,201603]
[null,"GUANAJUATO","CEAE800524DE1","CEAE800524MDFCSL07","ELSA CECEﾑA ASCOBERETA",1,"83101124CF3601400.000349",83101,2,4,"CF36014","00.0",349,92,"OA1","A",2,201603,201603]
[null,"GUANAJUATO","RERM7802175Q8","RERM780217MGTYJR00","MARIANA REYES ROJAS",1,"831011512CF0105900.0000052",83101,5,12,"CF01059","00.0",52,93,"OA1","A",2,201603,201603]
[null,"GUANAJUATO","HUOR660813PR3","HUOR660813MGTRLS01","ROSA ALICIA HUERTA OLIVARES",1,"831011952CF2186500.00003",83101,9,52,"CF21865","00.0",3,1,"QB","B",2,201603,201603]
[null,"GUANAJUATO","REPC540808QI9","REPC540808MGTNRN06","MARIA CONCEPCION RENTERIA PEREZ",1,"831011512T0382000.001096",83101,5,12,"T03820","00.0",1096,82,7,"B",3,201604,201604]
[null,"GUANAJUATO","VILR670220CZ3","VILR670220MGTLNM04","RAMONA VILLANUEVA LUNA",1,"831011743T0382000.002191",83101,7,43,"T03820","00.0",2191,82,7,"B",3,201604,201604]
[null,"GUANAJUATO","AOMM651230U5A","AOMM651230MGTBSY06","MA. MAYELA ABOYTES MOSQUEDA",1,"831011512A0180700.001096",83101,5,12,"A01807","00.0",1096,81,5,"B",3,201604,201604]
[null,"GUANAJUATO","RIRJ650926ED3","RIRJ650926HGTCMX07","J.JESUS RICO RAMIREZ",1,"831011844A0380400.0003291",83101,8,44,"A03804","00.0",3291,43,2,"B",3,201604,201604]
[null,"GUANAJUATO","AURA5705038S9","AURA570503HGTGND03","JOSE ADOLFO AGUILERA RENDON",1,"831011743T0382000.0000362",83101,7,43,"T03820","00.0",362,82,7,"B",3,201604,201604]
[null,"GUANAJUATO","VAGL591217DU7","VAGL591217MGTRRL06","LILIA VARGAS GARCIDUEﾑAS",1,"831011715T0382000.000069",83101,7,15,"T03820","00.0",69,82,7,"B",3,201604,201604]
[null,"GUANAJUATO","ROVR580704ND4","ROVR580704HVZXLB09","ROBERTO ROA VELAZQUEZ",1,"831011725CF3601400.0000472",83101,7,25,"CF36014","00.0",472,92,"OA1","A",3,201604,201604]
[null,"GUANAJUATO","LURF6001292T1","LURF600129HGTNMR01","FRANCISCO JAVIER LUNA RAMIREZ",1,"831011714T0382000.000200",83101,7,14,"T03820","00.0",200,82,7,"B",3,201604,201604]
[null,"GUANAJUATO","GOGR650725KF1","GOGR650725HGTNRB02","ROBERTO GONZALEZ GARCIA",1,"831011741T0382000.001096",83101,7,41,"T03820","00.0",1096,82,7,"B",3,201604,201604]
[null,"GUANAJUATO","AILP690120TW9","AILP690120MSPRNT09","PATRICIA DE JESUS ARCIGA LEON",1,"831011742A0180700.001096",83101,7,42,"A01807","00.0",1096,81,5,"B",3,201604,201604]
[null,"GUANAJUATO","MIYA600511Q72","MIYA600511MGTRRN01","MA. ANTONIA MIRANDA YERENA",1,"831011714A0180600.000298",83101,7,14,"A01806","00.0",298,70,3,"B",3,201604,201604]
[null,"GUANAJUATO","CASR640104TEA","CASR640104MGTBNS05","ROSA MARIA CABRERA SANCHEZ",1,"831011724T0381000.0002212",83101,7,24,"T03810","00.0",2212,39,2,"B",3,201604,201604]
[null,"GUANAJUATO","RAOM680518SX1","RAOM680518MMNNCR06","MARIBEL RANGEL OCHOA",1,"831011512A0180700.001096",83101,5,12,"A01807","00.0",1096,81,5,"B",3,201604,201604]
[null,"GUANAJUATO","COOD541119637","COOD541119MGTNRL00","DULCE MARIA ELIZABETH CONTRERAS ORDUﾑA",1,"831011728A0180700.000578",83101,7,28,"A01807","00.0",578,81,5,"B",3,201604,201604]
[null,"GUANAJUATO","TEMM661201D47","TEMG661201MGTRRD06","MA. GUADALUPE TREJO MARTINEZ",1,"831011512A0180700.001096",83101,5,12,"A01807","00.0",1096,81,5,"B",3,201604,201604]
[null,"GUANAJUATO","GUSS6608135L6","GUSS660813MGTRNF04","SOFIA GUERRERO SANDOVAL",1,"831011713T0382000.001096",83101,7,13,"T03820","00.0",1096,82,7,"B",3,201604,201604]
[null,"GUANAJUATO","PACL700401SI9","PACL700401MGTRHR04","LAURA PRADO CHAVEZ",1,"831011713A0180600.001096",83101,7,13,"A01806","00.0",1096,70,3,"B",3,201604,201604]
[null,"GUANAJUATO","MAGM6404092N1","MAGM640409MGTNNR08","MARTA MANDUJANO GONZALEZ",1,"831011743T0382000.000749",83101,7,43,"T03820","00.0",749,82,7,"B",3,201604,201604]
[null,"GUANAJUATO","LOSS570105T33","LOSS570105MTSZLS00","SUSANA ENRIQUETA LOZANO SALCEDO",1,"831011741A0180600.001096",83101,7,41,"A01806","00.0",1096,70,3,"B",3,201604,201604]
[null,"GUANAJUATO","PEAR630107AT2","PEAR630107HMCXRY08","JOSE REY PEﾑA ARRIAGA",1,"831011844A0180600.0000115",83101,8,44,"A01806","00.0",115,70,3,"B",3,201604,201604]
[null,"GUANAJUATO","MAAL680513MP3","MAAL680513MMNRNZ01","MARIA DE LA LUZ MARTINEZ ANDRADE",1,"831011727T0380300.001096",83101,7,27,"T03803","00.0",1096,47,2,"B",3,201604,201604]
[null,"GUANAJUATO","COMM660914G87","COMR660914MGTNDC09","MA. DEL ROCIO CONCHA MEDINA",1,"831011713T0382000.001096",83101,7,13,"T03820","00.0",1096,82,7,"B",3,201604,201604]
[null,"GUANAJUATO","MEVG630915G81","MEVG630915MGTRRD08","MA. GUADALUPE MERCADO VARELA",1,"831011743T0382000.000951",83101,7,43,"T03820","00.0",951,82,7,"B",3,201604,201604]
[null,"GUANAJUATO","MADT730323NL2","MADT730323MGTTVR17","TERESITA DE JESUS MATA DAVALOS",1,"831011742T0381000.001096",83101,7,42,"T03810","00.0",1096,39,2,"B",3,201604,201604]
[null,"GUANAJUATO","PACP681127IL7","PACP681127MGTRHT00","PATRICIA PRADO CHAVEZ",1,"831011727A0380400.001096",83101,7,27,"A03804","00.0",1096,43,2,"B",3,201604,201604]
[null,"GUANAJUATO","MAOL731125E39","MAOL731125MGTLRC03","LUCINA MALDONADO ORDUﾑO",1,"831011512A0180700.000598",83101,5,12,"A01807","00.0",598,81,5,"B",3,201604,201604]
[null,"GUANAJUATO","CACF6710055H4","CACF671005HGTLDR06","FRANCISCO CALDERON CAUDILLO",1,"831011715T0382000.001102",83101,7,15,"T03820","00.0",1102,82,7,"B",3,201604,201604]
[null,"GUANAJUATO","HEAE670513TV7","HEAE670513HGTRGD08","EDUARDO HERNANDEZ AGUADO",1,"831011725A0180600.000552",83101,7,25,"A01806","00.0",552,70,3,"B",3,201604,201604]
[null,"GUANAJUATO","BIRL710430QF2","BIRL710430HGTRZB03","LIBRADO BRICEﾑO RUIZ",1,"831011742T0382000.001096",83101,7,42,"T03820","00.0",1096,82,7,"B",3,201604,201604]
[null,"GUANAJUATO","HERG571023MS0","HERG571023MGTRPD07","MA. GUADALUPE JUDITH HERNANDEZ RIPALDA",1,"83101112CF2186500.00001",83101,1,2,"CF21865","00.0",1,1,"QB","B",3,201604,201604]
[null,"GUANAJUATO","VATR761025BJA","VATR761025MDFRRS05","ROSA MARIA VARGAS TRUJILLO",1,"831011844T0382300.0000941",83101,8,44,"T03823","00.0",941,85,7,"B",3,201604,201604]
[null,"GUANAJUATO","GUOA740914U2A","GUOA740914MMNDRN06","MA. DE LOS ANGELES GUDIﾑO ORDAZ",1,"831011743A0380400.000016",83101,7,43,"A03804","00.0",16,43,2,"B",3,201604,201604]
[null,"GUANAJUATO","GUMC6804029G4","GUMC680402MGTZNR09","MARIA DEL CARMEN GUZMAN MANZANILLA",1,"831011715T0382000.001911",83101,7,15,"T03820","00.0",1911,82,7,"B",3,201604,201604]
[null,"GUANAJUATO","YEPV780203IU0","YEPV780203MGTBVR00","VERONICA ADRIANA YEBRA PAVON",1,"831011741T0382000.001096",83101,7,41,"T03820","00.0",1096,82,7,"B",3,201604,201604]
[null,"GUANAJUATO","CAVS681207JX2","CAVS681207HGTNRL04","SALVADOR CANO VARGAS",1,"831011717CF3601400.000045",83101,7,17,"CF36014","00.0",45,92,"OA1","A",3,201604,201604]
[null,"GUANAJUATO","NAHL730801RV8","NAHL730801MGTVRR01","MARIA DE LOURDES NAVARRO HERNANDEZ",1,"831011714A0180700.000490",83101,7,14,"A01807","00.0",490,81,5,"B",3,201604,201604]
[null,"GUANAJUATO","AERS660208UT4","AERS660208HGTRYR01","SERGIO ARREDONDO RAYA",1,"831011740T0382000.002241",83101,7,40,"T03820","00.0",2241,82,7,"B",3,201604,201604]
[null,"GUANAJUATO","TONL701209CT8","TONL701209MGTRCR09","LAURA MA GUADALUPE TORRES NACHE",1,"83101126CF3384900.001096",83101,2,6,"CF33849","00.0",1096,88,8,"B",3,201604,201604]
[null,"GUANAJUATO","VIMG771213D20","VIMG771213MGTLNB08","GABRIELA VILLANUEVA MENDOZA",1,"831011512A0180700.001096",83101,5,12,"A01807","00.0",1096,81,5,"B",3,201604,201604]
[null,"GUANAJUATO","ROSJ600516BL3","ROSJ600516MGTBNN05","JUANA ROBLES SANTANA",1,"831011714T0382000.0001952",83101,7,14,"T03820","00.0",1952,82,7,"B",3,201604,201604]
[null,"GUANAJUATO","EASG700512IU9","EASG700512MCMSNR00","GRACIELA ESCAMILLA SANCHEZ",1,"831011742A0380400.001096",83101,7,42,"A03804","00.0",1096,43,2,"B",3,201604,201604]
[null,"GUANAJUATO","VARA570811AR0","VARA570811MVZLDN06","ANA YOLANDA VALERIO RODRIGUEZ",1,"831011727T0382000.002812",83101,7,27,"T03820","00.0",2812,82,7,"B",3,201604,201604]
[null,"GUANAJUATO","BEMS700226KJ6","BEMS700226HGTCNL00","SALVADOR BECERRA MANDUJANO",1,"831011713T0382000.001096",83101,7,13,"T03820","00.0",1096,82,7,"B",3,201604,201604]
[null,"GUANAJUATO","MOGC720409SJ9","MOGC720409MGTJZL04","CLAUDIA ELISA MOJICA GUZMAN",1,"831011727T0382000.001096",83101,7,27,"T03820","00.0",1096,82,7,"B",3,201604,201604]
[null,"GUANAJUATO","CAEJ651225BV9","CAEJ651225HVZHSS03","JESUS CHAGALA ESPEJO",1,"831011714T0382000.002946",83101,7,14,"T03820","00.0",2946,82,7,"B",3,201604,201604]
[null,"GUANAJUATO","CAGR690302HRA","CAGR690302MGTMMS03","MA. DEL ROSARIO CAMPOS GOMEZ",1,"831011713A0380400.000300",83101,7,13,"A03804","00.0",300,43,2,"B",3,201604,201604]
[null,"GUANAJUATO","MUHD640208LB9","MUHD640208MDFXRL08","MARIA DOLORES MUﾑOZ HERRERA",1,"831011727T0382000.001096",83101,7,27,"T03820","00.0",1096,82,7,"B",3,201604,201604]
[null,"GUANAJUATO","BINL4906195XA","BINL490619HDFRGS05","JOSE LUIS BRIBIESCA NEGRETE",1,"831011742A0180700.001096",83101,7,42,"A01807","00.0",1096,81,5,"B",3,201604,201604]
[null,"GUANAJUATO","MASE530517JN0","MASE530517HGTRNR09","ERNESTO MARTINEZ SANCHEZ",1,"831011715T0382000.001779",83101,7,15,"T03820","00.0",1779,82,7,"B",3,201604,201604]
[null,"GUANAJUATO","MAAC750527A26","MAAC750527MGTRGR07","CAROLINA MARTINEZ AGREDA",1,"831011714T0381000.000266",83101,7,14,"T03810","00.0",266,39,2,"B",3,201604,201604]
[null,"GUANAJUATO","NEPR690831KW1","NEPR690831HGTGDM08","RAMON GUILLERMO NEGRETE PADRON",1,"831011713T0382000.001096",83101,7,13,"T03820","00.0",1096,82,7,"B",3,201604,201604]
[null,"GUANAJUATO","ROPP680417AU8","ROPP680417MGTDRT05","PATRICIA RODRIGUEZ PEREZ",1,"831011713T0382000.001096",83101,7,13,"T03820","00.0",1096,82,7,"B",3,201604,201604]
[null,"GUANAJUATO","ZAMH6907077M4","ZAMH690707MGTVRR00","MARIA HERLINDA ZAVALA MARTINEZ",1,"831011727T0382000.001096",83101,7,27,"T03820","00.0",1096,82,7,"B",3,201604,201604]
[null,"GUANAJUATO","MASV810101DZ8","MASV810101MGTRRR01","VERONICA MARTINEZ SARABIA",1,"831011740T0382000.000269",83101,7,40,"T03820","00.0",269,82,7,"B",3,201604,201604]
[null,"GUANAJUATO","GOMM610218KG4","GOMM610218MGTNRR05","MARTA PATRICIA GONZALEZ MORENO",1,"831011713A0380400.001096",83101,7,13,"A03804","00.0",1096,43,2,"B",3,201604,201604]
[null,"GUANAJUATO","ROCR541120D22","ROCR541120HGTSVC07","RICARDO FEDERICO ROSALES COVARRUBIAS",1,"831011715T0382000.002665",83101,7,15,"T03820","00.0",2665,82,7,"B",3,201604,201604]
[null,"GUANAJUATO","GARM751031J11","GARM751031HGTRMS07","MOISES GRANADOS RAMOS",1,"831011844CF2186500.00005",83101,8,44,"CF21865","00.0",5,1,"QB","B",3,201604,201604]
[null,"GUANAJUATO","HECA7404077F6","HECA740407MGTRND08","ADRIANA HERNANDEZ CANTERO",1,"831011714T0380300.000311",83101,7,14,"T03803","00.0",311,47,2,"B",3,201604,201604]
[null,"GUANAJUATO","RAJC810331LAA","RAJC810331MGTMRL02","CLAUDIA JACQUELINE RAMIREZ JARAMILLO",1,"831011727T0380300.001096",83101,7,27,"T03803","00.0",1096,47,2,"B",3,201604,201604]
[null,"GUANAJUATO","DOVL720318BXA","DOVL720318HGTMLS06","JOSE LUIS DOMINGUEZ VALDES",1,"831011715T0382000.001701",83101,7,15,"T03820","00.0",1701,82,7,"B",3,201604,201604]
[null,"GUANAJUATO","TOSH760727J54","TOSH760727HGTRNC04","HECTOR DANIEL TORRES SAENEZ",1,"831011713T0382000.001096",83101,7,13,"T03820","00.0",1096,82,7,"B",3,201604,201604]
[null,"GUANAJUATO","GUHA770213FQ8","GUHA770213MGTVRL02","ALMA ROSA GUEVARA HERNANDEZ",1,"831011713T0382000.001096",83101,7,13,"T03820","00.0",1096,82,7,"B",3,201604,201604]
[null,"GUANAJUATO","ROSR7704116C6","ROSR770411MGTDLS01","MARIA DEL ROSARIO RODRIGUEZ SALGADO",1,"831011727T0382000.001096",83101,7,27,"T03820","00.0",1096,82,7,"B",3,201604,201604]
[null,"GUANAJUATO","COCB750608U65","COCB750608MGTRRL08","BLANCA RAQUEL CORONEL CARBAJAL",1,"831011715T0382000.001867",83101,7,15,"T03820","00.0",1867,82,7,"B",3,201604,201604]
[null,"GUANAJUATO","VEPE671201NI6","VEPE671201MGTGRG04","MARIA EUGENIA VEGA PAREDES",1,"831011733T0382000.0001632",83101,7,33,"T03820","00.0",1632,82,7,"B",3,201604,201604]
[null,"GUANAJUATO","CAOE780824GY2","CAOE780824MGTSRM07","EMILIA CASTELLANO ORTEGA",1,"831011742T0380300.001096",83101,7,42,"T03803","00.0",1096,47,2,"B",3,201604,201604]
[null,"GUANAJUATO","SAAL700325CX2","SAAL700325MGTNGT00","LETICIA SANDOVAL AGUAYO",1,"831011715T0382000.001614",83101,7,15,"T03820","00.0",1614,82,7,"B",3,201604,201604]
[null,"GUANAJUATO","GOAS751103PH7","GOAS751103MGTNRL01","SILVIA SANTOS GONZALEZ ARANDA",1,"831011727T0382000.001096",83101,7,27,"T03820","00.0",1096,82,7,"B",3,201604,201604]
[null,"GUANAJUATO","PEDM7406101Q5","PEDM740610MDFRMR01","MARGARITA PERALTA DOMINGUEZ",1,"831011714T0382000.002562",83101,7,14,"T03820","00.0",2562,82,7,"B",3,201604,201604]
[null,"GUANAJUATO","NEGM641224M74","NEGM641224MGTGVR06","MARTINA NEGRETE GOVEA",1,"831011713T0382000.001096",83101,7,13,"T03820","00.0",1096,82,7,"B",3,201604,201604]
[null,"GUANAJUATO","LOCJ8109121HA","LOCJ810912HDFPRN00","JUAN CARLOS LOPEZ CRUZ",1,"831011713A0380400.001096",83101,7,13,"A03804","00.0",1096,43,2,"B",3,201604,201604]
[null,"GUANAJUATO","BABM6804276E6","BABM680427MMCXLR01","MARGARITA BAﾑOS BAILON",1,"831011713T0382000.0001101",83101,7,13,"T03820","00.0",1101,82,7,"B",3,201604,201604]
[null,"GUANAJUATO","BABM6804276E6","BABM680427MMCXLR01","MARGARITA BAﾑOS BAILON",1,"831011713T0382000.0000092",83101,7,13,"T03820","00.0",92,82,7,"B",3,201604,201604]
[null,"GUANAJUATO","CIVM630826EF1","CIVR630826MGTSRS09","MA. DEL ROSARIO CISNEROS VERDIN",1,"831011713T0382000.001096",83101,7,13,"T03820","00.0",1096,82,7,"B",3,201604,201604]
[null,"GUANAJUATO","COPC760616J13","COPC760616HGTRTR05","CARLOS ALBERTO CORDOBA PATIﾑO",1,"831011714S0180300.000117",83101,7,14,"S01803","00.0",117,21,2,"B",3,201604,201604]
[null,"GUANAJUATO","LUPI741127IZ3","LUPI741127MDFNRS02","MARIA ISABEL LUNA PEREZ",1,"83101126CF2186500.00009",83101,2,6,"CF21865","00.0",9,1,"QB","B",3,201604,201604]
[null,"GUANAJUATO","FEGR710424QJ8","FEXG710424MGTRXR09","GRACIELA FERRER ",1,"831011724T0382000.001392",83101,7,24,"T03820","00.0",1392,82,7,"B",1,201604,201604]
[null,"GUANAJUATO","AEPB811216AUA","AEPB811216MGTRLL03","BLANCA BERENICE ARREGUIN PALMA",1,"83101124CF2186500.00008",83101,2,4,"CF21865","00.0",8,1,"QB","B",3,201604,201604]
[null,"GUANAJUATO","MURE780503RL7","MURE780503MGTXVS02","MARIA ESMERALDA MUﾑOZ RIVERA",1,"831011844CF2186500.00011",83101,8,44,"CF21865","00.0",11,1,"QB","B",3,201604,201604]
[null,"GUANAJUATO","REGJ781111QG6","REGJ781111HGTYRN09","JUAN MANUEL REYES GUERRERO",1,"831011741CF3601400.001096",83101,7,41,"CF36014","00.0",1096,92,"OA1","A",3,201604,201604]
[null,"GUANAJUATO","ROBC900904U49","ROBC900904MDFCZT03","CITLALLIN MARGARITA ROCHA BAEZA",1,"83101124CF3384900.000296",83101,2,4,"CF33849","00.0",296,88,8,"B",3,201604,201604]
[null,"GUANAJUATO","ZAGJ830623IG5","ZAGJ830623MGTVLN06","JUANA ZAVALA GALLEGOS",1,"831011714A0180600.000144",83101,7,14,"A01806","00.0",144,70,3,"B",3,201604,201604]
[null,"GUANAJUATO","RAML6801057F2","RAML680105MMNMCN00","LINDA RAMIREZ MACEDO",1,"831011713T0382000.001096",83101,7,13,"T03820","00.0",1096,82,7,"B",3,201604,201604]
[null,"GUANAJUATO","AEAJ851118LC0","AEAJ851118HGTRCN00","JUAN CARLOS ARMENTA ACEVEDO",1,"831011713T0382000.001096",83101,7,13,"T03820","00.0",1096,82,7,"B",3,201604,201604]
[null,"GUANAJUATO","OEMJ730208CX6","OEMM730208HGTJDR00","J. MERCED OJEDA MEDINA",1,"831011713T0382000.001096",83101,7,13,"T03820","00.0",1096,82,7,"B",3,201604,201604]
[null,"GUANAJUATO","VALF830903IU4","VALF830903HGTLNR07","FRANCISCO JAVIER VALDEZ LANDIN",1,"831011713T0382000.001096",83101,7,13,"T03820","00.0",1096,82,7,"B",3,201604,201604]
[null,"GUANAJUATO","GURV740105E98","GURV740105MGTRDR07","VERONICA GUERRERO RODRIGUEZ",1,"831011713A0380400.001096",83101,7,13,"A03804","00.0",1096,43,2,"B",3,201604,201604]
[null,"GUANAJUATO","UORV800303CD1","UORV800303MGTLNR08","VERONICA ULLOA RANGEL",1,"83101113A0380400.000091",83101,1,3,"A03804","00.0",91,43,2,"B",3,201604,201604]
[null,"GUANAJUATO","RUCE791216KR2","RUCE791216HGTLRD00","EDUARDO RUELAS CORNEJO",1,"831011735CF3601400.000048",83101,7,35,"CF36014","00.0",48,92,"OA1","A",3,201604,201604]
[null,"GUANAJUATO","MURM820910149","MURM820910HGTRDR08","MAURICIO ALEJANDRO MURILLO RODRIGUEZ",1,"831011742CF3601400.001096",83101,7,42,"CF36014","00.0",1096,92,"OA1","A",3,201604,201604]
[null,"GUANAJUATO","MOCK900306NE6","MOCK900306MDFRSR15","KAREN ANEL MORENO CASTILLO",1,"831011713T0382000.001096",83101,7,13,"T03820","00.0",1096,82,7,"B",3,201604,201604]
[null,"GUANAJUATO","CAPJ840105CE0","CAPJ840105HGTMRL00","JULIO CESAR CAMACHO PRADO",1,"831011713T0382000.001096",83101,7,13,"T03820","00.0",1096,82,7,"B",3,201604,201604]
[null,"GUANAJUATO","LOLB681130LWA","LOLB681130MGTPLT03","BEATRIZ LOPEZ LLANOS",1,"831011743T0382000.000282",83101,7,43,"T03820","00.0",282,82,7,"B",3,201604,201604]
[null,"GUANAJUATO","GALA740123JB8","GALA740123MGTLPL08","ALMA ROSA GALINDO LOPEZ",1,"831011713T0381000.001096",83101,7,13,"T03810","00.0",1096,39,2,"B",3,201604,201604]
[null,"GUANAJUATO","MAAC750325Q52","MAAC750325MGTLLR02","MA. DEL CARMEN MALDONADO ALMANZA",1,"831011714A0380400.0001522",83101,7,14,"A03804","00.0",1522,43,2,"B",3,201604,201604]
[null,"GUANAJUATO","PECC830605V49","PECC830605MNEXSN04","CINTHYA PEﾑALOZA CISNEROS",1,"831011713T0380300.001096",83101,7,13,"T03803","00.0",1096,47,2,"B",3,201604,201604]
[null,"GUANAJUATO","CALM860815G43","CALM860815MJCHNY02","MAYRA CAROLINA CHAVEZ DE LEﾓN",1,"83101113A0380400.000171",83101,1,3,"A03804","00.0",171,43,2,"B",3,201604,201604]
[null,"GUANAJUATO","GOGE831013479","GOGE831013MGTNRL03","ELIA JUDITH GONZALEZ GUERRA",1,"831011733T0381000.000198",83101,7,33,"T03810","00.0",198,39,2,"B",3,201604,201604]
[null,"GUANAJUATO","CEGF8505052A9","CEGF850505HGTLTR01","FERNANDO CELEDON GUTIERREZ",1,"831011844CF0105900.0000361",83101,8,44,"CF01059","00.0",361,93,"OA1","A",3,201604,201604]
[null,"GUANAJUATO","JIAR5906097A6","JIAR590609HVZMNB07","ROBERTO JIMENEZ DEL ANGEL",1,"831011512CF1407000.000032",83101,5,12,"CF14070","00.0",32,97,"MB2","A",3,201604,201604]
[null,"GUANAJUATO","PAGG860302DX9","PAGG860302MDFDRB08","GABRIELA PADILLA GUERRERO",1,"831011733T0381000.000369",83101,7,33,"T03810","00.0",369,39,2,"B",3,201604,201604]
[null,"GUANAJUATO","HEDM871214861","HEDM871214HGTRLN04","JOSE MANUEL HERNANDEZ DELGADO",1,"83101113T0380300.0000512",83101,1,3,"T03803","00.0",512,47,2,"B",3,201604,201604]
[null,"GUANAJUATO","ROPE881009G46","ROPE881009MGTDRV05","EVELIN GUADALUPE RODRIGUEZ PEREZ",1,"831011714T0382000.001431",83101,7,14,"T03820","00.0",1431,82,7,"B",3,201604,201604]
[null,"GUANAJUATO","ROPE881009G46","ROPE881009MGTDRV05","EVELIN GUADALUPE RODRIGUEZ PEREZ",1,"831011714T0382000.0000112",83101,7,14,"T03820","00.0",112,82,7,"B",3,201604,201604]
[null,"GUANAJUATO","HOHL860601124","HOHL860601MGTRRZ09","LUZ ANGELICA HORTA HERNANDEZ",1,"83101124CF0105900.00004",83101,2,4,"CF01059","00.0",4,93,"OA1","A",3,201604,201604]
[null,"GUANAJUATO","POLH650106FW2","POLH650106HDFZPG03","HUGO POZADA LOPEZ",1,"831011512CF2186500.00007",83101,5,12,"CF21865","00.0",7,1,"QB","B",3,201604,201604]
[null,"GUANAJUATO","ROBA860619I59","RXBA860619MDFDRR07","ARIANA RODRIGUEZ BRITO",1,"83101111CF0105900.000241",83101,1,1,"CF01059","00.0",241,93,"OA1","A",3,201604,201604]
[null,"GUANAJUATO","DOOM7502039N2","DOOM750203HGTMLN08","MANUEL DOMINGUEZ OLVERA",1,"831011512CF0105900.000133",83101,5,12,"CF01059","00.0",133,93,"OA1","A",2,201604,201604]
[null,"GUANAJUATO","DOOM7502039N2","DOOM750203HGTMLN08","MANUEL DOMINGUEZ OLVERA",1,"831011512CF0105900.000133",83101,5,12,"CF01059","00.0",133,93,"OA1","A",3,201604,201604]
[null,"GUANAJUATO","COJP700317TZ9","COJP700317HMNRMD06","PEDRO CORTES JIMENEZ",1,"83101124CF2186500.00002",83101,2,4,"CF21865","00.0",2,1,"QB","B",3,201604,201604]
[null,"GUANAJUATO","HERG640304LK9","HERG640304MGTRDR09","GRACIELA HERNANDEZ RODRIGUEZ",1,"831011741T0382000.000812",83101,7,41,"T03820","00.0",812,82,7,"B",1,201604,201604]
[null,"GUANAJUATO","MABM7603207B6","MABM760320MGTCSR01","MARIANA MACHUCA BUSTAMANTE",1,"831011728T0382000.001202",83101,7,28,"T03820","00.0",1202,82,7,"B",1,201604,201604]
[null,"GUANAJUATO","COIM780815PDA","COIM780815HGTPRR02","MARIO ALBERTO COPADO IRINEO",1,"831011728T0382000.000176",83101,7,28,"T03820","00.0",176,82,7,"B",1,201604,201604]
[null,"GUANAJUATO","GORD8312168D4","GORD831216MGTMVL06","DULCE MARIA MONSERRAT GOMEZ RIVERA",1,"831011728T0382000.001638",83101,7,28,"T03820","00.0",1638,82,7,"B",1,201604,201604]
[null,"GUANAJUATO","QUCL890311NE9","QUCL890311HGTNNS07","LUIS ALBERTO QUINTINO CINTORA",1,"831011725T0382000.0000942",83101,7,25,"T03820","00.0",942,82,7,"B",1,201604,201604]
[null,"GUANAJUATO","GUMJ870317R44","GUMJ870317HGTRRN00","JONAS GUERRERO MARTINEZ",1,"831011740T0382000.001171",83101,7,40,"T03820","00.0",1171,82,7,"B",1,201604,201604]
[null,"GUANAJUATO","JUEC8408019SA","JUEC840801MGTRSR08","MARIA DEL CARMEN IVONNE JUAREZ ESPITIA",1,"831011740T0382000.000704",83101,7,40,"T03820","00.0",704,82,7,"B",1,201604,201604]
[null,"GUANAJUATO","AAGB8305061P7","AAGB830506MGTYTR02","BRENDA AYALA GUTIERREZ",1,"831011720T0382000.000062",83101,7,20,"T03820","00.0",62,82,7,"B",1,201604,201604]
[null,"GUANAJUATO","HECG7108185E0","HECG710818HGTRBR07","GERARDO HERNANDEZ CABEZA",1,"831011720T0382000.000199",83101,7,20,"T03820","00.0",199,82,7,"B",1,201604,201604]
[null,"GUANAJUATO","GUMM920308B42","GUMM920308MGTRJN03","MONICA JUANA GUERRERO MEJIA",1,"831011728T0382000.002525",83101,7,28,"T03820","00.0",2525,82,7,"B",1,201604,201604]
[null,"GUANAJUATO","CAAB610110HC5","CAAB610110MGTRRR07","BERTHA ANGELICA CARPIO ARAGON",1,"831011713T0382000.002463",83101,7,13,"T03820","00.0",2463,82,7,"B",3,201605,201605]
[null,"GUANAJUATO","BAVG670930HU0","BAVG670930MGTRZD05","MA. GUADALUPE BARCENAS VAZQUEZ",1,"831011714T0382000.000664",83101,7,14,"T03820","00.0",664,82,7,"B",3,201606,201606]
[null,"GUANAJUATO","TONL701209CT8","TONL701209MGTRCR09","LAURA MA GUADALUPE TORRES NACHE",1,"83101126CF3384900.0000521",83101,2,6,"CF33849","00.0",521,88,8,"B",3,201606,201606]
[null,"GUANAJUATO","RACR700730AH9","RACR700730MGTZNB06","REBECA RAZO CANO",1,"831011720T0382000.0002702",83101,7,20,"T03820","00.0",2702,82,7,"B",2,201606,201606]
[null,"GUANAJUATO","HOHL860601124","HOHL860601MGTRRZ09","LUZ ANGELICA HORTA HERNANDEZ",1,"83101124CF0105900.000021",83101,2,4,"CF01059","00.0",21,93,"OA1","A",3,201606,201606]
[null,"GUANAJUATO","IAJM900213S93","IAJM900213HGTBSR04","MARIO ALBERTO IBARRA JASSO",1,"831011729T0382000.000087",83101,7,29,"T03820","00.0",87,82,7,"B",1,201606,201606]
[null,"GUANAJUATO","SACT890401492","SACT890401HGTNLD08","TADEO SANCHEZ CALDERON",1,"831011729T0382000.000149",83101,7,29,"T03820","00.0",149,82,7,"B",1,201606,201606]
[null,"GUANAJUATO","EICS8311094H1","EICS831109MGTLNN06","SANDRA ELISA ELIAS CONTRERAS",1,"831011729T0382000.000263",83101,7,29,"T03820","00.0",263,82,7,"B",1,201606,201606]
[null,"GUANAJUATO","CAOC8910102C1","CAOC891010MGTSRR04","MARIA CRUZ CASTAﾑEDA ORNELAS",1,"831011729T0382000.000367",83101,7,29,"T03820","00.0",367,82,7,"B",1,201606,201606]
[null,"GUANAJUATO","LAGG8705075P8","LAGG870507MGTGRS08","GISELA LAGUNA GUERRERO",1,"831011743T0382000.000391",83101,7,43,"T03820","00.0",391,82,7,"B",1,201606,201606]
[null,"GUANAJUATO","SOBF761123PU9","SOBF761123HGTLRR07","FRANCISCO SOLORZANO BERNAL",1,"831011715T0382000.0004411",83101,7,15,"T03820","00.0",4411,82,7,"B",1,201606,201606]
[null,"GUANAJUATO","HELM710411Q56","HELM710411MGTRDR02","MARTHA ANGELICA HERNANDEZ LEDESMA",1,"831011727T0382000.000507",83101,7,27,"T03820","00.0",507,82,7,"B",1,201606,201606]
[null,"GUANAJUATO","MANL580917DN5","MANL580917HGTRXS04","JOSE LUIS MARTINEZ NUﾑEZ",1,"831011742T0382000.000435",83101,7,42,"T03820","00.0",435,82,7,"B",1,201606,201606]
[null,"GUANAJUATO","COSL800716SL8","COSL800716MGTRRD08","LIDIA CAROLINA CORTES SIERRA",1,"831011742T0382000.0004511",83101,7,42,"T03820","00.0",4511,82,7,"B",1,201606,201606]
[null,"GUANAJUATO","LOHD930413C30","LOHD930413MGTPDN05","DIANA GUADALUPE LOPEZ HIDALGO",1,"831011742T0382000.000708",83101,7,42,"T03820","00.0",708,82,7,"B",1,201606,201606]
[null,"GUANAJUATO","EARF920415GZ8","EARF920415MGTSDT17","FATIMA YAZMIN ESTRADA RODRIGUEZ",1,"83101111A0380400.0003571",83101,1,1,"A03804","00.0",3571,43,2,"B",1,201606,201606]
[null,"GUANAJUATO","EARF920415GZ8","EARF920415MGTSDT17","FATIMA YAZMIN ESTRADA RODRIGUEZ",1,"83101111A0380400.0003571",83101,1,1,"A03804","00.0",3571,43,2,"B",3,201606,201606]
[null,"GUANAJUATO","PEYA830715T69","PEYA830715HGTRZN00","ANGEL ARMANDO PEREZ YZAGUIRRE",1,"83101124A0380400.000371",83101,2,4,"A03804","00.0",371,43,2,"B",1,201606,201606]
[null,"GUANAJUATO","RIRZ9005014I8","RIRZ900501MMCCJZ06","ZAZIL RICO ROJAS",1,"831011729T0380300.000022",83101,7,29,"T03803","00.0",22,47,2,"B",1,201606,201606]
[null,"GUANAJUATO","GAGY780903491","GAGY780903MDFLMS06","YOSELIN AIMEE GALVAN GAMEZ",1,"831011730T0381000.000151",83101,7,30,"T03810","00.0",151,39,2,"B",1,201606,201606]
[null,"GUANAJUATO","GAGY780903491","GAGY780903MDFLMS06","YOSELIN AIMEE GALVAN GAMEZ",1,"831011730T0381000.000151",83101,7,30,"T03810","00.0",151,39,2,"B",3,201606,201606]
[null,"GUANAJUATO","AUNC890701HB6","AUNC890701MQTGXR05","MARIA CRISTINA AGUADO NUﾑEZ",1,"831011730S0180300.0001241",83101,7,30,"S01803","00.0",1241,21,2,"B",1,201606,201606]
[null,"GUANAJUATO","FECM8910217I9","FECM891021MDFRVR01","MARIANA GUISELA FERREIRA CUEVAS",1,"831011743T0381000.000116",83101,7,43,"T03810","00.0",116,39,2,"B",1,201606,201606]
[null,"GUANAJUATO","BARA700515RH6","BARA700515MGTRML07","ALMA VELIA BARBOSA RAMIREZ",1,"831011725A0380400.000097",83101,7,25,"A03804","00.0",97,43,2,"B",1,201606,201606]
[null,"GUANAJUATO","PECT910409LB5","PECT910409MDFXMN04","TANIA BERENICE PEﾑA CAMBRON",1,"83101113A0380400.000081",83101,1,3,"A03804","00.0",81,43,2,"B",1,201606,201606]
[null,"GUANAJUATO","AIMM891226K29","AIMM891226MMCMXR03","MARIANA AMBRIZ MUﾑOZ",1,"831011713T0380300.000338",83101,7,13,"T03803","00.0",338,47,2,"B",1,201606,201606]
[null,"GUANAJUATO","DUPS9001267KA","DUPS900126MGTRRN08","SANDRA IVONNE DURAN PRADO",1,"831011742A0380400.0000112",83101,7,42,"A03804","00.0",112,43,2,"B",1,201606,201606]
[null,"GUANAJUATO","PACM931219CM1","PACM931219MDGLBY03","MAYLEN NOEMI PLASCENCIA CABRERA",1,"831011741A0380400.0000602",83101,7,41,"A03804","00.0",602,43,2,"B",1,201606,201606]
[null,"GUANAJUATO","JAAX8707291Z3","JAAX870729MCLRRC03","XOCHITL YUVICELA JARA ARRIAGA",1,"831011722T0380300.0000511",83101,7,22,"T03803","00.0",511,47,2,"B",1,201606,201606]
[null,"GUANAJUATO","JAAX8707291Z3","JAAX870729MCLRRC03","XOCHITL YUVICELA JARA ARRIAGA",1,"831011722T0380300.0000511",83101,7,22,"T03803","00.0",511,47,2,"B",3,201606,201606]
[null,"GUANAJUATO","VATL701230M12","VATL701230MGTLRZ04","LUZ MARIA VALLE TORRES",1,"831011715T0381000.0002482",83101,7,15,"T03810","00.0",2482,39,2,"B",1,201606,201606]
[null,"GUANAJUATO","JAAA741109NM2","JAAA741109MGTSGL04","ALMA PATRICIA JASSO AGUILERA",1,"831011720T0382000.002916",83101,7,20,"T03820","00.0",2916,82,7,"B",1,201606,201606]
[null,"GUANAJUATO","CASE871206B31","CASE871206HGTSND05","JOSE EDUARDO CASTAﾑEDA SAENZ",1,"831011740T0382000.002887",83101,7,40,"T03820","00.0",2887,82,7,"B",1,201606,201606]
[null,"GUANAJUATO","ROVK831026QX5","ROVK831026MGTSZR01","MARIA KARINA ROSAS VAZQUEZ",1,"831011728T0382000.002880",83101,7,28,"T03820","00.0",2880,82,7,"B",1,201606,201606]
[null,"GUANAJUATO","CAGJ791209EN4","CAGJ791209HGTRTR01","JORGE ADRIAN CARDENAS GUTIERREZ",1,"831011714T0382000.002462",83101,7,14,"T03820","00.0",2462,82,7,"B",1,201606,201606]
[null,"GUANAJUATO","VEVS760824QM4","VEVS760824MGTNLL09","SILVINA ELIZABETH VENEGAS VILLALOBOS",1,"831011742T0382000.002447",83101,7,42,"T03820","00.0",2447,82,7,"B",1,201606,201606]
[null,"GUANAJUATO","AUVA8802214EA","AUVA880221MGTNLN08","ANGELICA ANGUIANO VILLAGRANA",1,"831011310T0381000.0002682",83101,3,10,"T03810","00.0",2682,39,2,"B",1,201606,201606]
[null,"GUANAJUATO","CADI801221FT5","CADI801221HGTRSS00","ISRAEL CARDENAS DIOSDADO",1,"831011728T0381000.0003702",83101,7,28,"T03810","00.0",3702,39,2,"B",1,201606,201606]
[null,"GUANAJUATO","PETL870430KW3","PETL870430MMNRPZ02","LUZ MARIA PEREZ TAPIA",1,"831011953A0180300.000030",83101,9,53,"A01803","00.0",30,29,2,"B",1,201606,201606]
[null,"GUANAJUATO","PETL870430KW3","PETL870430MMNRPZ02","LUZ MARIA PEREZ TAPIA",1,"831011953A0180300.000030",83101,9,53,"A01803","00.0",30,29,2,"B",3,201606,201606]
[null,"GUANAJUATO","GOSE861110S23","GOSE861110MGTNNR01","ERIKA ELIZABETH GONZALEZ SANCHEZ",1,"831011951A0180300.000041",83101,9,51,"A01803","00.0",41,29,2,"B",1,201606,201606]
[null,"GUANAJUATO","NIJV910312FZ6","NIJV910312HDFTSC07","VICTOR DAVID NIETO JASSO",1,"831011512CF0105900.000133",83101,5,12,"CF01059","00.0",133,93,"OA1","A",1,201606,201606]
[null,"GUANAJUATO","TOFM860110TE7","TOFM860110MGTRNR00","MARTHA EDITH TORRES FUENTES",1,"831011742T0382000.000972",83101,7,42,"T03820","00.0",972,82,7,"B",1,201606,201606]
[null,"GUANAJUATO","GOOG7802057F2","GOOG780205HGTNRD04","JOSE GUADALUPE GONZALEZ ORTEGA",1,"831011742T0382000.001686",83101,7,42,"T03820","00.0",1686,82,7,"B",1,201606,201606]
[null,"GUANAJUATO","VERT861015NB6","VERT861015MGTRMR01","TERESA VERDE RAMIREZ",1,"831011730T0382000.000915",83101,7,30,"T03820","00.0",915,82,7,"B",1,201606,201606]
[null,"GUANAJUATO","TOFF601228BV5","TOFF601228HGTRGR04","FRANCISCO JAVIER TORRES FIGUEROA",1,"831011727T0382000.000892",83101,7,27,"T03820","00.0",892,82,7,"B",1,201606,201606]
[null,"GUANAJUATO","AOMM651230U5A","AOMM651230MGTBSY06","MA. MAYELA ABOYTES MOSQUEDA",1,"831011512A0180700.000297",83101,5,12,"A01807","00.0",297,81,5,"B",2,201607,201607]
[null,"GUANAJUATO","TEMM661201D47","TEMG661201MGTRRD06","MA. GUADALUPE TREJO MARTINEZ",1,"831011512A0180700.0001521",83101,5,12,"A01807","00.0",1521,81,5,"B",2,201607,201607]
[null,"GUANAJUATO","RIHM750221AD5","RIHM750221HGTSRG01","MIGUEL DAMICIO RIOS HERNANDEZ",1,"831011718T0382000.002174",83101,7,18,"T03820","00.0",2174,82,7,"B",2,201607,201607]
[null,"GUANAJUATO","SACM760716KV0","SACM760716MJCNSN08","MONICA DEL CARMEN SANDOVAL CASTELLON",1,"83101126A0180600.001096",83101,2,6,"A01806","00.0",1096,70,3,"B",3,201607,201607]
[null,"GUANAJUATO","SEER810904RN6","SEER810904HGTRSF07","RAFAEL SERRATO ESPINOSA",1,"831011725A0180700.0000191",83101,7,25,"A01807","00.0",191,81,5,"B",3,201607,201607]
[null,"GUANAJUATO","CUPS720728BN7","CUPS720728MGTVSL06","SILVIA CUEVAS PESCADOR",1,"831011743T0381000.0001102",83101,7,43,"T03810","00.0",1102,39,2,"B",1,201607,201607]
[null,"GUANAJUATO","LAGG8705075P8","LAGG870507MGTGRS08","GISELA LAGUNA GUERRERO",1,"831011743T0382000.000391",83101,7,43,"T03820","00.0",391,82,7,"B",3,201607,201607]
[null,"GUANAJUATO","DUPS9001267KA","DUPS900126MGTRRN08","SANDRA IVONNE DURAN PRADO",1,"831011742A0380400.0000112",83101,7,42,"A03804","00.0",112,43,2,"B",3,201607,201607]
[null,"GUANAJUATO","PACM931219CM1","PACM931219MDGLBY03","MAYLEN NOEMI PLASCENCIA CABRERA",1,"831011741A0380400.0000602",83101,7,41,"A03804","00.0",602,43,2,"B",3,201607,201607]
[null,"GUANAJUATO","TOFM860110TE7","TOFM860110MGTRNR00","MARTHA EDITH TORRES FUENTES",1,"831011742T0382000.000972",83101,7,42,"T03820","00.0",972,82,7,"B",3,201607,201607]
[null,"GUANAJUATO","ROTD900918TRA","ROTD900918HVZDLG06","DAGOBERTO RODRIGUEZ TELLO",1,"831011730T0382000.000703",83101,7,30,"T03820","00.0",703,82,7,"B",1,201607,201607]
[null,"GUANAJUATO","FOTL950830PQ2","FOTL950830MGTLRR02","LAURA JAZMIN FLORES TORRES",1,"831011727T0382000.002251",83101,7,27,"T03820","00.0",2251,82,7,"B",1,201607,201607]
[null,"GUANAJUATO","MOPS740919966","MOPS740919MMCRRL01","SILVIA MORENO PARADA",1,"831011725T0381000.0004512",83101,7,25,"T03810","00.0",4512,39,2,"B",1,201607,201607]
[null,"GUANAJUATO","MOPS740919966","MOPS740919MMCRRL01","SILVIA MORENO PARADA",1,"831011725T0381000.0004512",83101,7,25,"T03810","00.0",4512,39,2,"B",3,201607,201607]
[null,"GUANAJUATO","MAGG810106790","MAGG810106MGTRNR04","GRACIELA MARTINEZ GONZALEZ",1,"831011728A0380400.000143",83101,7,28,"A03804","00.0",143,43,2,"B",1,201607,201607]
[null,"GUANAJUATO","AAAL860804UN9","AAAL860804MTSBZD03","LUDIM ABRAHAM AZUARA",1,"831011728T0380300.000184",83101,7,28,"T03803","00.0",184,47,2,"B",1,201607,201607]
[null,"GUANAJUATO","EAAJ8712218X3","EAAJ871221MMCSLS09","MARIA DE JESUS ESCAMILLA ALVAREZ",1,"831011725T0381000.000220",83101,7,25,"T03810","00.0",220,39,2,"B",1,201607,201607]
[null,"GUANAJUATO","HUSM771116C7A","HUSM771116MMNNLR06","MARIZA HUANTE SILVA",1,"831011725T0380300.000301",83101,7,25,"T03803","00.0",301,47,2,"B",1,201607,201607]
[null,"GUANAJUATO","MERM890606QX7","MERM890606MGTNYY01","MYRIAM DE LOS ANGELES MENDOZA REYES",1,"831011729T0381000.000112",83101,7,29,"T03810","00.0",112,39,2,"B",1,201607,201607]
[null,"GUANAJUATO","ZAZJ9610201D4","ZAZJ961020HQTRRN09","JONATAN REMBERTO ZARAZUA ZARAZUA",1,"831011730A0380400.000137",83101,7,30,"A03804","00.0",137,43,2,"B",1,201607,201607]
[null,"GUANAJUATO","GUZK880623FTA","GUZK880623HGTTVR01","KARIM MIGUEL GUTIERREZ ZAVALA",1,"831011740T0380300.0002172",83101,7,40,"T03803","00.0",2172,47,2,"B",1,201607,201607]
[null,"GUANAJUATO","CASS881024AL7","CASS881024MGTHNN07","SANDRA PAULINA CHAVEZ SANCHEZ",1,"831011951CF0105900.0000052",83101,9,51,"CF01059","00.0",52,93,"OA1","A",1,201607,201607]
[null,"GUANAJUATO","CASS881024AL7","CASS881024MGTHNN07","SANDRA PAULINA CHAVEZ SANCHEZ",1,"831011951CF0105900.0000052",83101,9,51,"CF01059","00.0",52,93,"OA1","A",3,201607,201607]
[null,"GUANAJUATO","NAHL730801RV8","NAHL730801MGTVRR01","MARIA DE LOURDES NAVARRO HERNANDEZ",1,"831011714A0180700.0000262",83101,7,14,"A01807","00.0",262,81,5,"B",3,201608,201608]
[null,"GUANAJUATO","VARL750211VB2","VARL750211MGTRMR07","MARIA LOURDES VARGAS RAMIREZ",1,"831011717A0180700.000345",83101,7,17,"A01807","00.0",345,81,5,"B",3,201608,201608]
[null,"GUANAJUATO","COSY800415BF0","COSY800415MGTRVN04","YUNERY CORTES SAAVEDRA",1,"831011715A0180700.000326",83101,7,15,"A01807","00.0",326,81,5,"B",3,201608,201608]
[null,"GUANAJUATO","ZAGJ830623IG5","ZAGJ830623MGTVLN06","JUANA ZAVALA GALLEGOS",1,"831011714A0180600.000490",83101,7,14,"A01806","00.0",490,70,3,"B",3,201608,201608]
[null,"GUANAJUATO","FAHG7612098T7","FAHG761209MGTLRD03","MA. GUADALUPE FALCON HERNANDEZ",1,"831011741T0381000.000219",83101,7,41,"T03810","00.0",219,39,2,"B",1,201608,201608]
[null,"GUANAJUATO","RILM750601TH0","RILM750601MOCSSG04","MAGDALENA RIOS LUIS",1,"831011717T0382000.0000531",83101,7,17,"T03820","00.0",531,82,7,"B",1,201608,201608]
[null,"GUANAJUATO","LIMS650722BA4","LIMS650722MGTNNR14","MA SARA MAGDALENA LINARES MENDOZA",1,"831011735T0382000.000122",83101,7,35,"T03820","00.0",122,82,7,"B",1,201608,201608]
[null,"GUANAJUATO","MENM790123EM1","MENM790123MGTDVR00","MIRIAM DE LOS ANGELES MEDEL NAVARRETE",1,"831011720A0380400.000173",83101,7,20,"A03804","00.0",173,43,2,"B",1,201608,201608]
[null,"GUANAJUATO","GUGJ930811J60","GUGJ930811MGTRNS05","MARIA JOSE GUERRERO GONZALEZ",1,"831011512A0180300.0000471",83101,5,12,"A01803","00.0",471,29,2,"B",1,201608,201608]
[null,"GUANAJUATO","LEGJ871018BN9","LEGJ871018MGTDNN02","JENIFER LEDEZMA GONZALEZ",1,"831011951A0380400.000209",83101,9,51,"A03804","00.0",209,43,2,"B",1,201608,201608]
[null,"GUANAJUATO","JABE820909HH0","JABE820909MGTSLL12","ELOISA JASSO BALLEZA",1,"831011844A0380400.000243",83101,8,44,"A03804","00.0",243,43,2,"B",1,201608,201608]
[null,"GUANAJUATO","PITJ930828Q89","PITJ930828HGTCRN07","JONATHAN EDUARDO PICON TORRES",1,"831011844T0381000.000028",83101,8,44,"T03810","00.0",28,39,2,"B",1,201608,201608]
[null,"GUANAJUATO","AOJM820726EC0","AOJM820726HGTRRR08","MARIO ARGOTE JUAREZ",1,"83101126A0180700.000168",83101,2,6,"A01807","00.0",168,81,5,"B",1,201608,201608]
[null,"GUANAJUATO","RAGM9005156P3","RAGM900515MGTMJN01","MONICA SAMANTHA RAMOS GOUJON",1,"83101124CF3384900.0000681",83101,2,4,"CF33849","00.0",681,88,8,"B",1,201608,201608]
[null,"GUANAJUATO","MASE530517JN0","MASE530517HGTRNR09","ERNESTO MARTINEZ SANCHEZ",1,"831011715T0382000.001779",83101,7,15,"T03820","00.0",1779,82,7,"B",2,201609,201609]
[null,"GUANAJUATO","MASE530517JN0","MASE530517HGTRNR09","ERNESTO MARTINEZ SANCHEZ",1,"831011715T0382000.001779",83101,7,15,"T03820","00.0",1779,82,7,"B",1,201609,201609]
[null,"GUANAJUATO","RIHM750221AD5","RIHM750221HGTSRG01","MIGUEL DAMICIO RIOS HERNANDEZ",1,"831011718T0382000.002174",83101,7,18,"T03820","00.0",2174,82,7,"B",1,201609,201609]
[null,"GUANAJUATO","LUPI741127IZ3","LUPI741127MDFNRS02","MARIA ISABEL LUNA PEREZ",1,"83101126CF2186500.00009",83101,2,6,"CF21865","00.0",9,1,"QB","B",2,201609,201609]
[null,"GUANAJUATO","PARL850303S64","PARL850303MGTDVN02","LEONOR PADILLA RIVERA",1,"83101124CF3601400.000046",83101,2,4,"CF36014","00.0",46,92,"OA1","B",3,201609,201609]
[null,"GUANAJUATO","NAMR8410165H3","NAMR841016MGTVRS07","ROSALINDA NAVARRO MARTINEZ",1,"831011718T0380300.0000092",83101,7,18,"T03803","00.0",92,47,2,"B",1,201609,201609]
[null,"GUANAJUATO","LIMS650722BA4","LIMS650722MGTNNR14","MA SARA MAGDALENA LINARES MENDOZA",1,"831011735T0382000.000122",83101,7,35,"T03820","00.0",122,82,7,"B",2,201609,201609]
[null,"GUANAJUATO","RAGM9005156P3","RAGM900515MGTMJN01","MONICA SAMANTHA RAMOS GOUJON",1,"83101124CF3384900.000373",83101,2,4,"CF33849","00.0",373,88,8,"B",3,201609,201609]
[null,"GUANAJUATO","RARA580417NI3","RARA580417HGTMMR07","ARMANDO RAMIREZ RAMIREZ",1,"831011727T0382000.000017",83101,7,27,"T03820","00.0",17,82,7,"B",1,201609,201609]
[null,"GUANAJUATO","NADP821016J68","NADP821016MGTVRL01","MARIA DEL PILAR NAVARRO DURAN",1,"831011727T0382000.000229",83101,7,27,"T03820","00.0",229,82,7,"B",1,201609,201609]
[null,"GUANAJUATO","RORD790510T10","RORD790510MGTMML09","DULCE MARIA ROMERO RAMIREZ",1,"831011713T0382000.000276",83101,7,13,"T03820","00.0",276,82,7,"B",1,201609,201609]
[null,"GUANAJUATO","CUFC8809064X4","CUFC880906MOCRNY08","CYNTHIA CRUZ FUENTES",1,"831011713A0180600.0000091",83101,7,13,"A01806","00.0",91,70,3,"B",1,201609,201609]
[null,"GUANAJUATO","FOAP6704124J5","FOAP670412MGTLLT01","PATRICIA FLORES ALVAREZ",1,"83101124CF1280400.000",83101,2,4,"CF12804","00.0",0,83,6,"B",1,201609,201609]
[null,"GUANAJUATO","MEMS601125CV5","MEMS601125HMNNLM04","SAMUEL MENDOZA MALDONADO",1,"831011952CF1281400.0000041",83101,9,52,"CF12814","00.0",41,86,7,"B",1,201609,201609]
[null,"GUANAJUATO","HELJ920419M66","HELJ920419HQTRYS06","JOSE DE JESUS HERNANDEZ LOYOLA",1,"831011844CF3601400.000349",83101,8,44,"CF36014","00.0",349,92,"OA1","A",1,201609,201609]
[null,"GUANAJUATO","MASE530517JN0","MASE530517HGTRNR09","ERNESTO MARTINEZ SANCHEZ",1,"831011715T0382000.001779",83101,7,15,"T03820","00.0",1779,82,7,"B",2,201610,201610]
[null,"GUANAJUATO","GOMM610218KG4","GOMM610218MGTNRR05","MARTA PATRICIA GONZALEZ MORENO",1,"831011713A0380400.000008",83101,7,13,"A03804","00.0",8,43,2,"B",3,201610,201610]
[null,"GUANAJUATO","CUPS720728BN7","CUPS720728MGTVSL06","SILVIA CUEVAS PESCADOR",1,"831011743T0381000.0001102",83101,7,43,"T03810","00.0",1102,39,2,"B",3,201610,201610]
[null,"GUANAJUATO","FOQL7110275I8","FOQL711027MGTLVN02","LEONOR FLORES QUEVEDO",1,"831011728T0380300.0000022",83101,7,28,"T03803","00.0",22,47,2,"B",3,201610,201610]
[null,"GUANAJUATO","LOME901220AG6","LOME901220MQTRTS03","MARﾍA ESTEFANﾍA LORENZO MATA",1,"831011718T0382000.000014",83101,7,18,"T03820","00.0",14,82,7,"B",1,201610,201610]
[null,"GUANAJUATO","OESD9012116A0","OESD901211MGTRVL05","DOLORES GUADALUPE ORTEGA SAAVEDRA",1,"831011714T0380300.0000042",83101,7,14,"T03803","00.0",42,47,2,"B",1,201610,201610]
[null,"GUANAJUATO","SEGE921103JEA","SEGE921103MMNRRS05","ESTEFANIA SERRATO GARCIA",1,"831011735T0380300.000029",83101,7,35,"T03803","00.0",29,47,2,"B",1,201610,201610]
[null,"GUANAJUATO","MISA810907T8A","MISA810907MGTRLL02","ALICIA MIRANDA SALAZAR",1,"831011715A0180300.0000152",83101,7,15,"A01803","00.0",152,29,2,"B",1,201610,201610]
[null,"GUANAJUATO","MADS8906296J1","MADS890629MGTRMR05","SUREY VIRIDIANA MARTINEZ DOMINGUEZ",1,"831011715T0381000.000157",83101,7,15,"T03810","00.0",157,39,2,"B",1,201610,201610]
[null,"GUANAJUATO","VAMM8611122V7","VAMM861112MGTZCY00","MAYRA VAZQUEZ MACARENA",1,"831011728T0381000.000144",83101,7,28,"T03810","00.0",144,39,2,"B",1,201610,201610]
[null,"GUANAJUATO","LOLG8002136P9","LOLG800213HGTPNS03","GUSTAVO LOPEZ LUNA",1,"831011735T0382000.000122",83101,7,35,"T03820","00.0",122,82,7,"B",1,201610,201610]
[null,"GUANAJUATO","AIML940210D95","AIML940210MGTRNZ09","LUZ PATRICIA ARVIZU MONTES",1,"831011730A0180700.000172",83101,7,30,"A01807","00.0",172,81,5,"B",1,201610,201610]
[null,"GUANAJUATO","REFE870611H65","REFE870611HGTYNL02","ELI JUAN RUBEN REYES FUENTES",1,"83101126A0180600.000420",83101,2,6,"A01806","00.0",420,70,3,"B",1,201610,201610]
[null,"GUANAJUATO","MAFR721206U28","MAFR721206MGTRLC04","ROCIO ANEL MARTINEZ FLORES",1,"831011715T0382000.0006162",83101,7,15,"T03820","00.0",6162,82,7,"B",1,201610,201610]
[null,"GUANAJUATO","GORM961124VB9","GORM961124MGTNZC03","MICHEL YARED GONZALEZ RAZO",1,"831011720T0382000.000617",83101,7,20,"T03820","00.0",617,82,7,"B",1,201610,201610]
[null,"GUANAJUATO","MESE811002373","MEXS811002MGTJXL00","MARIA SELEM MEJIA ",1,"831011718T0382000.000699",83101,7,18,"T03820","00.0",699,82,7,"B",1,201610,201610]
[null,"GUANAJUATO","VIRM731126CL3","VIRM731126MGTLMN06","MARIA MONICA VILLANUEVA RAMIREZ",1,"831011735A0180600.0000051",83101,7,35,"A01806","00.0",51,70,3,"B",3,201611,201611]
[null,"GUANAJUATO","GOMM610218KG4","GOMM610218MGTNRR05","MARTA PATRICIA GONZALEZ MORENO",1,"831011713A0380400.0004412",83101,7,13,"A03804","00.0",4412,43,2,"B",3,201611,201611]
[null,"GUANAJUATO","SACM760716KV0","SACM760716MJCNSN08","MONICA DEL CARMEN SANDOVAL CASTELLON",1,"83101126A0180600.000008",83101,2,6,"A01806","00.0",8,70,3,"B",3,201611,201611]
[null,"GUANAJUATO","PECT910409LB5","PECT910409MDFXMN04","TANIA BERENICE PEﾑA CAMBRON",1,"83101113A0380400.000081",83101,1,3,"A03804","00.0",81,43,2,"B",2,201611,201611]
[null,"GUANAJUATO","CAGJ791209EN4","CAGJ791209HGTRTR01","JORGE ADRIAN CARDENAS GUTIERREZ",1,"831011714T0382000.002462",83101,7,14,"T03820","00.0",2462,82,7,"B",2,201611,201611]
[null,"GUANAJUATO","GORA840728TD1","GORA840728MDFNMN07","ANA LAURA GONZALEZ RAMOS",1,"831011725A0180700.000312",83101,7,25,"A01807","00.0",312,81,5,"B",1,201611,201611]
[null,"GUANAJUATO","CACJ850212C85","CACJ850212HGTMMN05","JUAN MIGUEL CAMARILLO CAMARILLO",1,"831011727A0180300.000027",83101,7,27,"A01803","00.0",27,29,2,"B",1,201611,201611]
[null,"GUANAJUATO","VAPM701212VE4","VAPG701212MGTLRD04","MA. GUADALUPE VALADEZ PEREZ",1,"831011741T0380300.000344",83101,7,41,"T03803","00.0",344,47,2,"B",1,201611,201611]
[null,"GUANAJUATO","JUCR790316G8A","JUCR790316HGTRPL02","RAUL HERIBERTO JUAREZ CAPETILLO",1,"831011728T0381000.000083",83101,7,28,"T03810","00.0",83,39,2,"B",1,201611,201611]
[null,"GUANAJUATO","BEGL8709056T2","BEGL870905HGTCRS09","LUIS ALFONSO BECERRA GARCIA",1,"831011512CF3601400.0000021",83101,5,12,"CF36014","00.0",21,95,"OA1","A",1,201611,201611]
[null,"GUANAJUATO","GUNC8511262G5","GUNC851126HQRTVR08","CARLOS FELIPE GUTIERREZ NOVELO",1,"831011714CF3481000.0000031",83101,7,14,"CF34810","00.0",31,70,3,"B",1,201611,201611]
[null,"GUANAJUATO","LOSS570105T33","LOSS570105MTSZLS00","SUSANA ENRIQUETA LOZANO SALCEDO",1,"831011741A0180600.0000116",83101,7,41,"A01806","00.0",116,70,3,"B",2,201612,201612]
[null,"GUANAJUATO","CAGJ791209EN4","CAGJ791209HGTRTR01","JORGE ADRIAN CARDENAS GUTIERREZ",1,"831011714T0382000.002462",83101,7,14,"T03820","00.0",2462,82,7,"B",2,201612,201612]
[null,"GUANAJUATO","CAGJ791209EN4","CAGJ791209HGTRTR01","JORGE ADRIAN CARDENAS GUTIERREZ",1,"831011714T0382000.002462",83101,7,14,"T03820","00.0",2462,82,7,"B",1,201612,201612]
[null,"Total Personas : ",189,null,null,null,null,null,null,null,"Total Plazas : ",null,263]
[]
[]
[]
[null,"Fuente : Información proporcionada por las Entidades Federativas"]

{"sheet":"II D) 4","index":7,"n_rows":27,"n_cols":17,"rows_kept":27,"cut":false,"hidden":false,"merged":[[23,13,23,14],[12,0,13,0],[12,6,13,6],[12,7,12,13],[12,14,12,15],[12,2,13,2],[12,1,13,1],[12,16,13,16],[12,5,13,5],[12,4,13,4],[12,3,13,3],[9,1,9,9]]}
[]
[]
[]
[]
[]
[]
[]
[]
[null,"Formato: Trabajadores Jubilados en el Periodo"]
[null,{"$f":"IF('Caratula Resumen'!D22=\"Elige el Periodo…\",\"\",'Caratula Resumen'!D22)","v":"Fondo de Aportaciones para la Educación Tecnológica y de Adultos/Instituto Nacional para la Educación de los Adultos (FAETA/INEA)"},null,null,null,null,null,null,null,null,null,null,null,null,null,"2do. Trimestre 2016"]
[]
[]
[null,"Entidad Federativa","R.F.C.","CURP","NOMBRE","Clave CT","Última(s) ó Penultima(s) Plaza(s) Ocupada(s)\n(*)","Clave Presupuestal de la Jubilación",null,null,null,null,null,null,"Periodo ocupado",null,"Quincena de inicio de jubilación"]
[null,null,null,null,null,null,null,"Partida Presupuestal","Código de Pago","Clave de Unidad","Clave de Sub Unidad","Clave de Categoría","Horas Semana Mes ","Número de Plaza","Inicio","Conclusión"]
[]
[null,"Entidad Federativa","R.F.C.","CURP","NOMBRE","Clave Centro de Trabajo","Última(s) ó Penultima(s) Plaza(s) Ocupada(s)\n(*)","Partida Presupuestal","Código de Pago","Clave de Unidad","Clave de Sub Unidad","Clave de Categoría","Horas Semana Mes ","Número de Plaza","Periodo ocupado\nInicio","Periodo ocupado\nConclusión","Quincena de inicio de jubilación"]
[]
[]
[]
[]
[]
[null,"Total Personas : ",null,null,null,null,null,null,null,null,null,"Total Plazas : "]
[]
[]
[]
[null,"Fuente : Información proporcionada por las Entidades Federativas"]
[null,"(*) Si  el trabajador se jubila con más de una clave presupuestal, por cada plaza se debe llenar un registro hasta que se haya informado acerca de todas las plazas del trabajador."]

{"sheet":"II D) 4 A","index":8,"n_rows":27,"n_cols":18,"rows_kept":27,"cut":false,"hidden":false,"merged":[[21,13,21,14],[9,1,9,7],[23,13,23,14],[12,17,13,17],[12,1,13,1],[12,2,13,2],[12,3,13,3],[12,4,13,4],[12,5,13,5],[12,6,12,12],[12,13,12,14],[12,15,13,15],[12,16,13,16]]}
[]
[]
[]
[]
[]
[]
[]
[]
[null,"Formato: Trabajadores que Tramitaron Licencia Prejubilatoria en el Periodo"]
[null,{"$f":"IF('Caratula Resumen'!D22=\"Elige el Periodo…\",\"\",'Caratula Resumen'!D22)","v":"Fondo de Aportaciones para la Educación Tecnológica y de Adultos/Instituto Nacional para la Educación de los Adultos (FAETA/INEA)"},null,null,null,null,null,null,null,null,null,null,null,null,null,null,null,"2do. Trimestre 2016"]
[]
[]
[null,"Entidad Federativa","R.F.C.","CURP","NOMBRE","Clave integrada","Clave Presupuestal",null,null,null,null,null,null,"Periodo Licencia",null,"Percepciones pagadas con Presupuesto Federal en el  Periodo reportado*","Percepciones pagadas con Presupuesto de otra Fuente en el  Periodo reportado*","Clave CT Origen"]
[null,null,null,null,null,null,"Partida Presupuestal","Código de Pago","Clave de Unidad","Clave de Sub Unidad","Clave de Categoría","Horas Semana Mes ","Número de Plaza","Inicio","Conclusión"]
[]
[null,"Entidad Federativa","R.F.C.","CURP","NOMBRE","Clave integrada","Partida Presupuestal","Código de Pago","Clave de Unidad","Clave de Sub Unidad","Clave de Categoría","Horas Semana Mes ","Número de Plaza","Periodo Licencia\nInicio","Periodo Licencia\nConclusión","Percepciones pagadas con Presupuesto Federal en el  Periodo reportado*","Percepciones pagadas con Presupuesto de otra Fuente en el  Periodo reportado*","Clave CT Origen"]
[]
[]
[]
[]
[]
[null,"Total Personas : ",null,null,null,null,null,null,null,null,"Total Plazas : ",null,null,"Total Pto. Federal"]
[]
[null,null,null,null,null,null,null,null,null,null,null,null,null,"Total Ppto. Otras Fuentes"]
[]
[null,"*Total de Percepciones reportadas por la Entidad Federativa como pagadas en el periodo "]
[null,"Fuente : Información proporcionada por las Entidades Federativas"]

{"sheet":"II D) 6","index":9,"n_rows":30,"n_cols":13,"rows_kept":30,"cut":false,"hidden":false,"merged":[[10,1,10,6],[13,12,14,12],[13,9,13,10],[13,11,14,11],[13,1,14,1],[13,2,14,2],[13,3,14,3],[13,4,14,4],[13,5,14,5],[13,6,14,6],[13,7,13,8]]}
[]
[]
[]
[]
[]
[]
[]
[]
[]
[null,"Formato: Trabajadores Contratados por Honorarios en el Periodo"]
[null,{"$f":"IF('Caratula Resumen'!D22=\"Elige el Periodo…\",\"\",'Caratula Resumen'!D22)","v":"Fondo de Aportaciones para la Educación Tecnológica y de Adultos/Instituto Nacional para la Educación de los Adultos (FAETA/INEA)"},null,null,null,null,null,null,null,null,null,null,"2do. Trimestre 2016"]
[]
[]
[null,"Entidad Federativa","Clave Centro de Trabajo","R.F.C.","CURP","Nombre","Identificador del Contrato","Equivalencia",null,"Periodo de Contratación",null,"Función","Percepciones pagadas dentro del periodo reportado"]
[null,null,null,null,null,null,null,"Clave de Categoría","Horas Semana Mes ","Inicio","Conclusión"]
[]
[null,"Entidad Federativa","Clave Centro de Trabajo","R.F.C.","CURP","Nombre","Identificador del Contrato","Clave de Categoría","Horas Semana Mes ","Periodo de Contratación\nInicio","Periodo de Contratación\nConclusión","Función","Percepciones pagadas dentro del periodo reportado"]
[]
[null,null,null,null,null,"NO APLICA"]
[]
[]
[]
[]
[]
[null,"Total Entidad Federativa Personas : ",null,null,null,null,null,null,null,null,null,"Subtotal Monto Pagado en el Periodo:"]
[]
[]
[null,null,null,null,null,null,null,null,null,"Total   Percepciones :"]
[]
[null,"Fuente : Información proporcionada por las Entidades Federativas"]

{"sheet":"II D) 7 1","index":10,"n_rows":39,"n_cols":19,"rows_kept":39,"cut":false,"hidden":false,"merged":[[35,16,35,17],[12,18,13,18],[12,13,13,13],[12,14,13,14],[12,15,13,15],[12,16,13,16],[8,17,8,18],[9,1,9,9],[12,6,13,6],[12,7,12,9],[12,10,13,10],[12,11,13,11],[12,12,13,12],[12,1,13,1],[12,2,13,2],[12,3,13,3],[12,4,13,4],[12,5,13,5],[12,17,13,17]]}
[]
[]
[]
[]
[]
[]
[]
[]
[null,"Formato: Analítico de Categorías / Plazas Autorizadas con su Tabulador",null,null,null,null,null,null,null,null,null,null,null,null,null,null,"Entidad Federativa:",{"$f":"IF('Caratula Resumen'!D21=\"Elige el Periodo…\",\"\",'Caratula Resumen'!D21)","v":" GUANAJUATO "}]
[null,{"$f":"IF('Caratula Resumen'!D22=\"Elige el Periodo…\",\"\",'Caratula Resumen'!D22)","v":"Fondo de Aportaciones para la Educación Tecnológica y de Adultos/Instituto Nacional para la Educación de los Adultos (FAETA/INEA)"},null,null,null,null,null,null,null,null,null,null,null,null,null,null,null,null,"2do. Trimestre 2016"]
[]
[]
[null,"Clave Tipo educativo","Clave Nivel educativo","Clave Subnivel educativo","Descripción Nivel / Subnivel","Tipo Financiamiento","Partida Presupuestal","CATEGORIA",null,null,"Zona Económica","Nivel Puesto","Nivel Sueldo","Tipo Contratación","Monto mensual\npor plaza jornada","Monto mensual\nPor Plaza HSM","Número de Plazas Jornada","Número de Plazas HSM","Monto total autorizado"]
[null,null,null,null,null,null,null,"Tipo de Categoría"," Categoría","Descripción"]
[]
[null,"Clave Tipo educativo","Clave Nivel educativo","Clave Subnivel educativo","Descripción Nivel / Subnivel","Tipo Financiamiento","Partida Presupestal","Tipo de Categoría"," Categoría","Descripción","Zona Económica","Nivel Puesto","Nivel Sueldo","Tipo Contratación","Monto mensual\npor plaza jornada","Monto mensual\nPor Plaza HSM","Número de Plazas Jornada","Número de Plazas HSM","Monto total autorizado"]
[null,6,61,64,"PRIMARIA, SECUNDARIA Y CAPACITACION PARA EL TRABAJO","FAETA",83101,5,"CF36014","COORDINADOR DE ZONA","A",92,"OA1","P",4190.88,0,10,41908.800000000003,0]
[null,6,61,64,"PRIMARIA, SECUNDARIA Y CAPACITACION PARA EL TRABAJO","FAETA",83101,5,"CF01059","JEFE DE DEPARTAMENTO","A",93,"OA1","P",5164.51,0,5,25822.55,0]
[null,6,61,64,"PRIMARIA, SECUNDARIA Y CAPACITACION PARA EL TRABAJO","FAETA",83101,5,"CF36014","JEFE DE DEPARTAMENTO","A",95,"OA1","P",5164.5200000000004,0,1,5164.5200000000004,0]
[null,6,61,64,"PRIMARIA, SECUNDARIA Y CAPACITACION PARA EL TRABAJO","FAETA",83101,5,"CF14070","DIRECTOR DELEGADO","A",97,"MB2","P",14611.06,0,1,14611.06,0]
[null,6,61,64,"PRIMARIA, SECUNDARIA Y CAPACITACION PARA EL TRABAJO","FAETA",83101,5,"CF21865","PROFECIONAL DICTAMINADOR","B",1,"QB","P",6498.9,0,9,58490.1,0]
[null,6,61,64,"PRIMARIA, SECUNDARIA Y CAPACITACION PARA EL TRABAJO","FAETA",83101,2,"S01803","OFICIAL DE SERVICIOS Y MANTENIMIENTO","B",21,2,"P",5731,0,4,22924,0]
[null,6,61,64,"PRIMARIA, SECUNDARIA Y CAPACITACION PARA EL TRABAJO","FAETA",83101,2,"A01803","ADMINISTRATIVO ESPECIALIZADO","B",29,2,"P",5731,0,5,28655,0]
[null,6,61,64,"PRIMARIA, SECUNDARIA Y CAPACITACION PARA EL TRABAJO","FAETA",83101,2,"T03810","ESPECIALISTA EN PROYECTOS TECNICOS","B",39,2,"P",5731,0,26,149006,0]
[null,6,61,64,"PRIMARIA, SECUNDARIA Y CAPACITACION PARA EL TRABAJO","FAETA",83101,2,"A03804","SECRETARIA \"C\"","B",43,2,"P",5731,0,26,149006,0]
[null,6,61,64,"PRIMARIA, SECUNDARIA Y CAPACITACION PARA EL TRABAJO","FAETA",83101,2,"T03803","TECNICO MEDIO","B",47,2,"P",5731,0,24,137544,0]
[null,6,61,64,"PRIMARIA, SECUNDARIA Y CAPACITACION PARA EL TRABAJO","FAETA",83101,2,"A01806","ANALISTA ADMINISTRATIVO","B",70,3,"P",5883.93,0,16,94142.88,0]
[null,6,61,64,"PRIMARIA, SECUNDARIA Y CAPACITACION PARA EL TRABAJO","FAETA",83101,2,"CF34810","ANALISTA ADMINISTRATIVO \"C\"","B",70,3,"P",5883.93,0,1,5883.93,0]
[null,6,61,64,"PRIMARIA, SECUNDARIA Y CAPACITACION PARA EL TRABAJO","FAETA",83101,2,"A01807","TECNICO DOCENTE","B",81,5,"P",6204.78,0,21,130300.38,0]
[null,6,61,64,"PRIMARIA, SECUNDARIA Y CAPACITACION PARA EL TRABAJO","FAETA",83101,2,"T03820","TECNICO SUPERIOR","B",82,7,"P",6418.76,0,172,1104026.72,0]
[null,6,61,64,"PRIMARIA, SECUNDARIA Y CAPACITACION PARA EL TRABAJO","FAETA",83101,2,"CF12804","ANALISTA PROGRAMADOR \"B\"","B",83,6,"P",5897.85,0,1,5897.85,0]
[null,6,61,64,"PRIMARIA, SECUNDARIA Y CAPACITACION PARA EL TRABAJO","FAETA",83101,2,"T03823","ESPECIALIISTA EN TELEINFORMATICA","B",85,7,"P",6418.76,0,1,6418.76,0]
[null,6,61,64,"PRIMARIA, SECUNDARIA Y CAPACITACION PARA EL TRABAJO","FAETA",83101,2,"CF12814","COORDINADOR DE LA UNIDAD DE SERVICIOS ESPECIALIZADOS","B",86,7,"P",6418.76,0,1,6418.76,0]
[null,6,61,64,"PRIMARIA, SECUNDARIA Y CAPACITACION PARA EL TRABAJO","FAETA",83101,2,"CF33849","COORDINADOR REGIONAL ZONA 1","B",88,8,"P",6495.05,0,3,19485.150000000001,0]
[null,6,61,64,"PRIMARIA, SECUNDARIA Y CAPACITACION PARA EL TRABAJO","FAETA",83101,2,"CF36014","COORDINADOR DE ZONA","B",92,"OA1","P",4328.8500000000004,0,3,12986.55,0]
[null,null,null,null,null,null,null,null,null,null,null,null,null,"Total Jornada:",{"$f":"SUBTOTAL(109,Tabla15[Monto mensual\npor plaza jornada])","v":118235.54000000001},null,"Total Autorizado:",null,{"$f":"SUBTOTAL(109,Tabla15[Monto total autorizado])","v":0}]
[null,null,null,null,null,null,null,null,null,null,null,null,null,"Total HSM",null,{"$f":"SUM(O41)","v":0}]
[]
[null,"Fuente : Información proporcionada por las Entidades Federativas"]

{"sheet":"II D) 7 2 ","index":11,"n_rows":227,"n_cols":18,"rows_kept":227,"cut":false,"hidden":false,"merged":[[14,8,15,8],[14,9,14,13],[14,14,14,16],[10,16,10,17],[11,1,11,9],[14,1,15,1],[14,2,15,2],[14,3,15,3],[14,17,15,17],[14,6,15,6],[14,7,15,7],[14,4,15,4],[14,5,15,5]]}
[]
[]
[]
[]
[]
[]
[]
[]
[]
[]
[null,"Formato: Catálogo de Categorías y Tabuladores",null,null,null,null,null,null,null,null,null,null,null,null,null,"Entidad Federativa:",{"$f":"IF('Caratula Resumen'!D21=\"Elige el Periodo…\",\"\",'Caratula Resumen'!D21)","v":" GUANAJUATO "}]
[null,{"$f":"IF('Caratula Resumen'!D22=\"Elige el Periodo…\",\"\",'Caratula Resumen'!D22)","v":"Fondo de Aportaciones para la Educación Tecnológica y de Adultos/Instituto Nacional para la Educación de los Adultos (FAETA/INEA)"},null,null,null,null,null,null,null,null,null,null,null,null,null,null,null,"2do. Trimestre 2016"]
[]
[]
[null,"Identificador origen presupuestal de la plaza","Clave de categoría","Descripción de la categoría","Tipo de contratación","Tipo de categoría","Clave de concepto de pago","Clave de nivel de puesto","Clave de nivel de sueldo","Sueldo asignado por zona económica",null,null,null,null,"Datos adicionales de horas",null,null,"Fecha de actualización"]
[null,null,null,null,null,null,null,null,null,"Inicio de vigencia del sueldo","Fin de vigencia del sueldo","Monto Mensual Jornada ó de HSM\nZona A","Monto Mensual Jornada ó de HSM\nZona B","Monto Mensual Jornada ó de HSM\nZona C","Horas \nde compatibilidad","Horas de servicio (HSM)","Horas de docencia"]
[]
[null,"Identificador origen presupuestal de la plaza","Clave de categoría","Descripción de la categoría","Tipo de contratación","Tipo de categoría","Clave de concepto de pago","Clave de nivel de puesto","Clave de nivel de sueldo","Inicio de vigencia del sueldo","Fin de vigencia del sueldo","Monto Mensual Jornada ó de HSM\nZona A","Monto Mensual Jornada ó de HSM\nZona B","Monto Mensual Jornada ó de HSM\nZona C","Horas \nde compatibilidad","Horas de servicio (HSM)","Horas de docencia","Fecha de actualización"]
[null,1,"CF21865","PROFESIONAL DICTAMINADOR DE SERVICIOS ESPECIALIZADOS","P",2,1,1,"QB",201207,999999,0,0,6498.9,35,35,0,20160704]
[null,1,"CF21865","PROFESIONAL DICTAMINADOR DE SERVICIOS ESPECIALIZADOS","P",2,2,1,"QB",201207,999999,0,0,415,35,35,0,20160704]
[null,1,"CF21865","PROFESIONAL DICTAMINADOR DE SERVICIOS ESPECIALIZADOS","P",2,3,1,"QB",201207,999999,0,0,5866.4,35,35,0,20160704]
[null,1,"CF21865","PROFESIONAL DICTAMINADOR DE SERVICIOS ESPECIALIZADOS","P",2,9,1,"QB",201207,999999,0,0,465,35,35,0,20160704]
[null,1,"CF21865","PROFESIONAL DICTAMINADOR DE SERVICIOS ESPECIALIZADOS","P",2,12,1,"QB",201207,999999,0,0,385,35,35,0,20160704]
[null,1,"CF21865","PROFESIONAL DICTAMINADOR DE SERVICIOS ESPECIALIZADOS","P",2,20,1,"QB",201207,999999,0,0,1300,35,35,0,20160704]
[null,1,"CF21865","PROFESIONAL DICTAMINADOR DE SERVICIOS ESPECIALIZADOS","P",2,106,1,"QB",201207,999999,0,0,200,35,35,0,20160704]
[null,1,"S01803","OFICIAL DE SERVICIOS Y MANTEN.","P",2,1,21,2,201207,999999,0,0,5731,35,35,0,20160704]
[null,1,"S01803","OFICIAL DE SERVICIOS Y MANTEN.","P",2,4,21,2,201207,999999,0,0,100,35,35,0,20160704]
[null,1,"S01803","OFICIAL DE SERVICIOS Y MANTEN.","P",2,9,21,2,201207,999999,0,0,465,35,35,0,20160704]
[null,1,"S01803","OFICIAL DE SERVICIOS Y MANTEN.","P",2,11,21,2,201207,999999,0,0,415,35,35,0,20160704]
[null,1,"S01803","OFICIAL DE SERVICIOS Y MANTEN.","P",2,14,21,2,201207,999999,0,0,385,35,35,0,20160704]
[null,1,"S01803","OFICIAL DE SERVICIOS Y MANTEN.","P",2,15,21,2,201207,999999,0,0,382.06,35,35,0,20160704]
[null,1,"S01803","OFICIAL DE SERVICIOS Y MANTEN.","P",2,20,21,2,201207,999999,0,0,1300,35,35,0,20160704]
[null,1,"S01803","OFICIAL DE SERVICIOS Y MANTEN.","P",2,50,21,2,201207,999999,0,0,186.56,35,35,0,20160704]
[null,1,"S01803","OFICIAL DE SERVICIOS Y MANTEN.","P",2,63,21,2,201207,999999,0,0,659.06,35,35,0,20160704]
[null,1,"S01803","OFICIAL DE SERVICIOS Y MANTEN.","P",2,68,21,2,201207,999999,0,0,734.86,35,35,0,20160704]
[null,1,"A01803","ADMINISTRATIVO ESPECIALIZADO","P",2,1,29,2,201207,999999,0,0,5731,35,35,0,20160704]
[null,1,"A01803","ADMINISTRATIVO ESPECIALIZADO","P",2,9,29,2,201207,999999,0,0,465,35,35,0,20160704]
[null,1,"A01803","ADMINISTRATIVO ESPECIALIZADO","P",2,11,29,2,201207,999999,0,0,415,35,35,0,20160704]
[null,1,"A01803","ADMINISTRATIVO ESPECIALIZADO","P",2,14,29,2,201207,999999,0,0,385,35,35,0,20160704]
[null,1,"A01803","ADMINISTRATIVO ESPECIALIZADO","P",2,20,29,2,201207,999999,0,0,1300,35,35,0,20160704]
[null,1,"T03810","ESPECIALISTA EN PROYECTOS TECNICOS","P",2,1,39,2,201207,999999,0,0,5731,35,35,0,20160704]
[null,1,"T03810","ESPECIALISTA EN PROYECTOS TECNICOS","P",2,4,39,2,201207,999999,0,0,200,35,35,0,20160704]
[null,1,"T03810","ESPECIALISTA EN PROYECTOS TECNICOS","P",2,9,39,2,201207,999999,0,0,465,35,35,0,20160704]
[null,1,"T03810","ESPECIALISTA EN PROYECTOS TECNICOS","P",2,11,39,2,201207,999999,0,0,415,35,35,0,20160704]
[null,1,"T03810","ESPECIALISTA EN PROYECTOS TECNICOS","P",2,14,39,2,201207,999999,0,0,385,35,35,0,20160704]
[null,1,"T03810","ESPECIALISTA EN PROYECTOS TECNICOS","P",2,15,39,2,201207,999999,0,0,382.06,35,35,0,20160704]
[null,1,"T03810","ESPECIALISTA EN PROYECTOS TECNICOS","P",2,20,39,2,201207,999999,0,0,1300,35,35,0,20160704]
[null,1,"T03810","ESPECIALISTA EN PROYECTOS TECNICOS","P",2,50,39,2,201207,999999,0,0,1003.52,35,35,0,20160704]
[null,1,"T03810","ESPECIALISTA EN PROYECTOS TECNICOS","P",2,63,39,2,201207,999999,0,0,659.06,35,35,0,20160704]
[null,1,"T03810","ESPECIALISTA EN PROYECTOS TECNICOS","P",2,68,39,2,201207,999999,0,0,734.86,35,35,0,20160704]
[null,1,"T03810","ESPECIALISTA EN PROYECTOS TECNICOS","P",2,13,39,2,201207,999999,0,0,60,35,35,0,20160704]
[null,1,"A03804","SECRETARIA C","P",2,1,43,2,201207,999999,0,0,5731,35,35,0,20160704]
[null,1,"A03804","SECRETARIA C","P",2,4,43,2,201207,999999,0,0,175,35,35,0,20160704]
[null,1,"A03804","SECRETARIA C","P",2,9,43,2,201207,999999,0,0,465,35,35,0,20160704]
[null,1,"A03804","SECRETARIA C","P",2,11,43,2,201207,999999,0,0,415,35,35,0,20160704]
[null,1,"A03804","SECRETARIA C","P",2,14,43,2,201207,999999,0,0,385,35,35,0,20160704]
[null,1,"A03804","SECRETARIA C","P",2,15,43,2,201207,999999,0,0,382.06,35,35,0,20160704]
[null,1,"A03804","SECRETARIA C","P",2,20,43,2,201207,999999,0,0,1300,35,35,0,20160704]
[null,1,"A03804","SECRETARIA C","P",2,50,43,2,201207,999999,0,0,741.96,35,35,0,20160704]
[null,1,"A03804","SECRETARIA C","P",2,63,43,2,201207,999999,0,0,659.06,35,35,0,20160704]
[null,1,"A03804","SECRETARIA C","P",2,68,43,2,201207,999999,0,0,734.86,35,35,0,20160704]
[null,1,"A03804","SECRETARIA C","P",2,13,43,2,201207,999999,0,0,80,35,35,0,20160704]
[null,1,"A03804","SECRETARIA C","P",2,17,43,2,201207,999999,0,0,328.68,35,35,0,20160704]
[null,1,"T03803","TECNICO MEDIO","P",2,1,47,2,201207,999999,0,0,5731,35,35,0,20160704]
[null,1,"T03803","TECNICO MEDIO","P",2,4,47,2,201207,999999,0,0,225,35,35,0,20160704]
[null,1,"T03803","TECNICO MEDIO","P",2,9,47,2,201207,999999,0,0,465,35,35,0,20160704]
[null,1,"T03803","TECNICO MEDIO","P",2,11,47,2,201207,999999,0,0,415,35,35,0,20160704]
[null,1,"T03803","TECNICO MEDIO","P",2,13,47,2,201207,999999,0,0,60,35,35,0,20160704]
[null,1,"T03803","TECNICO MEDIO","P",2,14,47,2,201207,999999,0,0,385,35,35,0,20160704]
[null,1,"T03803","TECNICO MEDIO","P",2,15,47,2,201207,999999,0,0,382.06,35,35,0,20160704]
[null,1,"T03803","TECNICO MEDIO","P",2,20,47,2,201207,999999,0,0,1300,35,35,0,20160704]
[null,1,"T03803","TECNICO MEDIO","P",2,50,47,2,201207,999999,0,0,1035.82,35,35,0,20160704]
[null,1,"T03803","TECNICO MEDIO","P",2,63,47,2,201207,999999,0,0,659.06,35,35,0,20160704]
[null,1,"T03803","TECNICO MEDIO","P",2,68,47,2,201207,999999,0,0,734.86,35,35,0,20160704]
[null,1,"A01806","ANALISTA ADMINISTRATIVO","P",2,1,70,3,201207,999999,0,0,5883.94,35,35,0,20160704]
[null,1,"A01806","ANALISTA ADMINISTRATIVO","P",2,4,70,3,201207,999999,0,0,200,35,35,0,20160704]
[null,1,"A01806","ANALISTA ADMINISTRATIVO","P",2,9,70,3,201207,999999,0,0,465,35,35,0,20160704]
[null,1,"A01806","ANALISTA ADMINISTRATIVO","P",2,11,70,3,201207,999999,0,0,415,35,35,0,20160704]
[null,1,"A01806","ANALISTA ADMINISTRATIVO","P",2,13,70,3,201207,999999,0,0,60,35,35,0,20160704]
[null,1,"A01806","ANALISTA ADMINISTRATIVO","P",2,14,70,3,201207,999999,0,0,385,35,35,0,20160704]
[null,1,"A01806","ANALISTA ADMINISTRATIVO","P",2,15,70,3,201207,999999,0,0,392.26,35,35,0,20160704]
[null,1,"A01806","ANALISTA ADMINISTRATIVO","P",2,20,70,3,201207,999999,0,0,1300,35,35,0,20160704]
[null,1,"A01806","ANALISTA ADMINISTRATIVO","P",2,50,70,3,201207,999999,0,0,976.78,35,35,0,20160704]
[null,1,"A01806","ANALISTA ADMINISTRATIVO","P",2,63,70,3,201207,999999,0,0,676.66,35,35,0,20160704]
[null,1,"A01806","ANALISTA ADMINISTRATIVO","P",2,68,70,3,201207,999999,0,0,754.48,35,35,0,20160704]
[null,1,"A01806","ANALISTA ADMINISTRATIVO","P",2,2,70,3,201207,999999,0,0,415,35,35,0,20160704]
[null,1,"A01806","ANALISTA ADMINISTRATIVO","P",2,12,70,3,201207,999999,0,0,385,35,35,0,20160704]
[null,1,"CF34810","ANALISTA ADMINISTRATIVO","P",2,1,70,3,201207,999999,0,0,5883.94,35,35,0,20160704]
[null,1,"CF34810","ANALISTA ADMINISTRATIVO","P",2,4,70,3,201207,999999,0,0,200,35,35,0,20160704]
[null,1,"CF34810","ANALISTA ADMINISTRATIVO","P",2,9,70,3,201207,999999,0,0,465,35,35,0,20160704]
[null,1,"CF34810","ANALISTA ADMINISTRATIVO","P",2,11,70,3,201207,999999,0,0,415,35,35,0,20160704]
[null,1,"CF34810","ANALISTA ADMINISTRATIVO","P",2,13,70,3,201207,999999,0,0,60,35,35,0,20160704]
[null,1,"CF34810","ANALISTA ADMINISTRATIVO","P",2,14,70,3,201207,999999,0,0,385,35,35,0,20160704]
[null,1,"CF34810","ANALISTA ADMINISTRATIVO","P",2,15,70,3,201207,999999,0,0,392.26,35,35,0,20160704]
[null,1,"CF34810","ANALISTA ADMINISTRATIVO","P",2,20,70,3,201207,999999,0,0,1300,35,35,0,20160704]
[null,1,"CF34810","ANALISTA ADMINISTRATIVO","P",2,50,70,3,201207,999999,0,0,976.78,35,35,0,20160704]
[null,1,"CF34810","ANALISTA ADMINISTRATIVO","P",2,63,70,3,201207,999999,0,0,676.66,35,35,0,20160704]
[null,1,"CF34810","ANALISTA ADMINISTRATIVO","P",2,68,70,3,201207,999999,0,0,754.48,35,35,0,20160704]
[null,1,"CF34810","ANALISTA ADMINISTRATIVO","P",2,2,70,3,201207,999999,0,0,415,35,35,0,20160704]
[null,1,"CF34810","ANALISTA ADMINISTRATIVO","P",2,12,70,3,201207,999999,0,0,385,35,35,0,20160704]
[null,1,"A01807","JEFE DE OFICINA","P",2,1,81,5,201207,999999,0,0,6204.78,35,35,0,20160704]
[null,1,"A01807","JEFE DE OFICINA","P",2,4,81,5,201207,999999,0,0,175,35,35,0,20160704]
[null,1,"A01807","JEFE DE OFICINA","P",2,9,81,5,201207,999999,0,0,465,35,35,0,20160704]
[null,1,"A01807","JEFE DE OFICINA","P",2,11,81,5,201207,999999,0,0,415,35,35,0,20160704]
[null,1,"A01807","JEFE DE OFICINA","P",2,14,81,5,201207,999999,0,0,385,35,35,0,20160704]
[null,1,"A01807","JEFE DE OFICINA","P",2,15,81,5,201207,999999,0,0,413.66,35,35,0,20160704]
[null,1,"A01807","JEFE DE OFICINA","P",2,20,81,5,201207,999999,0,0,1300,35,35,0,20160704]
[null,1,"A01807","JEFE DE OFICINA","P",2,50,81,5,201207,999999,0,0,941.86,35,35,0,20160704]
[null,1,"A01807","JEFE DE OFICINA","P",2,63,81,5,201207,999999,0,0,713.56,35,35,0,20160704]
[null,1,"A01807","JEFE DE OFICINA","P",2,68,81,5,201207,999999,0,0,795.62,35,35,0,20160704]
[null,1,"A01807","JEFE DE OFICINA","P",2,13,81,5,201207,999999,0,0,80,35,35,0,20160704]
[null,1,"T03820","TECNICO DOCENTE","P",2,1,82,7,201207,999999,0,0,6418.76,35,35,0,20160704]
[null,1,"T03820","TECNICO DOCENTE","P",2,3,82,7,201207,999999,0,0,1228.76,35,35,0,20160704]
[null,1,"T03820","TECNICO DOCENTE","P",2,4,82,7,201207,999999,0,0,175,35,35,0,20160704]
[null,1,"T03820","TECNICO DOCENTE","P",2,9,82,7,201207,999999,0,0,465,35,35,0,20160704]
[null,1,"T03820","TECNICO DOCENTE","P",2,11,82,7,201207,999999,0,0,415,35,35,0,20160704]
[null,1,"T03820","TECNICO DOCENTE","P",2,13,82,7,201207,999999,0,0,80,35,35,0,20160704]
[null,1,"T03820","TECNICO DOCENTE","P",2,14,82,7,201207,999999,0,0,385,35,35,0,20160704]
[null,1,"T03820","TECNICO DOCENTE","P",2,20,82,7,201207,999999,0,0,1300,35,35,0,20160704]
[null,1,"T03820","TECNICO DOCENTE","P",2,50,82,7,201207,999999,0,0,852,35,35,0,20160704]
[null,1,"T03820","TECNICO DOCENTE","P",2,63,82,7,201207,999999,0,0,738.16,35,35,0,20160704]
[null,1,"T03820","TECNICO DOCENTE","P",2,68,82,7,201207,999999,0,0,823.04,35,35,0,20160704]
[null,1,"T03820","TECNICO DOCENTE","P",2,106,82,7,201207,999999,0,0,225,35,35,0,20160704]
[null,1,"T03820","TECNICO DOCENTE","P",2,420,82,7,201207,999999,0,0,1300,35,35,0,20160704]
[null,1,"T03820","TECNICO DOCENTE","P",2,450,82,7,201207,999999,0,0,10203.719999999999,35,35,0,20160704]
[null,1,"T03820","TECNICO DOCENTE","P",2,29,82,7,201207,999999,0,0,2600,35,35,0,20160704]
[null,1,"T03820","TECNICO DOCENTE","P",2,17,82,7,201207,999999,0,0,328.68,35,35,0,20160704]
[null,1,"T03820","TECNICO DOCENTE","P",2,401,82,7,201207,999999,0,0,4963.84,35,35,0,20160704]
[null,1,"CF12804","ANALISTA PROGRAMADOR B","P",2,1,83,6,201207,999999,0,0,6311.8,35,35,0,20160704]
[null,1,"CF12804","ANALISTA PROGRAMADOR B","P",2,2,83,6,201207,999999,0,0,415,35,35,0,20160704]
[null,1,"CF12804","ANALISTA PROGRAMADOR B","P",2,3,83,6,201207,999999,0,0,508.56,35,35,0,20160704]
[null,1,"CF12804","ANALISTA PROGRAMADOR B","P",2,9,83,6,201207,999999,0,0,465,35,35,0,20160704]
[null,1,"CF12804","ANALISTA PROGRAMADOR B","P",2,12,83,6,201207,999999,0,0,385,35,35,0,20160704]
[null,1,"CF12804","ANALISTA PROGRAMADOR B","P",2,20,83,6,201207,999999,0,0,1300,35,35,0,20160704]
[null,1,"T03823","TECNICO SUPERIOR","P",2,1,85,7,201207,999999,0,0,6418.76,35,35,0,20160704]
[null,1,"T03823","TECNICO SUPERIOR","P",2,3,85,7,201207,999999,0,0,1228.76,35,35,0,20160704]
[null,1,"T03823","TECNICO SUPERIOR","P",2,4,85,7,201207,999999,0,0,200,35,35,0,20160704]
[null,1,"T03823","TECNICO SUPERIOR","P",2,9,85,7,201207,999999,0,0,465,35,35,0,20160704]
[null,1,"T03823","TECNICO SUPERIOR","P",2,11,85,7,201207,999999,0,0,415,35,35,0,20160704]
[null,1,"T03823","TECNICO SUPERIOR","P",2,14,85,7,201207,999999,0,0,385,35,35,0,20160704]
[null,1,"T03823","TECNICO SUPERIOR","P",2,15,85,7,201207,999999,0,0,427.92,35,35,0,20160704]
[null,1,"T03823","TECNICO SUPERIOR","P",2,20,85,7,201207,999999,0,0,1300,35,35,0,20160704]
[null,1,"T03823","TECNICO SUPERIOR","P",2,50,85,7,201207,999999,0,0,955.38,35,35,0,20160704]
[null,1,"T03823","TECNICO SUPERIOR","P",2,63,85,7,201207,999999,0,0,738.16,35,35,0,20160704]
[null,1,"T03823","TECNICO SUPERIOR","P",2,68,85,7,201207,999999,0,0,823.04,35,35,0,20160704]
[null,1,"CF12814","ESP. EN TELEINFORMATICA","P",2,1,86,7,201207,999999,0,0,6418.76,35,35,0,20160704]
[null,1,"CF12814","ESP. EN TELEINFORMATICA","P",2,2,86,7,201207,999999,0,0,415,35,35,0,20160704]
[null,1,"CF12814","ESP. EN TELEINFORMATICA","P",2,3,86,7,201207,999999,0,0,1228.76,35,35,0,20160704]
[null,1,"CF12814","ESP. EN TELEINFORMATICA","P",2,9,86,7,201207,999999,0,0,465,35,35,0,20160704]
[null,1,"CF12814","ESP. EN TELEINFORMATICA","P",2,12,86,7,201207,999999,0,0,385,35,35,0,20160704]
[null,1,"CF12814","ESP. EN TELEINFORMATICA","P",2,20,86,7,201207,999999,0,0,1300,35,35,0,20160704]
[null,1,"CF33849","COORD. DE SERVICIOS ESP.","P",2,1,88,8,201207,999999,0,0,6495.06,35,35,0,20160704]
[null,1,"CF33849","COORD. DE SERVICIOS ESP.","P",2,2,88,8,201207,999999,0,0,415,35,35,0,20160704]
[null,1,"CF33849","COORD. DE SERVICIOS ESP.","P",2,3,88,8,201207,999999,0,0,1737.16,35,35,0,20160704]
[null,1,"CF33849","COORD. DE SERVICIOS ESP.","P",2,9,88,8,201207,999999,0,0,465,35,35,0,20160704]
[null,1,"CF33849","COORD. DE SERVICIOS ESP.","P",2,12,88,8,201207,999999,0,0,385,35,35,0,20160704]
[null,1,"CF33849","COORD. DE SERVICIOS ESP.","P",2,20,88,8,201207,999999,0,0,1300,35,35,0,20160704]
[null,1,"CF33849","COORD. DE SERVICIOS ESP.","P",2,106,88,8,201207,999999,0,0,175,35,35,0,20160704]
[null,1,"CF36014","COORDINADOR DE ZONA","P",5,1,"OA1",92,201207,999999,0,0,4190.88,40,40,0,20160704]
[null,1,"CF36014","COORDINADOR DE ZONA","P",5,8,"OA1",92,201207,999999,0,0,17962.400000000001,40,40,0,20160704]
[null,1,"CF36014","COORDINADOR DE ZONA","P",5,9,"OA1",92,201207,999999,0,0,365,40,40,0,20160704]
[null,1,"CF36014","COORDINADOR DE ZONA","P",5,106,"OA1",92,201207,999999,0,0,200,40,40,0,20160704]
[null,1,"CF36014","COORDINADOR DE ZONA","P",5,1,"OA1",92,201207,999999,0,0,4328.8599999999997,40,40,0,20160704]
[null,1,"CF36014","COORDINADOR DE ZONA","P",5,8,"OA1",92,201207,999999,0,0,17824.46,40,40,0,20160704]
[null,1,"CF36014","COORDINADOR DE ZONA","P",5,9,"OA1",92,201207,999999,0,0,365,40,40,0,20160704]
[null,1,"CF36014","COORDINADOR DE ZONA","P",5,106,"OA1",92,201207,999999,0,0,175,40,40,0,20160704]
[null,1,"CF36014","COORDINADOR DE ZONA","P",5,1,"OA1",92,201207,999999,0,0,4190.88,40,40,0,20160704]
[null,1,"CF36014","COORDINADOR DE ZONA","P",5,8,"OA1",92,201207,999999,0,0,17962.400000000001,40,40,0,20160704]
[null,1,"CF36014","COORDINADOR DE ZONA","P",5,9,"OA1",92,201207,999999,0,0,365,40,40,0,20160704]
[null,1,"CF36014","COORDINADOR DE ZONA","P",5,106,"OA1",92,201207,999999,0,0,225,40,40,0,20160704]
[null,1,"CF36014","COORDINADOR DE ZONA","P",5,1,"OA1",92,201207,999999,0,0,4190.88,40,40,0,20160704]
[null,1,"CF36014","COORDINADOR DE ZONA","P",5,8,"OA1",92,201207,999999,0,0,16764.900000000001,40,40,0,20160704]
[null,1,"CF36014","COORDINADOR DE ZONA","P",5,9,"OA1",92,201207,999999,0,0,365,40,40,0,20160704]
[null,1,"CF36014","COORDINADOR DE ZONA","P",5,106,"OA1",92,201207,999999,0,0,100,40,40,0,20160704]
[null,1,"CF36014","COORDINADOR DE ZONA","P",5,1,"OA1",92,201207,999999,0,0,4190.88,40,40,0,20160704]
[null,1,"CF36014","COORDINADOR DE ZONA","P",5,8,"OA1",92,201207,999999,0,0,17962.400000000001,40,40,0,20160704]
[null,1,"CF36014","COORDINADOR DE ZONA","P",5,9,"OA1",92,201207,999999,0,0,365,40,40,0,20160704]
[null,1,"CF36014","COORDINADOR DE ZONA","P",5,1,"OA1",92,201207,999999,0,0,4190.88,40,40,0,20160704]
[null,1,"CF36014","COORDINADOR DE ZONA","P",5,8,"OA1",92,201207,999999,0,0,17962.400000000001,40,40,0,20160704]
[null,1,"CF36014","COORDINADOR DE ZONA","P",5,9,"OA1",92,201207,999999,0,0,365,40,40,0,20160704]
[null,1,"CF36014","COORDINADOR DE ZONA","P",5,1,"OA1",92,201207,999999,0,0,4190.88,40,40,0,20160704]
[null,1,"CF36014","COORDINADOR DE ZONA","P",5,8,"OA1",92,201207,999999,0,0,17962.400000000001,40,40,0,20160704]
[null,1,"CF36014","COORDINADOR DE ZONA","P",5,9,"OA1",92,201207,999999,0,0,365,40,40,0,20160704]
[null,1,"CF36014","COORDINADOR DE ZONA","P",5,1,"OA1",92,201207,999999,0,0,4190.88,40,40,0,20160704]
[null,1,"CF36014","COORDINADOR DE ZONA","P",5,8,"OA1",92,201207,999999,0,0,17962.400000000001,40,40,0,20160704]
[null,1,"CF36014","COORDINADOR DE ZONA","P",5,9,"OA1",92,201207,999999,0,0,365,40,40,0,20160704]
[null,1,"CF36014","COORDINADOR DE ZONA","P",5,1,"OA1",92,201207,999999,0,0,4190.88,40,40,0,20160704]
[null,1,"CF36014","COORDINADOR DE ZONA","P",5,8,"OA1",92,201207,999999,0,0,17962.400000000001,40,40,0,20160704]
[null,1,"CF36014","COORDINADOR DE ZONA","P",5,9,"OA1",92,201207,999999,0,0,365,40,40,0,20160704]
[null,1,"CF36014","COORDINADOR DE ZONA","P",5,1,"OA1",92,201207,999999,0,0,4190.88,40,40,0,20160704]
[null,1,"CF36014","COORDINADOR DE ZONA","P",5,8,"OA1",92,201207,999999,0,0,12855.36,40,40,0,20160704]
[null,1,"CF36014","COORDINADOR DE ZONA","P",5,9,"OA1",92,201207,999999,0,0,365,40,40,0,20160704]
[null,1,"CF36014","COORDINADOR DE ZONA","P",5,1,"OA1",92,201207,999999,0,0,4190.88,40,40,0,20160704]
[null,1,"CF36014","COORDINADOR DE ZONA","P",5,8,"OA1",92,201207,999999,0,0,17962.400000000001,40,40,0,20160704]
[null,1,"CF36014","COORDINADOR DE ZONA","P",5,9,"OA1",92,201207,999999,0,0,365,40,40,0,20160704]
[null,1,"CF36014","COORDINADOR DE ZONA","P",5,1,"OA1",92,201207,999999,0,0,4328.8599999999997,40,40,0,20160704]
[null,1,"CF36014","COORDINADOR DE ZONA","P",5,8,"OA1",92,201207,999999,0,0,17824.46,40,40,0,20160704]
[null,1,"CF36014","COORDINADOR DE ZONA","P",5,9,"OA1",92,201207,999999,0,0,365,40,40,0,20160704]
[null,1,"CF36014","COORDINADOR DE ZONA","P",5,1,"OA1",92,201207,999999,0,0,4328.8599999999997,40,40,0,20160704]
[null,1,"CF36014","COORDINADOR DE ZONA","P",5,8,"OA1",92,201207,999999,0,0,12717.38,40,40,0,20160704]
[null,1,"CF36014","COORDINADOR DE ZONA","P",5,9,"OA1",92,201207,999999,0,0,365,40,40,0,20160704]
[null,1,"CF01059","JEFE DE DEPARTAMENTO","P",5,1,"OA1",93,201207,999999,0,0,5164.5200000000004,40,40,0,20160704]
[null,1,"CF01059","JEFE DE DEPARTAMENTO","P",5,8,"OA1",93,201207,999999,0,0,20090.240000000002,40,40,0,20160704]
[null,1,"CF01059","JEFE DE DEPARTAMENTO","P",5,9,"OA1",93,201207,999999,0,0,365,40,40,0,20160704]
[null,1,"CF01059","JEFE DE DEPARTAMENTO","P",5,1,"OA1",93,201207,999999,0,0,5164.5,40,40,0,20160704]
[null,1,"CF01059","JEFE DE DEPARTAMENTO","P",5,8,"OA1",93,201207,999999,0,0,11881.74,40,40,0,20160704]
[null,1,"CF01059","JEFE DE DEPARTAMENTO","P",5,9,"OA1",93,201207,999999,0,0,365,40,40,0,20160704]
[null,1,"CF01059","JEFE DE DEPARTAMENTO","P",5,1,"OA1",93,201207,999999,0,0,5164.5,40,40,0,20160704]
[null,1,"CF01059","JEFE DE DEPARTAMENTO","P",5,8,"OA1",93,201207,999999,0,0,11881.74,40,40,0,20160704]
[null,1,"CF01059","JEFE DE DEPARTAMENTO","P",5,9,"OA1",93,201207,999999,0,0,365,40,40,0,20160704]
[null,1,"CF01059","JEFE DE DEPARTAMENTO","P",5,1,"OA1",93,201207,999999,0,0,5164.5200000000004,40,40,0,20160704]
[null,1,"CF01059","JEFE DE DEPARTAMENTO","P",5,8,"OA1",93,201207,999999,0,0,20090.240000000002,40,40,0,20160704]
[null,1,"CF01059","JEFE DE DEPARTAMENTO","P",5,9,"OA1",93,201207,999999,0,0,365,40,40,0,20160704]
[null,1,"CF01059","JEFE DE DEPARTAMENTO","P",5,1,"OA1",93,201207,999999,0,0,5164.5,40,40,0,20160704]
[null,1,"CF01059","JEFE DE DEPARTAMENTO","P",5,8,"OA1",93,201207,999999,0,0,11881.74,40,40,0,20160704]
[null,1,"CF01059","JEFE DE DEPARTAMENTO","P",5,9,"OA1",93,201207,999999,0,0,365,40,40,0,20160704]
[null,1,"CF36014","COORDINADOR REGIONAL","P",5,1,"OA1",95,201207,999999,0,0,5164.5,40,40,0,20160704]
[null,1,"CF36014","COORDINADOR REGIONAL","P",5,8,"OA1",95,201207,999999,0,0,11881.74,40,40,0,20160704]
[null,1,"CF36014","COORDINADOR REGIONAL","P",5,9,"OA1",95,201207,999999,0,0,365,40,40,0,20160704]
[null,1,"CF14070","DELEGADO","P",5,1,"MB2",97,201207,999999,0,0,14611.06,40,40,0,20160704]
[null,1,"CF14070","DELEGADO","P",5,8,"MB2",97,201207,999999,0,0,64194.38,40,40,0,20160704]
[null,1,"CF14070","DELEGADO","P",5,9,"MB2",97,201207,999999,0,0,365,40,40,0,20160704]
[null,null,null,null,null,null,null,null,null,null,"Total Zona A:",{"$f":"SUBTOTAL(109,Tabla16[Monto Mensual Jornada ó de HSM\nZona A])","v":0}]
[null,null,null,null,null,null,null,null,null,null,null,"Total Zona B:",{"$f":"SUM(M19:M223)","v":0}]
[null,null,null,null,null,null,null,null,null,null,null,null,"Total Zona C:",{"$f":"SUM(N19:N224)","v":662928.62000000023}]
[]
[null,"Fuente : Información proporcionada por las Entidades Federativas"]

{"sheet":"II D) 7 3","index":12,"n_rows":243,"n_cols":11,"rows_kept":243,"cut":false,"hidden":false,"merged":[[9,1,9,7],[8,9,8,10]]}
[]
[]
[]
[]
[]
[]
[]
[]
[null,"Formato: Catálogo de Percepciones y Deducciones",null,null,null,null,null,null,"Entidad Federativa:",{"$f":"IF('Caratula Resumen'!D21=\"Elige el Periodo…\",\"\",'Caratula Resumen'!D21)","v":" GUANAJUATO "}]
[null,{"$f":"IF('Caratula Resumen'!D22=\"Elige el Periodo…\",\"\",'Caratula Resumen'!D22)","v":"Fondo de Aportaciones para la Educación Tecnológica y de Adultos/Instituto Nacional para la Educación de los Adultos (FAETA/INEA)"},null,null,null,null,null,null,null,null,"2do. Trimestre 2016"]
[]
[]
[null,"Identificador origen presupuestal de la plaza","Tipo de concepto de pago ","Origen de financiamiento del concepto de percepciones.","Porcentaje de participación federal por fuente de recursos","Grupo al que pertenece concepto de pago (Percepción y/o Deducción)","Clave de concepto de pago","Descripción del concepto de pago ","Partida presupuestal","Fecha del","Fecha  al"]
[]
[null,"Identificador origen presupuestal de la plaza","Tipo de concepto de pago ","Origen de financiamiento del concepto de percepciones.","Porcentaje de participación federal por fuente de recursos","Grupo al que pertenece concepto de pago (Percepción y/o Deducción)","Clave de concepto de pago","Descripción del concepto de pago ","Partida presupuestal","Fecha del","Fecha  al"]
[null,1,"P","F",100,"P2",1,"SUELDOS",83101,20160604,20160604]
[null,1,"P","F",100,"P2",2,"PREVISION SOCIAL MUL.CONF",83101,20160604,20160604]
[null,1,"P","F",100,"P2",3,"COMPENSACION GARANTIZADA",83101,20160604,20160604]
[null,1,"P","F",100,"P2",4,"COMP. POR ANTI.(QUINQ. B)",83101,20160604,20160604]
[null,1,"P","F",100,"P2",5,"PRIMA VACACIONAL",83101,20160604,20160604]
[null,1,"P","F",100,"P2",6,"AGUINALDO",83101,20160604,20160604]
[null,1,"P","F",100,"P2",7,"COMPENSACION SEDENA",83101,20160604,20160604]
[null,1,"P","F",100,"P2",8,"COMPENSACION GARANT.",83101,20160604,20160604]
[null,1,"P","F",100,"P2",9,"DESPENSA",83101,20160604,20160604]
[null,1,"P","F",100,"P2",10,"OTRAS PRESTACIONES",83101,20160604,20160604]
[null,1,"P","F",100,"P2",11,"PREVISION SOCIAL MULTIPLE",83101,20160604,20160604]
[null,1,"P","F",100,"P2",12,"AYUDA PARA SERVICIOS",83101,20160604,20160604]
[null,1,"P","F",100,"P2",13,"BECAS",83101,20160604,20160604]
[null,1,"P","F",100,"P2",14,"AYUDA PARA SERVICIOS B",83101,20160604,20160604]
[null,1,"P","F",100,"P2",15,"DIAS DE PUNTUALIDAD",83101,20160604,20160604]
[null,1,"P","F",100,"P2",16,"HORARIO DISCONTINUO",83101,20160604,20160604]
[null,1,"P","F",100,"P2",17,"AYUDA DE GUARDERIA",83101,20160604,20160604]
[null,1,"P","F",100,"P2",18,"DIAS ECONOMICOS",83101,20160604,20160604]
[null,1,"P","F",100,"P2",19,"CREDITO AL SALARIO",83101,20160604,20160604]
[null,1,"P","F",100,"P2",20,"CAPACITACION Y DESARROLLO",83101,20160604,20160604]
[null,1,"P","F",100,"P2",21,"AYUDA PARA ANTEOJOS",83101,20160604,20160604]
[null,1,"P","F",100,"P2",22,"CREDITO SALARIO ANUAL",83101,20160604,20160604]
[null,1,"P","F",100,"P2",23,"SALARIO RETROACTIVO",83101,20160604,20160604]
[null,1,"P","F",100,"P2",24,"HOMOLOGACION",83101,20160604,20160604]
[null,1,"P","F",100,"P2",25,"CANASTA MATERNAL",83101,20160604,20160604]
[null,1,"P","F",100,"P2",26,"REMANENTE ESTIMULO",83101,20160604,20160604]
[null,1,"P","F",100,"P2",27,"COMPENSACION",83101,20160604,20160604]
[null,1,"P","F",100,"P2",28,"DEVOLUCION FONAC",83101,20160604,20160604]
[null,1,"P","F",100,"P2",29,"AYUDA PARA ANTEOJOS",83101,20160604,20160604]
[null,1,"P","F",100,"P2",30,"PARTE EXCENTA AGUINALDO",83101,20160604,20160604]
[null,1,"P","F",100,"P2",31,"PARTE EXCENTA PRIMA VAC.",83101,20160604,20160604]
[null,1,"P","F",100,"P2",32,"RECOMPENSA",83101,20160604,20160604]
[null,1,"P","F",100,"P2",33,"AYUDA POR DEFUNCION",83101,20160604,20160604]
[null,1,"P","F",100,"P2",34,"HORAS EXTRAORDINARIAS",83101,20160604,20160604]
[null,1,"P","F",100,"P2",35,"CAPACITACION Y DESARROLLO",83101,20160604,20160604]
[null,1,"P","F",100,"P2",36,"DEVOLUCION CREDINOMINA",83101,20160604,20160604]
[null,1,"P","F",100,"P2",37,"DEVOLUCION I.S.R.",83101,20160604,20160604]
[null,1,"P","F",100,"P2",38,"HORAS EXT. EXCENTAS",83101,20160604,20160604]
[null,1,"P","F",100,"P2",39,"DESPENSA MANDOS MEDIOS",83101,20160604,20160604]
[null,1,"P","F",100,"P2",40,"DIF.PROFES. B1 2004",83101,20160604,20160604]
[null,1,"P","F",100,"P2",41,"DIF.PROFES.B2 2004",83101,20160604,20160604]
[null,1,"P","F",100,"P2",42,"DIF.PROFES. C 2004",83101,20160604,20160604]
[null,1,"P","F",100,"P2",43,"DIF.COMP. POR ANTIGUEDAD",83101,20160604,20160604]
[null,1,"P","F",100,"P2",44,"DIF.PROFES. B1 2005",83101,20160604,20160604]
[null,1,"P","F",100,"P2",45,"DEVOLUCION DESPENSA",83101,20160604,20160604]
[null,1,"P","F",100,"P2",46,"DIF.PROFES. B2 2005",83101,20160604,20160604]
[null,1,"P","F",100,"P2",47,"DIF.PROFES. C 2005",83101,20160604,20160604]
[null,1,"P","F",100,"P2",48,"DIF.PROFES. C 2007",83101,20160604,20160604]
[null,1,"P","F",100,"P2",49,"DIF.PRI.ANT.07",83101,20160604,20160604]
[null,1,"P","F",100,"P2",50,"COMPENSACION POR ANTIGUED",83101,20160604,20160604]
[null,1,"P","F",100,"P2",51,"APARATOS ORTOPEDICOS",83101,20160604,20160604]
[null,1,"P","F",100,"P2",52,"AYUDA TITULACION",83101,20160604,20160604]
[null,1,"P","F",100,"P2",53,"RETROACTIVO QUINQUENIO",83101,20160604,20160604]
[null,1,"P","F",100,"P2",54,"APARATOS ORTOPEDICOS",83101,20160604,20160604]
[null,1,"P","F",100,"P2",55,"AYUDA TITULACION",83101,20160604,20160604]
[null,1,"P","F",100,"P2",56,"DIF.PRF.B107",83101,20160604,20160604]
[null,1,"P","F",100,"P2",57,"DIF.PER.SOC.MUL.07",83101,20160604,20160604]
[null,1,"P","F",100,"P2",58,"DIF. DIAS ECONOMICOS",83101,20160604,20160604]
[null,1,"P","F",100,"P2",59,"AGUINALDO EXCENTO",83101,20160604,20160604]
[null,1,"P","F",100,"P2",60,"GRATIFICACIﾓN POR RENUNCI",83101,20160604,20160604]
[null,1,"P","F",100,"P2",61,"PRIMA L.F.T.",83101,20160604,20160604]
[null,1,"P","F",100,"P2",62,"10. 15 Y 20 AﾑOS",83101,20160604,20160604]
[null,1,"P","F",100,"P2",63,"PROFESIONALIZACION B",83101,20160604,20160604]
[null,1,"P","F",100,"P2",64,"DIFERENCIA PENSION ALIMEN",83101,20160604,20160604]
[null,1,"P","F",100,"P2",65,"PROFESIONALIZACION  B2",83101,20160604,20160604]
[null,1,"P","F",100,"P2",66,"COMP.C.C.T.10.15 Y20 AﾑOS",83101,20160604,20160604]
[null,1,"P","F",100,"P2",67,"AYUDA DEFUNCION",83101,20160604,20160604]
[null,1,"P","F",100,"P2",68,"PROFESIONALIZACION C",83101,20160604,20160604]
[null,1,"P","F",100,"P2",69,"RETRO. PROF B 2008",83101,20160604,20160604]
[null,1,"P","F",100,"P2",70,"ESTIMULO PRODUCTIVIDAD",83101,20160604,20160604]
[null,1,"P","F",100,"P2",71,"VIATICOS",83101,20160604,20160604]
[null,1,"P","F",100,"P2",72,"DEVOLUCION PRES C.P.",83101,20160604,20160604]
[null,1,"P","F",100,"P2",73,"DEVOLUCION SEG. COL. RET",83101,20160604,20160604]
[null,1,"P","F",100,"P2",74,"DEVOLUCION SEG. SEG AHISA",83101,20160604,20160604]
[null,1,"P","F",100,"P2",75,"RETRO. PROF C 2008",83101,20160604,20160604]
[null,1,"P","F",100,"P2",76,"RETRO. CAP Y DES CONF",83101,20160604,20160604]
[null,1,"P","F",100,"P2",77,"RETRO. PRE. SOC. MUL. CF",83101,20160604,20160604]
[null,1,"P","F",100,"P2",78,"PRMA VAC. DIA ADICIONAL",83101,20160604,20160604]
[null,1,"P","F",100,"P2",79,"DIF.COMP.POR ANTI. 2008",83101,20160604,20160604]
[null,1,"P","F",100,"P2",80,"CUOTA SINDICAL FONAC",83101,20160604,20160604]
[null,1,"P","F",100,"P2",81,"DIF.COMP. POR ANT. 2009",83101,20160604,20160604]
[null,1,"P","F",100,"P2",82,"DIF. PROFB2. 2008",83101,20160604,20160604]
[null,1,"P","F",100,"P2",83,"DIAS POR AJUSTE ANUAL",83101,20160604,20160604]
[null,1,"P","F",100,"P2",84,"DEVOL.  ADEUDO POR PRESTA",83101,20160604,20160604]
[null,1,"P","F",100,"P2",85,"RETRO. CAN. ADIC. CONFIAN",83101,20160604,20160604]
[null,1,"P","F",100,"P2",86,"RETROACTIVO PROFB1 2009",83101,20160604,20160604]
[null,1,"P","F",100,"P2",87,"RETROACTIVO PROF.C 2009",83101,20160604,20160604]
[null,1,"P","F",100,"P2",88,"RETRO. C Y D 2008",83101,20160604,20160604]
[null,1,"P","F",100,"P2",89,"RETRO. C.ADIC 2008",83101,20160604,20160604]
[null,1,"P","F",100,"P2",90,"IMPUESTO ANUAL",83101,20160604,20160604]
[null,1,"P","F",100,"P2",91,"CANTIDAD POR UNICA VEZ",83101,20160604,20160604]
[null,1,"P","F",100,"P2",92,"PUNTUALIDAD PERFECTA",83101,20160604,20160604]
[null,1,"P","F",100,"P2",93,"RETRO. PSM 2008",83101,20160604,20160604]
[null,1,"P","F",100,"P2",94,"RETRO. DESP 2008",83101,20160604,20160604]
[null,1,"P","F",100,"P2",95,"DEVOLUCION POTECIACION",83101,20160604,20160604]
[null,1,"P","F",100,"P2",96,"DIF.PROFES. B1 2009",83101,20160604,20160604]
[null,1,"P","F",100,"P2",97,"DIF.PROFES. C 2009",83101,20160604,20160604]
[null,1,"P","F",100,"P2",98,"RETROACTIVO PROFB1",83101,20160604,20160604]
[null,1,"P","F",100,"P2",99,"RETROACTIVO PROFC",83101,20160604,20160604]
[null,1,"P","F",100,"P2",100,"PAGO EX. UNICO FSTSE-SHCP",83101,20160604,20160604]
[null,1,"P","F",100,"P2",101,"VALES DE DESPENSA",83101,20160604,20160604]
[null,1,"P","F",100,"P2",102,"VALES PRODUCTIVIDAD",83101,20160604,20160604]
[null,1,"P","F",100,"P2",103,"VALES BONO SEXENAL",83101,20160604,20160604]
[null,1,"P","F",100,"P2",104,"DEV. DIAS ECONOMINCOS",83101,20160604,20160604]
[null,1,"P","F",100,"P2",105,"PRIMA VACACIONAL MM",83101,20160604,20160604]
[null,1,"P","F",100,"P2",106,"QUINQUENIO C Y MM",83101,20160604,20160604]
[null,1,"P","F",100,"P2",107,"AJUSTE POR FALTAS",83101,20160604,20160604]
[null,1,"P","F",100,"P2",108,"RETROACTIVO QUINC Y MM",83101,20160604,20160604]
[null,1,"P","F",100,"P2",109,"LIQUIDACIONES",83101,20160604,20160604]
[null,1,"P","F",100,"P2",110,"DEVOLUCION AHORRO SOLIDAR",83101,20160604,20160604]
[null,1,"P","F",100,"P2",111,"DIA DE REYES",83101,20160604,20160604]
[null,1,"P","F",100,"P2",119,"SUBSIDIO PARA EL EMPLEO",83101,20160604,20160604]
[null,1,"P","F",100,"P2",120,"DIF.COM.GARN.2010 MM",83101,20160604,20160604]
[null,1,"P","F",100,"P2",121,"COMP.LENTES 2010 EXC",83101,20160604,20160604]
[null,1,"P","F",100,"P2",122,"COMP.LENTES 2010 GRAV",83101,20160604,20160604]
[null,1,"P","F",100,"P2",123,"DIFERENCIA DESPENSA 2010",83101,20160604,20160604]
[null,1,"P","F",100,"P2",124,"DIF PREV. SOLCIAL 2010",83101,20160604,20160604]
[null,1,"P","F",100,"P2",125,"DIF CANTIDAD ADIC. 2010",83101,20160604,20160604]
[null,1,"P","F",100,"P2",126,"DIF CANTIDAD ADIC. 2009",83101,20160604,20160604]
[null,1,"P","F",100,"P2",127,"DIF PREV. SOCIAL",83101,20160604,20160604]
[null,1,"P","F",100,"P2",128,"DIA DEL TRABAJOR DEL INEA",83101,20160604,20160604]
[null,1,"P","F",100,"P2",130,"VACACIONES",83101,20160604,20160604]
[null,1,"P","F",100,"P2",160,"GRATF. POR RENUNCIA GRAVA",83101,20160604,20160604]
[null,1,"P","F",100,"P2",161,"PRIMA L.F.T. GRAVADA",83101,20160604,20160604]
[null,1,"P","F",100,"P2",206,"AGUINALDO COMP.",83101,20160604,20160604]
[null,1,"P","F",100,"P2",400,"DIF. AYUDA POR SERV. B",83101,20160604,20160604]
[null,1,"P","F",100,"P2",401,"DIFERENCIA DE SUELDO",83101,20160604,20160604]
[null,1,"P","F",100,"P2",402,"DIV.ABRIL2005MAYO2006 POT",83101,20160604,20160604]
[null,1,"P","F",100,"P2",403,"DIF. COMPENSACION GARANTI",83101,20160604,20160604]
[null,1,"P","F",100,"P2",404,"DIVIDENDOS POTEN 2007",83101,20160604,20160604]
[null,1,"P","F",100,"P2",405,"DIF. PRIMA VACACIONAL",83101,20160604,20160604]
[null,1,"P","F",100,"P2",408,"DIF.COMP. GARANT.",83101,20160604,20160604]
[null,1,"P","F",100,"P2",409,"DIF DESPENSA",83101,20160604,20160604]
[null,1,"P","F",100,"P2",414,"DIF AYUDA SERVICIOS",83101,20160604,20160604]
[null,1,"P","F",100,"P2",415,"DIF. DIAS DE PUNTUALIDAD",83101,20160604,20160604]
[null,1,"P","F",100,"P2",418,"DIF. DIAS ECONOMICOS",83101,20160604,20160604]
[null,1,"P","F",100,"P2",420,"DIF CAPACITACION Y DESARR",83101,20160604,20160604]
[null,1,"P","F",100,"P2",450,"DIF COMP. POR ANTIG.",83101,20160604,20160604]
[null,1,"P","F",100,"P2",455,"DEVOLUCION FALTA",83101,20160604,20160604]
[null,1,"P","F",100,"P2",463,"RETROAC. PROFESIONALIZA",83101,20160604,20160604]
[null,1,"P","F",100,"P2",464,"DIF. PROF B1",83101,20160604,20160604]
[null,1,"P","F",100,"P2",466,"CONTINGENCIA LABORAL",83101,20160604,20160604]
[null,1,"P","F",100,"P2",467,"DEV. POR AYUDA EN DEFUNC",83101,20160604,20160604]
[null,1,"D",null,100,"D2",500,"SUSPENSIONES",83101,20160604,20160604]
[null,1,"D",null,100,"D2",501,"FALTAS",83101,20160604,20160604]
[null,1,"D",null,100,"D2",502,"COMPENSACION GARANT.",83101,20160604,20160604]
[null,1,"D",null,100,"D2",503,"HORARIO DISCONTINUO",83101,20160604,20160604]
[null,1,"D",null,100,"D2",504,"DONATIVOS",83101,20160604,20160604]
[null,1,"D",null,100,"D2",505,"CUOTA SINDICAL RETIRO",83101,20160604,20160604]
[null,1,"D",null,100,"D2",506,"AHORRO SOLIDARIO",83101,20160604,20160604]
[null,1,"D",null,100,"D2",507,"DEV. PREST. CAJA DE AHORR",83101,20160604,20160604]
[null,1,"D",null,100,"D2",508,"DEV. GUARDERIA",83101,20160604,20160604]
[null,1,"D",null,100,"D2",518,"DEV. DIAS ECONOMICOS",83101,20160604,20160604]
[null,1,"D",null,100,"D2",519,"DEV. QUINQUENIOS",83101,20160604,20160604]
[null,1,"D",null,100,"D2",520,"DEV. PRIM VAC",83101,20160604,20160604]
[null,1,"D",null,100,"D2",521,"DEV. DESPENSA",83101,20160604,20160604]
[null,1,"D",null,100,"D2",522,"DEV. AYUDA PARA SERV. B",83101,20160604,20160604]
[null,1,"D",null,100,"D2",523,"DEV. SUELDOS",83101,20160604,20160604]
[null,1,"D",null,100,"D2",524,"DEV. CAP. Y DES",83101,20160604,20160604]
[null,1,"D",null,100,"D2",525,"DEV. PREV. SOCIAL MULTIPL",83101,20160604,20160604]
[null,1,"D",null,100,"D2",526,"DEV. AYUDA PARA SERV.",83101,20160604,20160604]
[null,1,"D",null,100,"D2",529,"CREDITO DINAMO",83101,20160604,20160604]
[null,1,"D",null,100,"D2",530,"ISR",83101,20160604,20160604]
[null,1,"D",null,100,"D2",531,"DIFERENCIA ISR",83101,20160604,20160604]
[null,1,"D",null,100,"D2",532,"IMPUESTO ANUAL",83101,20160604,20160604]
[null,1,"D",null,100,"D2",533,"I.S.R.ESTIMULO 10 15 Y 20",83101,20160604,20160604]
[null,1,"D",null,100,"D2",534,"AJUSTE ESTIMULO 10 AﾑOS",83101,20160604,20160604]
[null,1,"D",null,100,"D2",535,"IMPUESTO AGUINALDO",83101,20160604,20160604]
[null,1,"D",null,100,"D2",536,"AJUSTE BONIFICACION",83101,20160604,20160604]
[null,1,"D",null,100,"D2",537,"CREDITO SALARIO ANUAL",83101,20160604,20160604]
[null,1,"D",null,100,"D2",538,"DEVOLUCION PUNTUALIDAD",83101,20160604,20160604]
[null,1,"D",null,100,"D2",539,"GASTOS FUNERARIOS",83101,20160604,20160604]
[null,1,"D",null,100,"D2",540,"SERV.MED/MAT.ISSSTE",83101,20160604,20160604]
[null,1,"D",null,100,"D2",541,"FONDO/PENSION ISSSTE",83101,20160604,20160604]
[null,1,"D",null,100,"D2",542,"PRESTAMO C.P. ISSSTE",83101,20160604,20160604]
[null,1,"D",null,100,"D2",543,"PRESTAMO COMPLEM. ISSSTE",83101,20160604,20160604]
[null,1,"D",null,100,"D2",544,"PRES. HIP. FOVISSSTE",83101,20160604,20160604]
[null,1,"D",null,100,"D2",545,"DIF. 8% ISSSTE",83101,20160604,20160604]
[null,1,"D",null,100,"D2",546,"DEVOLUCIONES VARIAS",83101,20160604,20160604]
[null,1,"D",null,100,"D2",547,"DEVOLUCION VIATICOS",83101,20160604,20160604]
[null,1,"D",null,100,"D2",548,"AYUDA CRUZ ROJA",83101,20160604,20160604]
[null,1,"D",null,100,"D2",549,"ADEUDO POR PRESTAMO",83101,20160604,20160604]
[null,1,"D",null,100,"D2",550,"CUOTA SINDICAL",83101,20160604,20160604]
[null,1,"D",null,100,"D2",551,"PENSION ALIMENTICIA",83101,20160604,20160604]
[null,1,"D",null,100,"D2",552,"DIFERENCIA ANTEOJOS",83101,20160604,20160604]
[null,1,"D",null,100,"D2",553,"DEVOLUCION ANTEOJOS",83101,20160604,20160604]
[null,1,"D",null,100,"D2",554,"DIF PENSION ALIMENTICIA",83101,20160604,20160604]
[null,1,"D",null,100,"D2",555,"DEV.CAN.ADIC.2010 T.S.T.D",83101,20160604,20160604]
[null,1,"D",null,100,"D2",556,"GTOS. FUNER. SAN RAFAEL",83101,20160604,20160604]
[null,1,"D",null,100,"D2",558,"AJUSTE POR AYUDA DE LENTE",83101,20160604,20160604]
[null,1,"D",null,100,"D2",560,"MULTISEGURO",83101,20160604,20160604]
[null,1,"D",null,100,"D2",561,"GPO.SEG. DIVERSOS",83101,20160604,20160604]
[null,1,"D",null,100,"D2",562,"SEG. VIDA IND AHISA",83101,20160604,20160604]
[null,1,"D",null,100,"D2",563,"SEGURO COL. DE RETIRO",83101,20160604,20160604]
[null,1,"D",null,100,"D2",564,"POT. SEGURO DE VIDA",83101,20160604,20160604]
[null,1,"D",null,100,"D2",565,"DEV. SEGURO CAP.",83101,20160604,20160604]
[null,1,"D",null,100,"D2",566,"CAJA DE AHORRO",83101,20160604,20160604]
[null,1,"D",null,100,"D2",567,"PRESTAMO CAJA DE AHORRO",83101,20160604,20160604]
[null,1,"D",null,100,"D2",569,"DEVOLUCION FONAC",83101,20160604,20160604]
[null,1,"D",null,100,"D2",570,"ANTICIPO DE SUELDO",83101,20160604,20160604]
[null,1,"D",null,100,"D2",571,"FONDO DE AHORRO CAP.",83101,20160604,20160604]
[null,1,"D",null,100,"D2",572,"CAJA DE AHORRO CUOTA",83101,20160604,20160604]
[null,1,"D",null,100,"D2",573,"PRESTAMO CAJA AHORROS",83101,20160604,20160604]
[null,1,"D",null,100,"D2",574,"FONACOT",83101,20160604,20160604]
[null,1,"D",null,100,"D2",575,"PAQUETE DEPORTIVO",83101,20160604,20160604]
[null,1,"D",null,100,"D2",576,"ANTICIPO ESTIMULO M.M.",83101,20160604,20160604]
[null,1,"D",null,100,"D2",577,"GASTOS MEDICOS MAYORES",83101,20160604,20160604]
[null,1,"D",null,100,"D2",578,"SEGUROS FOVISSSTE",83101,20160604,20160604]
[null,1,"D",null,100,"D2",579,"CREDITOS LIBERTAD",83101,20160604,20160604]
[null,1,"D",null,100,"D2",580,"CREDI-NOMINA ADIC.",83101,20160604,20160604]
[null,1,"D",null,100,"D2",581,"DEVOLUCION CREDINOMINA",83101,20160604,20160604]
[null,1,"D",null,100,"D2",582,"ACRENOMINA",83101,20160604,20160604]
[null,1,"D",null,100,"D2",583,"RETROACTIVO FONDO DE AHOR",83101,20160604,20160604]
[null,1,"D",null,100,"D2",584,"DIF. ACRENOMINA",83101,20160604,20160604]
[null,1,"D",null,100,"D2",585,"DEV. PRES. C.P.",83101,20160604,20160604]
[null,1,"D",null,100,"D2",586,"DEV. SEG.COL.RET.",83101,20160604,20160604]
[null,1,"D",null,100,"D2",587,"DEV. SEG. AHISA",83101,20160604,20160604]
[null,1,"D",null,100,"D2",588,"AYUDA DEFUNCION  A COMPAﾑ",83101,20160604,20160604]
[null,1,"D",null,100,"D2",589,"ADEUDO CAJA AHORRO",83101,20160604,20160604]
[null,1,"D",null,100,"D2",590,"DEV.DES MM 2010",83101,20160604,20160604]
[null,1,"D",null,100,"D2",591,"DEV. SUELDO MM 2010",83101,20160604,20160604]
[null,1,"D",null,100,"D2",594,"POT. SEGURO DE VIDA SURA",83101,20160604,20160604]
[null,1,"D",null,100,"D2",595,"ALIANZA LA MERCED",83101,20160604,20160604]
[null,1,"D",null,100,"D2",596,"OPTICA OPTIC COLOR",83101,20160604,20160604]
[null,1,"D",null,100,"D2",597,"OPTICA OPTIFOTO",83101,20160604,20160604]
[null,1,"D",null,100,"D2",600,"AJUSTE COMP. POR ANT.",83101,20160604,20160604]
[null,1,"D",null,100,"D2",801,"DIF. FALTAS",83101,20160604,20160604]
[null,"Fuente : Información proporcionada por las Entidades Federativas"]

{"sheet":"E)","index":13,"n_rows":26,"n_cols":8,"rows_kept":26,"cut":false,"hidden":false,"merged":[[9,1,9,5],[12,1,14,1],[12,2,14,2],[13,7,14,7],[12,3,14,3],[12,4,14,4],[12,5,12,7],[13,5,14,5],[13,6,14,6]]}
[]
[]
[]
[null,null,null,null,null,null,null,"2do. Trimestre 2016"]
[]
[]
[]
[]
[null,"Formato: Trabajadores que Cobran con RFC / CURP con Formato Incorrecto"]
[null,{"$f":"IF('Caratula Resumen'!D22=\"Elige el Periodo…\",\"\",'Caratula Resumen'!D22)","v":"Fondo de Aportaciones para la Educación Tecnológica y de Adultos/Instituto Nacional para la Educación de los Adultos (FAETA/INEA)"},null,null,null,null,null,"2do. Trimestre 2016"]
[]
[]
[null,"Entidad Federativa","RFC","CURP","NOMBRE TRABAJADOR","Motivo"]
[null,null,null,null,null,"Sin RFC o erroneo","RFC Sin Homoclave","Sin CURP o Erronea"]
[]
[]
[null,"Entidad Federativa","RFC","CURP","NOMBRE TRABAJADOR","Sin RFC o erroneo","RFC Sin Homoclave","Sin CURP o Erronea"]
[]
[]
[]
[]
[]
[null,"Total Personas : ",null,null,"Total Sin RFC o Erroneo:"]
[null,null,null,null,null,"Total RFC Sin Homoclave:"]
[null,null,null,null,null,null,"Total Sin CURP o Erroneo:"]
[null,"Fuente : Información proporcionada por las Entidades Federativas"]

{"sheet":"F) 1","index":14,"n_rows":26,"n_cols":19,"rows_kept":26,"cut":false,"hidden":false,"merged":[[9,1,9,6],[12,15,13,15],[12,16,13,16],[12,17,12,18],[12,1,13,1],[12,2,13,2],[12,3,13,3],[12,4,13,4],[12,5,13,5],[12,6,13,6],[12,7,13,7],[12,8,12,14]]}
[]
[]
[]
[]
[]
[]
[]
[]
[null,"Formato: Trabajadores con Doble Asignación Salarial en Municipios no Colindantes Geográficamente"]
[null,{"$f":"IF('Caratula Resumen'!D22=\"Elige el Periodo…\",\"\",'Caratula Resumen'!D22)","v":"Fondo de Aportaciones para la Educación Tecnológica y de Adultos/Instituto Nacional para la Educación de los Adultos (FAETA/INEA)"},null,null,null,null,null,null,null,null,null,null,null,null,null,null,null,null,"2do. Trimestre 2016"]
[]
[]
[null,"Entidad Federativa","Municipio","Localidad","RFC","CURP","Nombre del Trabajador","Clave integrada","Clave Presupuestal",null,null,null,null,null,null,"Clave CT","Nombre CT","Periodo en el CT"]
[null,null,null,null,null,null,null,null,"Partida Presupuestal","Código de Pago","Clave de Unidad","Clave de Sub Unidad","Clave de Categoría","Horas Semana Mes ","Número de Plaza",null,null,"Desde","Hasta"]
[]
[null,"Entidad Federativa","Municipio","Localidad","RFC","CURP","Nombre del Trabajador","Clave integrada","Partida Presupuestal","Código de Pago","Clave de Unidad","Clave de Sub Unidad","Clave de Categoría","Horas semana mes","Número de Plaza","Clave CT","Nombre CT","Periodo en el CT\nDesde","Periodo en el CTH\nasta"]
[]
[]
[]
[]
[]
[null,"Total Personas : ",null,null,null,null,null,null,null,null,null,null,"Total Plazas : "]
[]
[]
[null,"Fuente : Información proporcionada por las Entidades Federativas"]
[null,"Importante: Listar Sólo los Municipios no Colindantes"]

{"sheet":"F) 2","index":15,"n_rows":22,"n_cols":20,"rows_kept":22,"cut":false,"hidden":false,"merged":[[13,3,14,3],[13,4,14,4],[13,5,14,5],[10,1,10,9],[13,19,14,19],[13,18,14,18],[13,6,13,12],[13,13,14,13],[13,14,14,14],[13,15,14,15],[13,16,13,17],[13,1,14,1],[13,2,14,2]]}
[]
[]
[]
[]
[]
[]
[]
[]
[]
[null,"Formato: Trabajadores Ocupando Plazas que Superan el Número de Horas de Compatibilidad Autorizadas"]
[null,{"$f":"IF('Caratula Resumen'!D22=\"Elige el Periodo…\",\"\",'Caratula Resumen'!D22)","v":"Fondo de Aportaciones para la Educación Tecnológica y de Adultos/Instituto Nacional para la Educación de los Adultos (FAETA/INEA)"},null,null,null,null,null,null,null,null,null,null,null,null,null,null,null,"2do. Trimestre 2016"]
[]
[]
[null,"Entidad Federativa","RFC","CURP","Nombre","Clave integrada","Clave Presupuestal",null,null,null,null,null,null,"CT","Nombre CT","Turno CT","Periodo",null,"Total de Horas en el CT","Horas de compatibilidad de la categoría"]
[null,null,null,null,null,null,"Partida Presupuestal","Código de Pago","Clave de Unidad","Clave de Sub Unidad","Clave de Categoría","Horas Semana Mes ","Número de Plaza",null,null,null,"Desde","Hasta"]
[]
[null,"Entidad Federativa","RFC","CURP","Nombre","Clave integrada","Partida Presupuestal","Código de Pago","Clave de Unidad","Clave de Sub Unidad","Clave de Categoría","Horas semana mes","Número de plaza","CT","Nombre CT","Turno CT","Periodo\nDesde","Periodo\nHasta","Total de Horas en el CT","Horas de compatibilidad de la categoría"]
[null,"GUANAJAUTO","GOGR650725KF1","GOGR650725HGTNRB02","ROBERTO GONZALEZ GARCIA","831011721T0382000.0",83101,1,7,41,"T03820",0,235,0,0,100,0,0,0,0]
[null,"Total Personas : ",1,null,null,null,null,null,null,null,"Total Plazas : ",null,1]
[]
[]
[null,"Fuente : Información proporcionada por las Entidades Federativas"]

{"sheet":"G)","index":16,"n_rows":27,"n_cols":20,"rows_kept":27,"cut":false,"hidden":false,"merged":[[13,19,14,19],[13,13,14,13],[13,14,14,14],[13,15,13,16],[13,17,14,17],[13,18,14,18],[10,1,10,8],[12,5,12,11],[13,1,14,1],[13,2,14,2],[13,3,14,3],[13,4,14,4],[13,5,14,5],[13,6,13,12]]}
[]
[]
[]
[]
[]
[]
[]
[]
[]
[null,"Formato: Trabajadores Cuyo Salario Básico Supere los Ingresos Promedio de un Docente en la Categoría más Alta del Tabulador Salarial Correspondiente a Cada Entidad"]
[null,{"$f":"IF('Caratula Resumen'!D22=\"Elige el Periodo…\",\"\",'Caratula Resumen'!D22)","v":"Fondo de Aportaciones para la Educación Tecnológica y de Adultos/Instituto Nacional para la Educación de los Adultos (FAETA/INEA)"},null,null,null,null,null,null,null,null,null,null,null,null,null,null,null,null,null,"2do. Trimestre 2016"]
[]
[]
[null,"Entidad Federativa","R.F.C.","CURP","Nombre","Clave integrada","Clave Presupuestal Integrada y Categoria aparte",null,null,null,null,null,null,"Clave CT Origen","Nombre CT","Periodo",null,"Monto de Remuneraciones Mensuales ","Monto de referencia","Diferencia\n(R-S)"]
[null,null,null,null,null,null,"Partida Presupuestal","Código de Pago","Clave de Unidad","Clave de Sub Unidad","Clave de Categoría","Horas Semana Mes ","Número de Plaza",null,null,"Desde","Hasta"]
[]
[null,"Entidad Federativa","R.F.C.","CURP","Nombre","Clave integrada","Partida Presupuestal","Código de Pago","Clave de Unidad","Clave de Sub Unidad","Clave de Categoría","Horas Semana Mes ","No. de plaza","CT","Nombre CT","Periodo\nDesde","Periodo\nHasta","Monto de Remuneraciones Mensuales ","Monto de referencia","Diferencia\n(R-S)"]
[]
[]
[]
[]
[]
[null,"Total Personas : ",null,null,null,null,null,null,null,null,null,null,null,null,"Total Remuneraciones Mensuales:"]
[]
[null,null,null,null,null,null,null,null,null,null,null,null,null,null,null,null,null,"Total Diferencia:"]
[]
[null,"Fuente : Información proporcionada por las Entidades Federativas"]

{"sheet":"Listas","index":17,"n_rows":42,"n_cols":8,"rows_kept":42,"cut":false,"hidden":true,"merged":[]}
[]
[]
[]
[null,"Elige un Fondo…"]
[null,"Fondo de Aportaciones para la Educación Básica y Normal (FAEB)"]
[null,"Fondo de Aportaciones para la Educación Tecnológica y de Adultos/Colegio Nacional de Educación Profesional Técnica (FAETA/CONALEP)"]
[null,"Fondo de Aportaciones para la Educación Tecnológica y de Adultos/Instituto Nacional para la Educación de los Adultos (FAETA/INEA)"]
[]
[]
[null,null,null,null,null,null,null,"Elige la Entidad Federativa…"]
[null,"Elige el Periodo…",null,null,null,null,null,"AGUASCALIENTES"]
[null,"1er. Trimestre",null,null,null,null,null,"BAJA CALIFORNIA"]
[null,"2do. Trimestre",null,null,null,null,null,"BAJA CALIFORNIA SUR"]
[null,"3er. Trimestre",null,null,null,null,null,"CAMPECHE"]
[null,"4to. Trimestre",null,null,null,null,null,"COAHUILA "]
[null,null,null,"Elige el Año…",null,null,null,"COLIMA "]
[null,null,null,2013,null,null,null,"CHIAPAS "]
[null,null,null,2014,null,null,null,"CHIHUAHUA "]
[null,null,null,2015,null,null,null,"DISTRITO FEDERAL"]
[null,null,null,2016,null,null,null," DURANGO "]
[null,null,null,2017,null,null,null," GUANAJUATO "]
[null,null,null,2018,null,null,null," GUERRERO "]
[null,null,null,null,null,null,null," HIDALGO"]
[null,null,null,null,null,null,null," JALISCO "]
[null,null,null,null,null,null,null," MEXICO "]
[null,null,null,null,null,null,null," MICHOACAN "]
[null,null,null,null,null,null,null," MORELOS "]
[null,null,null,null,null,null,null," NAYARIT "]
[null,null,null,null,null,null,null," NUEVO LEON"]
[null,null,null,null,null,null,null," OAXACA "]
[null,null,null,null,null,null,null," PUEBLA "]
[null,null,null,null,null,null,null," QUERETARO "]
[null,null,null,null,null,null,null," QUINTANA ROO"]
[null,null,null,null,null,null,null," SAN LUIS"]
[null,null,null,null,null,null,null," SINALOA "]
[null,null,null,null,null,null,null," SONORA "]
[null,null,null,null,null,null,null," TABASCO "]
[null,null,null,null,null,null,null," TAMAULIPAS "]
[null,null,null,null,null,null,null," TLAXCALA "]
[null,null,null,null,null,null,null," VERACRUZ"]
[null,null,null,null,null,null,null," YUCATÁN "]
[null,null,null,null,null,null,null," ZACATECAS "]